a1,a2,a3,a4,a5,h1,h2,h3,h4,h5,period,time,team,etype,assist,away,block,entered,home,left,num,opponent,outof,player,points,possession,reason,result,steal,type,x,y
Andres Nocioni,Beno Udrih,Carl Landry,Jason Thompson,Tyreke Evans,Derek Fisher,Lamar Odom,Pau Gasol,Ron Artest,Shannon Brown,1,12:00,OFF,jump ball,,Jason Thompson,,,Pau Gasol,,,,,,,Tyreke Evans,,,,,,
Andres Nocioni,Beno Udrih,Carl Landry,Jason Thompson,Tyreke Evans,Derek Fisher,Lamar Odom,Pau Gasol,Ron Artest,Shannon Brown,1,11:43,SAC,shot,,,,,,,,,,Carl Landry,2,,,made,,driving layup,25,6
Andres Nocioni,Beno Udrih,Carl Landry,Jason Thompson,Tyreke Evans,Derek Fisher,Lamar Odom,Pau Gasol,Ron Artest,Shannon Brown,1,11:27,LAL,shot,Pau Gasol,,,,,,,,,Ron Artest,2,,,made,,jump,26,21
Andres Nocioni,Beno Udrih,Carl Landry,Jason Thompson,Tyreke Evans,Derek Fisher,Lamar Odom,Pau Gasol,Ron Artest,Shannon Brown,1,11:00,SAC,shot,,,,,,,,,,Tyreke Evans,2,,,made,,floating jump,13,6
Andres Nocioni,Beno Udrih,Carl Landry,Jason Thompson,Tyreke Evans,Derek Fisher,Lamar Odom,Pau Gasol,Ron Artest,Shannon Brown,1,10:39,LAL,shot,Shannon Brown,,,,,,,,,Derek Fisher,2,,,made,,jump,38,20
Andres Nocioni,Beno Udrih,Carl Landry,Jason Thompson,Tyreke Evans,Derek Fisher,Lamar Odom,Pau Gasol,Ron Artest,Shannon Brown,1,10:24,SAC,shot,,,,,,,,,,Jason Thompson,,,,missed,,jump,26,26
Andres Nocioni,Beno Udrih,Carl Landry,Jason Thompson,Tyreke Evans,Derek Fisher,Lamar Odom,Pau Gasol,Ron Artest,Shannon Brown,1,10:23,LAL,rebound,,,,,,,,,,Pau Gasol,,,,,,def,,
Andres Nocioni,Beno Udrih,Carl Landry,Jason Thompson,Tyreke Evans,Derek Fisher,Lamar Odom,Pau Gasol,Ron Artest,Shannon Brown,1,10:15,LAL,shot,,,,,,,,,,Shannon Brown,,,,missed,,jump,30,26
Andres Nocioni,Beno Udrih,Carl Landry,Jason Thompson,Tyreke Evans,Derek Fisher,Lamar Odom,Pau Gasol,Ron Artest,Shannon Brown,1,10:14,SAC,rebound,,,,,,,,,,Jason Thompson,,,,,,def,,
Andres Nocioni,Beno Udrih,Carl Landry,Jason Thompson,Tyreke Evans,Derek Fisher,Lamar Odom,Pau Gasol,Ron Artest,Shannon Brown,1,10:00,SAC,shot,,,,,,,,,,Carl Landry,,,,missed,,jump,21,21
Andres Nocioni,Beno Udrih,Carl Landry,Jason Thompson,Tyreke Evans,Derek Fisher,Lamar Odom,Pau Gasol,Ron Artest,Shannon Brown,1,9:58,LAL,rebound,,,,,,,,,,,,,,,,,,
Andres Nocioni,Beno Udrih,Carl Landry,Jason Thompson,Tyreke Evans,Derek Fisher,Lamar Odom,Pau Gasol,Ron Artest,Shannon Brown,1,9:50,SAC,foul,,,,,,,,Ron Artest,,Andres Nocioni,,,,,,personal,,
Andres Nocioni,Beno Udrih,Carl Landry,Jason Thompson,Tyreke Evans,Derek Fisher,Lamar Odom,Pau Gasol,Ron Artest,Shannon Brown,1,9:41,LAL,shot,,,,,,,,,,Ron Artest,,,,missed,,layup,25,6
Andres Nocioni,Beno Udrih,Carl Landry,Jason Thompson,Tyreke Evans,Derek Fisher,Lamar Odom,Pau Gasol,Ron Artest,Shannon Brown,1,9:39,SAC,rebound,,,,,,,,,,Andres Nocioni,,,,,,def,,
Andres Nocioni,Beno Udrih,Carl Landry,Jason Thompson,Tyreke Evans,Derek Fisher,Lamar Odom,Pau Gasol,Ron Artest,Shannon Brown,1,9:34,LAL,foul,,,,,,,,Jason Thompson,,Lamar Odom,,,,,,shooting,,
Andres Nocioni,Beno Udrih,Carl Landry,Jason Thompson,Tyreke Evans,Derek Fisher,Lamar Odom,Pau Gasol,Ron Artest,Shannon Brown,1,9:34,SAC,free throw,,,,,,,1,,2,Jason Thompson,,,foul,made,,,,
Andres Nocioni,Beno Udrih,Carl Landry,Jason Thompson,Tyreke Evans,Derek Fisher,Lamar Odom,Pau Gasol,Ron Artest,Shannon Brown,1,9:34,SAC,free throw,,,,,,,2,,2,Jason Thompson,,,foul,made,,,,
Andres Nocioni,Beno Udrih,Carl Landry,Jason Thompson,Tyreke Evans,Derek Fisher,Lamar Odom,Pau Gasol,Ron Artest,Shannon Brown,1,9:11,LAL,shot,Ron Artest,,,,,,,,,Pau Gasol,2,,,made,,jump,10,11
Andres Nocioni,Beno Udrih,Carl Landry,Jason Thompson,Tyreke Evans,Derek Fisher,Lamar Odom,Pau Gasol,Ron Artest,Shannon Brown,1,8:54,SAC,turnover,,,,,,,,,,Andres Nocioni,,,palming turnover,,,,,
Andres Nocioni,Beno Udrih,Carl Landry,Jason Thompson,Tyreke Evans,Derek Fisher,Lamar Odom,Pau Gasol,Ron Artest,Shannon Brown,1,8:41,LAL,shot,,,,,,,,,,Pau Gasol,,,,missed,,hook,31,8
Andres Nocioni,Beno Udrih,Carl Landry,Jason Thompson,Tyreke Evans,Derek Fisher,Lamar Odom,Pau Gasol,Ron Artest,Shannon Brown,1,8:39,SAC,rebound,,,,,,,,,,Jason Thompson,,,,,,def,,
Andres Nocioni,Beno Udrih,Carl Landry,Jason Thompson,Tyreke Evans,Derek Fisher,Lamar Odom,Pau Gasol,Ron Artest,Shannon Brown,1,8:31,SAC,shot,,,,,,,,,,Tyreke Evans,,,,missed,,jump,22,24
Andres Nocioni,Beno Udrih,Carl Landry,Jason Thompson,Tyreke Evans,Derek Fisher,Lamar Odom,Pau Gasol,Ron Artest,Shannon Brown,1,8:30,LAL,rebound,,,,,,,,,,Pau Gasol,,,,,,def,,
Andres Nocioni,Beno Udrih,Carl Landry,Jason Thompson,Tyreke Evans,Derek Fisher,Lamar Odom,Pau Gasol,Ron Artest,Shannon Brown,1,8:20,LAL,turnover,,,,,,,,,,Lamar Odom,,,bad pass,,Jason Thompson,,,
Andres Nocioni,Beno Udrih,Carl Landry,Jason Thompson,Tyreke Evans,Derek Fisher,Lamar Odom,Pau Gasol,Ron Artest,Shannon Brown,1,8:11,SAC,shot,Jason Thompson,,,,,,,,,Beno Udrih,2,,,made,,layup,25,6
Andres Nocioni,Beno Udrih,Carl Landry,Jason Thompson,Tyreke Evans,Derek Fisher,Lamar Odom,Pau Gasol,Ron Artest,Shannon Brown,1,7:51,LAL,shot,,,,,,,,,,Shannon Brown,,,,missed,,jump,39,20
Andres Nocioni,Beno Udrih,Carl Landry,Jason Thompson,Tyreke Evans,Derek Fisher,Lamar Odom,Pau Gasol,Ron Artest,Shannon Brown,1,7:50,LAL,rebound,,,,,,,,,,Pau Gasol,,,,,,off,,
Andres Nocioni,Beno Udrih,Carl Landry,Jason Thompson,Tyreke Evans,Derek Fisher,Lamar Odom,Pau Gasol,Ron Artest,Shannon Brown,1,7:30,LAL,turnover,,,,,,,,,,Pau Gasol,,,bad pass,,Andres Nocioni,,,
Andres Nocioni,Beno Udrih,Carl Landry,Jason Thompson,Tyreke Evans,Derek Fisher,Lamar Odom,Pau Gasol,Ron Artest,Shannon Brown,1,7:21,SAC,shot,,,,,,,,,,Beno Udrih,,,,missed,,3pt,3,19
Andres Nocioni,Beno Udrih,Carl Landry,Jason Thompson,Tyreke Evans,Derek Fisher,Lamar Odom,Pau Gasol,Ron Artest,Shannon Brown,1,7:20,SAC,rebound,,,,,,,,,,Jason Thompson,,,,,,off,,
Andres Nocioni,Beno Udrih,Carl Landry,Jason Thompson,Tyreke Evans,Derek Fisher,Lamar Odom,Pau Gasol,Ron Artest,Shannon Brown,1,7:14,SAC,shot,Jason Thompson,,,,,,,,,Tyreke Evans,2,,,made,,driving layup,25,6
Andres Nocioni,Beno Udrih,Carl Landry,Jason Thompson,Tyreke Evans,Derek Fisher,Lamar Odom,Pau Gasol,Ron Artest,Shannon Brown,1,7:02,LAL,turnover,,,,,,,,,,Ron Artest,,,lost ball,,Beno Udrih,,,
Andres Nocioni,Beno Udrih,Carl Landry,Jason Thompson,Tyreke Evans,Derek Fisher,Lamar Odom,Pau Gasol,Ron Artest,Shannon Brown,1,6:59,SAC,turnover,,,,,,,,,,Carl Landry,,,traveling,,,,,
Andres Nocioni,Beno Udrih,Carl Landry,Jason Thompson,Tyreke Evans,Derek Fisher,Lamar Odom,Pau Gasol,Ron Artest,Shannon Brown,1,6:45,LAL,shot,,,,,,,,,,Shannon Brown,2,,,made,,driving dunk,25,6
Andres Nocioni,Beno Udrih,Carl Landry,Jason Thompson,Tyreke Evans,Derek Fisher,Lamar Odom,Pau Gasol,Ron Artest,Shannon Brown,1,6:29,SAC,shot,Beno Udrih,,,,,,,,,Andres Nocioni,2,,,made,,running hook,25,8
Andres Nocioni,Beno Udrih,Carl Landry,Jason Thompson,Tyreke Evans,Derek Fisher,Lamar Odom,Pau Gasol,Ron Artest,Shannon Brown,1,6:13,LAL,turnover,,,,,,,,,,Derek Fisher,,,bad pass,,Carl Landry,,,
Andres Nocioni,Beno Udrih,Carl Landry,Jason Thompson,Tyreke Evans,Derek Fisher,Lamar Odom,Pau Gasol,Ron Artest,Shannon Brown,1,6:07,SAC,shot,,,,,,,,,,Beno Udrih,,,,missed,,layup,25,6
Andres Nocioni,Beno Udrih,Carl Landry,Jason Thompson,Tyreke Evans,Derek Fisher,Lamar Odom,Pau Gasol,Ron Artest,Shannon Brown,1,6:07,SAC,rebound,,,,,,,,,,Jason Thompson,,,,,,off,,
Andres Nocioni,Beno Udrih,Carl Landry,Jason Thompson,Tyreke Evans,Derek Fisher,Lamar Odom,Pau Gasol,Ron Artest,Shannon Brown,1,6:04,SAC,shot,,,,,,,,,,Jason Thompson,2,,,made,,putback layup,25,6
Andres Nocioni,Beno Udrih,Carl Landry,Jason Thompson,Tyreke Evans,Derek Fisher,Lamar Odom,Pau Gasol,Ron Artest,Shannon Brown,1,5:47,LAL,shot,Shannon Brown,,,,,,,,,Pau Gasol,2,,,made,,hook,26,11
Andres Nocioni,Beno Udrih,Carl Landry,Jason Thompson,Tyreke Evans,Derek Fisher,Lamar Odom,Pau Gasol,Ron Artest,Shannon Brown,1,5:28,SAC,shot,,,,,,,,,,Andres Nocioni,,,,missed,,jump,36,20
Andres Nocioni,Beno Udrih,Carl Landry,Jason Thompson,Tyreke Evans,Derek Fisher,Lamar Odom,Pau Gasol,Ron Artest,Shannon Brown,1,5:27,LAL,rebound,,,,,,,,,,Lamar Odom,,,,,,def,,
Andres Nocioni,Beno Udrih,Carl Landry,Jason Thompson,Tyreke Evans,Derek Fisher,Lamar Odom,Pau Gasol,Ron Artest,Shannon Brown,1,5:22,LAL,turnover,,,,,,,,,,Lamar Odom,,,bad pass,,Tyreke Evans,,,
Andres Nocioni,Beno Udrih,Carl Landry,Jason Thompson,Tyreke Evans,Derek Fisher,Lamar Odom,Pau Gasol,Ron Artest,Shannon Brown,1,5:15,SAC,shot,Tyreke Evans,,,,,,,,,Jason Thompson,2,,,made,,slam dunk,25,6
Andres Nocioni,Beno Udrih,Carl Landry,Jason Thompson,Tyreke Evans,Derek Fisher,Lamar Odom,Pau Gasol,Ron Artest,Shannon Brown,1,4:57,LAL,shot,Derek Fisher,,,,,,,,,Pau Gasol,2,,,made,,dunk,25,6
Andres Nocioni,Beno Udrih,Carl Landry,Jason Thompson,Tyreke Evans,Derek Fisher,Lamar Odom,Pau Gasol,Ron Artest,Shannon Brown,1,4:36,SAC,turnover,,,,,,,,,,Carl Landry,,,traveling,,,,,
Andres Nocioni,Beno Udrih,Carl Landry,Jason Thompson,Tyreke Evans,Derek Fisher,Lamar Odom,Pau Gasol,Ron Artest,Shannon Brown,1,4:36,LAL,timeout,,,,,,,,,,,,,,,,regular,,
Beno Udrih,Carl Landry,Jason Thompson,Omri Casspi,Tyreke Evans,Derek Fisher,Lamar Odom,Pau Gasol,Ron Artest,Shannon Brown,1,4:36,SAC,sub,,,,Omri Casspi,,Andres Nocioni,,,,,,,,,,,,
Beno Udrih,Carl Landry,Jason Thompson,Omri Casspi,Tyreke Evans,Derek Fisher,Lamar Odom,Pau Gasol,Ron Artest,Shannon Brown,1,4:26,LAL,shot,,,,,,,,,,Derek Fisher,2,,,made,,pullup jump,40,18
Beno Udrih,Carl Landry,Jason Thompson,Omri Casspi,Tyreke Evans,Derek Fisher,Lamar Odom,Pau Gasol,Ron Artest,Shannon Brown,1,4:12,SAC,shot,Beno Udrih,,,,,,,,,Jason Thompson,2,,,made,,jump,41,20
Beno Udrih,Carl Landry,Jason Thompson,Omri Casspi,Tyreke Evans,Derek Fisher,Lamar Odom,Pau Gasol,Ron Artest,Shannon Brown,1,3:52,LAL,shot,,,,,,,,,,Shannon Brown,2,,,made,,jump bank,31,13
Beno Udrih,Carl Landry,Jason Thompson,Omri Casspi,Tyreke Evans,Derek Fisher,Lamar Odom,Pau Gasol,Ron Artest,Shannon Brown,1,3:31,SAC,shot,Omri Casspi,,,,,,,,,Jason Thompson,2,,,made,,jump,39,7
Beno Udrih,Carl Landry,Jason Thompson,Omri Casspi,Tyreke Evans,Derek Fisher,Lamar Odom,Pau Gasol,Ron Artest,Shannon Brown,1,3:14,LAL,shot,Lamar Odom,,,,,,,,,Pau Gasol,2,,,made,,layup,25,6
Beno Udrih,Carl Landry,Jason Thompson,Omri Casspi,Tyreke Evans,Derek Fisher,Lamar Odom,Pau Gasol,Ron Artest,Shannon Brown,1,2:55,SAC,shot,,,,,,,,,,Carl Landry,,,,missed,,jump,29,10
Beno Udrih,Carl Landry,Jason Thompson,Omri Casspi,Tyreke Evans,Derek Fisher,Lamar Odom,Pau Gasol,Ron Artest,Shannon Brown,1,2:53,LAL,rebound,,,,,,,,,,Lamar Odom,,,,,,def,,
Beno Udrih,Carl Landry,Jason Thompson,Omri Casspi,Tyreke Evans,Derek Fisher,Lamar Odom,Pau Gasol,Ron Artest,Shannon Brown,1,2:52,LAL,shot,Lamar Odom,,,,,,,,,Shannon Brown,2,,,made,,running layup,25,6
Beno Udrih,Carl Landry,Jason Thompson,Omri Casspi,Tyreke Evans,Derek Fisher,Lamar Odom,Pau Gasol,Ron Artest,Shannon Brown,1,2:52,SAC,foul,,,,,,,,Shannon Brown,,Tyreke Evans,,,,,,shooting,,
Beno Udrih,Carl Landry,Jason Thompson,Omri Casspi,Tyreke Evans,Derek Fisher,Lamar Odom,Pau Gasol,Ron Artest,Shannon Brown,1,2:52,SAC,timeout,,,,,,,,,,,,,,,,regular,,
Beno Udrih,Donte Greene,Jason Thompson,Omri Casspi,Tyreke Evans,Derek Fisher,Lamar Odom,Pau Gasol,Ron Artest,Shannon Brown,1,2:52,SAC,sub,,,,Donte Greene,,Carl Landry,,,,,,,,,,,,
Donte Greene,Francisco Garcia,Jason Thompson,Omri Casspi,Tyreke Evans,Derek Fisher,Lamar Odom,Pau Gasol,Ron Artest,Shannon Brown,1,2:52,SAC,sub,,,,Francisco Garcia,,Beno Udrih,,,,,,,,,,,,
Donte Greene,Francisco Garcia,Jason Thompson,Omri Casspi,Tyreke Evans,Derek Fisher,Jordan Farmar,Lamar Odom,Pau Gasol,Shannon Brown,1,2:52,LAL,sub,,,,Jordan Farmar,,Ron Artest,,,,,,,,,,,,
Donte Greene,Francisco Garcia,Jason Thompson,Omri Casspi,Tyreke Evans,Jordan Farmar,Lamar Odom,Pau Gasol,Sasha Vujacic,Shannon Brown,1,2:52,LAL,sub,,,,Sasha Vujacic,,Derek Fisher,,,,,,,,,,,,
Donte Greene,Francisco Garcia,Jason Thompson,Omri Casspi,Tyreke Evans,Jordan Farmar,Lamar Odom,Pau Gasol,Sasha Vujacic,Shannon Brown,1,2:52,LAL,free throw,,,,,,,1,,1,Shannon Brown,,,foul,made,,,,
Donte Greene,Francisco Garcia,Jason Thompson,Omri Casspi,Tyreke Evans,Jordan Farmar,Lamar Odom,Pau Gasol,Sasha Vujacic,Shannon Brown,1,2:34,SAC,shot,,,,,,,,,,Omri Casspi,2,,,made,,jump,16,23
Donte Greene,Francisco Garcia,Jason Thompson,Omri Casspi,Tyreke Evans,Jordan Farmar,Lamar Odom,Pau Gasol,Sasha Vujacic,Shannon Brown,1,2:21,LAL,shot,,,,,,,,,,Sasha Vujacic,,,,missed,,3pt,42,25
Donte Greene,Francisco Garcia,Jason Thompson,Omri Casspi,Tyreke Evans,Jordan Farmar,Lamar Odom,Pau Gasol,Sasha Vujacic,Shannon Brown,1,2:20,SAC,rebound,,,,,,,,,,Francisco Garcia,,,,,,def,,
Donte Greene,Francisco Garcia,Jason Thompson,Omri Casspi,Tyreke Evans,Jordan Farmar,Lamar Odom,Pau Gasol,Sasha Vujacic,Shannon Brown,1,2:10,SAC,shot,,,,,,,,,,Francisco Garcia,,,,missed,,jump,9,22
Donte Greene,Francisco Garcia,Jason Thompson,Omri Casspi,Tyreke Evans,Jordan Farmar,Lamar Odom,Pau Gasol,Sasha Vujacic,Shannon Brown,1,2:09,SAC,rebound,,,,,,,,,,Omri Casspi,,,,,,off,,
Donte Greene,Francisco Garcia,Jason Thompson,Omri Casspi,Tyreke Evans,Jordan Farmar,Lamar Odom,Pau Gasol,Sasha Vujacic,Shannon Brown,1,1:57,SAC,shot,,,,,,,,,,Donte Greene,,,,missed,,3pt,44,22
Donte Greene,Francisco Garcia,Jason Thompson,Omri Casspi,Tyreke Evans,Jordan Farmar,Lamar Odom,Pau Gasol,Sasha Vujacic,Shannon Brown,1,1:56,LAL,rebound,,,,,,,,,,Pau Gasol,,,,,,def,,
Donte Greene,Francisco Garcia,Jason Thompson,Omri Casspi,Tyreke Evans,Jordan Farmar,Lamar Odom,Pau Gasol,Sasha Vujacic,Shannon Brown,1,1:42,LAL,shot,,,,,,,,,,Pau Gasol,,,,missed,,jump,13,14
Donte Greene,Francisco Garcia,Jason Thompson,Omri Casspi,Tyreke Evans,Jordan Farmar,Lamar Odom,Pau Gasol,Sasha Vujacic,Shannon Brown,1,1:40,SAC,rebound,,,,,,,,,,Tyreke Evans,,,,,,def,,
Donte Greene,Francisco Garcia,Jason Thompson,Omri Casspi,Tyreke Evans,Jordan Farmar,Lamar Odom,Pau Gasol,Sasha Vujacic,Shannon Brown,1,1:30,SAC,shot,,,,,,,,,,Donte Greene,,,,missed,,jump,13,22
Donte Greene,Francisco Garcia,Jason Thompson,Omri Casspi,Tyreke Evans,Jordan Farmar,Lamar Odom,Pau Gasol,Sasha Vujacic,Shannon Brown,1,1:29,LAL,rebound,,,,,,,,,,Lamar Odom,,,,,,def,,
Donte Greene,Francisco Garcia,Jason Thompson,Omri Casspi,Tyreke Evans,Jordan Farmar,Lamar Odom,Pau Gasol,Sasha Vujacic,Shannon Brown,1,1:23,SAC,foul,,,,,,,,Lamar Odom,,Omri Casspi,,,,,,shooting,,
Donte Greene,Francisco Garcia,Jason Thompson,Omri Casspi,Tyreke Evans,Jordan Farmar,Lamar Odom,Pau Gasol,Sasha Vujacic,Shannon Brown,1,1:23,LAL,free throw,,,,,,,1,,2,Lamar Odom,,,foul,made,,,,
Donte Greene,Francisco Garcia,Jason Thompson,Omri Casspi,Tyreke Evans,D.J. Mbenga,Jordan Farmar,Lamar Odom,Sasha Vujacic,Shannon Brown,1,1:23,LAL,sub,,,,D.J. Mbenga,,Pau Gasol,,,,,,,,,,,,
Donte Greene,Francisco Garcia,Jason Thompson,Omri Casspi,Tyreke Evans,D.J. Mbenga,Jordan Farmar,Lamar Odom,Sasha Vujacic,Shannon Brown,1,1:23,LAL,free throw,,,,,,,2,,2,Lamar Odom,,,foul,missed,,,,
Donte Greene,Francisco Garcia,Jason Thompson,Omri Casspi,Tyreke Evans,D.J. Mbenga,Jordan Farmar,Lamar Odom,Sasha Vujacic,Shannon Brown,1,1:22,SAC,rebound,,,,,,,,,,Jason Thompson,,,,,,def,,
Donte Greene,Francisco Garcia,Jason Thompson,Omri Casspi,Tyreke Evans,D.J. Mbenga,Jordan Farmar,Lamar Odom,Sasha Vujacic,Shannon Brown,1,1:08,LAL,foul,,,,,,,,Omri Casspi,,Sasha Vujacic,,,,,,personal,,
Donte Greene,Francisco Garcia,Jason Thompson,Omri Casspi,Tyreke Evans,D.J. Mbenga,Jordan Farmar,Lamar Odom,Sasha Vujacic,Shannon Brown,1,1:03,SAC,shot,,,,,,,,,,Francisco Garcia,2,,,made,,turnaround fade away,14,7
Donte Greene,Francisco Garcia,Jason Thompson,Omri Casspi,Tyreke Evans,D.J. Mbenga,Jordan Farmar,Lamar Odom,Sasha Vujacic,Shannon Brown,1,0:46,LAL,shot,,,,,,,,,,Jordan Farmar,,,,missed,,jump,6,6
Donte Greene,Francisco Garcia,Jason Thompson,Omri Casspi,Tyreke Evans,D.J. Mbenga,Jordan Farmar,Lamar Odom,Sasha Vujacic,Shannon Brown,1,0:45,SAC,rebound,,,,,,,,,,Jason Thompson,,,,,,def,,
Donte Greene,Francisco Garcia,Jason Thompson,Omri Casspi,Tyreke Evans,D.J. Mbenga,Jordan Farmar,Lamar Odom,Sasha Vujacic,Shannon Brown,1,0:42,SAC,shot,Tyreke Evans,,,,,,,,,Francisco Garcia,2,,,made,,running layup,25,6
Donte Greene,Francisco Garcia,Jason Thompson,Omri Casspi,Tyreke Evans,D.J. Mbenga,Jordan Farmar,Lamar Odom,Sasha Vujacic,Shannon Brown,1,0:35,SAC,foul,,,,,,,,Lamar Odom,,Tyreke Evans,,,,,,shooting,,
Donte Greene,Francisco Garcia,Jason Thompson,Omri Casspi,Tyreke Evans,D.J. Mbenga,Jordan Farmar,Lamar Odom,Sasha Vujacic,Shannon Brown,1,0:35,LAL,free throw,,,,,,,1,,2,Lamar Odom,,,foul,made,,,,
Donte Greene,Francisco Garcia,Jason Thompson,Omri Casspi,Tyreke Evans,D.J. Mbenga,Jordan Farmar,Lamar Odom,Sasha Vujacic,Shannon Brown,1,0:35,LAL,free throw,,,,,,,2,,2,Lamar Odom,,,foul,made,,,,
Donte Greene,Francisco Garcia,Jason Thompson,Omri Casspi,Tyreke Evans,D.J. Mbenga,Jordan Farmar,Lamar Odom,Sasha Vujacic,Shannon Brown,1,0:19,SAC,shot,,,Shannon Brown,,,,,,,Jason Thompson,,,,missed,,layup,25,6
Donte Greene,Francisco Garcia,Jason Thompson,Omri Casspi,Tyreke Evans,D.J. Mbenga,Jordan Farmar,Lamar Odom,Sasha Vujacic,Shannon Brown,1,0:18,LAL,rebound,,,,,,,,,,,,,,,,,,
Donte Greene,Francisco Garcia,Jason Thompson,Omri Casspi,Tyreke Evans,D.J. Mbenga,Jordan Farmar,Lamar Odom,Sasha Vujacic,Shannon Brown,1,0:18,SAC,foul,,,,,,,,Jordan Farmar,,Tyreke Evans,,,,,,personal,,
Donte Greene,Francisco Garcia,Jason Thompson,Omri Casspi,Tyreke Evans,D.J. Mbenga,Jordan Farmar,Lamar Odom,Sasha Vujacic,Shannon Brown,1,0:18,LAL,free throw,,,,,,,1,,2,Jordan Farmar,,,foul,missed,,,,
Donte Greene,Francisco Garcia,Jason Thompson,Omri Casspi,Tyreke Evans,D.J. Mbenga,Jordan Farmar,Lamar Odom,Sasha Vujacic,Shannon Brown,1,0:18,LAL,rebound,,,,,,,,,,,,,,,,,,
Donte Greene,Francisco Garcia,Jason Thompson,Omri Casspi,Tyreke Evans,D.J. Mbenga,Jordan Farmar,Ron Artest,Sasha Vujacic,Shannon Brown,1,0:18,LAL,sub,,,,Ron Artest,,Lamar Odom,,,,,,,,,,,,
Donte Greene,Francisco Garcia,Jason Thompson,Omri Casspi,Tyreke Evans,D.J. Mbenga,Jordan Farmar,Ron Artest,Sasha Vujacic,Shannon Brown,1,0:18,LAL,free throw,,,,,,,2,,2,Jordan Farmar,,,foul,made,,,,
Donte Greene,Francisco Garcia,Jason Thompson,Omri Casspi,Tyreke Evans,D.J. Mbenga,Jordan Farmar,Ron Artest,Sasha Vujacic,Shannon Brown,1,0:05,SAC,shot,,,,,,,,,,Francisco Garcia,2,,,made,,reverse layup,25,6
Donte Greene,Francisco Garcia,Jason Thompson,Omri Casspi,Tyreke Evans,D.J. Mbenga,Jordan Farmar,Ron Artest,Sasha Vujacic,Shannon Brown,1,0:01,LAL,shot,Jordan Farmar,,,,,,,,,Sasha Vujacic,3,,,made,,3pt,40,29
Beno Udrih,Donte Greene,Francisco Garcia,Jason Thompson,Omri Casspi,D.J. Mbenga,Jordan Farmar,Luke Walton,Ron Artest,Sasha Vujacic,2,11:46,LAL,shot,,,,,,,,,,Sasha Vujacic,,,,missed,,3pt,22,33
Beno Udrih,Donte Greene,Francisco Garcia,Jason Thompson,Omri Casspi,D.J. Mbenga,Jordan Farmar,Luke Walton,Ron Artest,Sasha Vujacic,2,11:45,SAC,rebound,,,,,,,,,,Donte Greene,,,,,,def,,
Beno Udrih,Donte Greene,Francisco Garcia,Jason Thompson,Omri Casspi,D.J. Mbenga,Jordan Farmar,Luke Walton,Ron Artest,Sasha Vujacic,2,11:33,SAC,shot,,,D.J. Mbenga,,,,,,,Jason Thompson,,,,missed,,layup,25,6
Beno Udrih,Donte Greene,Francisco Garcia,Jason Thompson,Omri Casspi,D.J. Mbenga,Jordan Farmar,Luke Walton,Ron Artest,Sasha Vujacic,2,11:33,SAC,rebound,,,,,,,,,,Jason Thompson,,,,,,off,,
Beno Udrih,Donte Greene,Francisco Garcia,Jason Thompson,Omri Casspi,D.J. Mbenga,Jordan Farmar,Luke Walton,Ron Artest,Sasha Vujacic,2,11:33,LAL,foul,,,,,,,,Jason Thompson,,D.J. Mbenga,,,,,,shooting,,
Beno Udrih,Donte Greene,Francisco Garcia,Jason Thompson,Omri Casspi,D.J. Mbenga,Jordan Farmar,Luke Walton,Ron Artest,Sasha Vujacic,2,11:33,SAC,free throw,,,,,,,1,,2,Jason Thompson,,,foul,missed,,,,
Beno Udrih,Donte Greene,Francisco Garcia,Jason Thompson,Omri Casspi,D.J. Mbenga,Jordan Farmar,Luke Walton,Ron Artest,Sasha Vujacic,2,11:33,SAC,rebound,,,,,,,,,,,,,,,,,,
Beno Udrih,Donte Greene,Francisco Garcia,Jason Thompson,Omri Casspi,D.J. Mbenga,Jordan Farmar,Luke Walton,Ron Artest,Sasha Vujacic,2,11:33,SAC,free throw,,,,,,,2,,2,Jason Thompson,,,foul,made,,,,
Beno Udrih,Donte Greene,Francisco Garcia,Jason Thompson,Omri Casspi,D.J. Mbenga,Jordan Farmar,Luke Walton,Ron Artest,Sasha Vujacic,2,11:25,LAL,shot,,,,,,,,,,Jordan Farmar,3,,,made,,3pt,9,28
Beno Udrih,Donte Greene,Francisco Garcia,Jason Thompson,Omri Casspi,D.J. Mbenga,Jordan Farmar,Luke Walton,Ron Artest,Sasha Vujacic,2,10:58,SAC,shot,Beno Udrih,,,,,,,,,Francisco Garcia,3,,,made,,3pt,2,6
Beno Udrih,Donte Greene,Francisco Garcia,Jason Thompson,Omri Casspi,D.J. Mbenga,Jordan Farmar,Luke Walton,Ron Artest,Sasha Vujacic,2,10:51,LAL,foul,,,,,,,,Beno Udrih,,D.J. Mbenga,,,,,,offensive,,
Beno Udrih,Donte Greene,Francisco Garcia,Jason Thompson,Omri Casspi,D.J. Mbenga,Jordan Farmar,Luke Walton,Ron Artest,Sasha Vujacic,2,10:51,LAL,turnover,,,,,,,,,,D.J. Mbenga,,,foul,,,,,
Beno Udrih,Donte Greene,Francisco Garcia,Jason Thompson,Omri Casspi,D.J. Mbenga,Jordan Farmar,Luke Walton,Ron Artest,Sasha Vujacic,2,10:29,SAC,shot,,,,,,,,,,Omri Casspi,,,,missed,,jump,41,18
Beno Udrih,Donte Greene,Francisco Garcia,Jason Thompson,Omri Casspi,D.J. Mbenga,Jordan Farmar,Luke Walton,Ron Artest,Sasha Vujacic,2,10:28,SAC,rebound,,,,,,,,,,Donte Greene,,,,,,off,,
Beno Udrih,Donte Greene,Francisco Garcia,Jason Thompson,Omri Casspi,D.J. Mbenga,Jordan Farmar,Luke Walton,Ron Artest,Sasha Vujacic,2,10:17,SAC,shot,,,,,,,,,,Beno Udrih,,,,missed,,driving reverse layup,25,6
Beno Udrih,Donte Greene,Francisco Garcia,Jason Thompson,Omri Casspi,D.J. Mbenga,Jordan Farmar,Luke Walton,Ron Artest,Sasha Vujacic,2,10:14,LAL,rebound,,,,,,,,,,Ron Artest,,,,,,def,,
Beno Udrih,Donte Greene,Francisco Garcia,Jason Thompson,Omri Casspi,D.J. Mbenga,Jordan Farmar,Luke Walton,Ron Artest,Sasha Vujacic,2,10:08,LAL,shot,,,,,,,,,,D.J. Mbenga,,,,missed,,layup,25,6
Beno Udrih,Donte Greene,Francisco Garcia,Jason Thompson,Omri Casspi,D.J. Mbenga,Jordan Farmar,Luke Walton,Ron Artest,Sasha Vujacic,2,10:07,SAC,rebound,,,,,,,,,,Jason Thompson,,,,,,def,,
Beno Udrih,Donte Greene,Francisco Garcia,Jason Thompson,Omri Casspi,D.J. Mbenga,Jordan Farmar,Luke Walton,Ron Artest,Sasha Vujacic,2,9:59,SAC,shot,Francisco Garcia,,,,,,,,,Omri Casspi,2,,,made,,jump,7,5
Beno Udrih,Donte Greene,Francisco Garcia,Jason Thompson,Omri Casspi,D.J. Mbenga,Jordan Farmar,Luke Walton,Ron Artest,Sasha Vujacic,2,9:48,LAL,shot,,,,,,,,,,Jordan Farmar,,,,missed,,reverse layup,25,6
Beno Udrih,Donte Greene,Francisco Garcia,Jason Thompson,Omri Casspi,D.J. Mbenga,Jordan Farmar,Luke Walton,Ron Artest,Sasha Vujacic,2,9:45,LAL,rebound,,,,,,,,,,D.J. Mbenga,,,,,,off,,
Beno Udrih,Donte Greene,Francisco Garcia,Jason Thompson,Omri Casspi,D.J. Mbenga,Jordan Farmar,Luke Walton,Ron Artest,Sasha Vujacic,2,9:45,LAL,shot,,,,,,,,,,D.J. Mbenga,2,,,made,,tip,25,6
Beno Udrih,Donte Greene,Francisco Garcia,Jason Thompson,Omri Casspi,D.J. Mbenga,Jordan Farmar,Luke Walton,Ron Artest,Sasha Vujacic,2,9:23,SAC,shot,,,,,,,,,,Jason Thompson,,,,missed,,jump,38,18
Beno Udrih,Donte Greene,Francisco Garcia,Jason Thompson,Omri Casspi,D.J. Mbenga,Jordan Farmar,Luke Walton,Ron Artest,Sasha Vujacic,2,9:21,SAC,rebound,,,,,,,,,,Omri Casspi,,,,,,off,,
Beno Udrih,Donte Greene,Francisco Garcia,Jason Thompson,Omri Casspi,D.J. Mbenga,Jordan Farmar,Luke Walton,Ron Artest,Sasha Vujacic,2,9:21,SAC,shot,,,,,,,,,,Omri Casspi,,,,missed,,tip,25,6
Beno Udrih,Donte Greene,Francisco Garcia,Jason Thompson,Omri Casspi,D.J. Mbenga,Jordan Farmar,Luke Walton,Ron Artest,Sasha Vujacic,2,9:19,LAL,rebound,,,,,,,,,,D.J. Mbenga,,,,,,def,,
Beno Udrih,Donte Greene,Francisco Garcia,Jason Thompson,Omri Casspi,D.J. Mbenga,Jordan Farmar,Luke Walton,Ron Artest,Sasha Vujacic,2,9:09,LAL,shot,,,,,,,,,,Ron Artest,,,,missed,,3pt,49,7
Beno Udrih,Donte Greene,Francisco Garcia,Jason Thompson,Omri Casspi,D.J. Mbenga,Jordan Farmar,Luke Walton,Ron Artest,Sasha Vujacic,2,9:06,LAL,rebound,,,,,,,,,,D.J. Mbenga,,,,,,off,,
Beno Udrih,Donte Greene,Francisco Garcia,Jason Thompson,Omri Casspi,D.J. Mbenga,Jordan Farmar,Luke Walton,Ron Artest,Sasha Vujacic,2,9:06,LAL,shot,,,,,,,,,,D.J. Mbenga,2,,,made,,putback layup,25,6