a1,a2,a3,a4,a5,h1,h2,h3,h4,h5,period,time,team,etype,assist,away,block,entered,home,left,num,opponent,outof,player,points,possession,reason,result,steal,type,x,y
Hasheem Thabeet,Mike Conley,O.J. Mayo,Rudy Gay,Zach Randolph,Dwight Howard,Jameer Nelson,Matt Barnes,Rashard Lewis,Vince Carter,1,12:00,OFF,jump ball,,Hasheem Thabeet,,,Dwight Howard,,,,,,,Jameer Nelson,,,,,,
Hasheem Thabeet,Mike Conley,O.J. Mayo,Rudy Gay,Zach Randolph,Dwight Howard,Jameer Nelson,Matt Barnes,Rashard Lewis,Vince Carter,1,11:44,ORL,shot,Vince Carter,,,,,,,,,Rashard Lewis,3,,,made,,3pt,38,27
Hasheem Thabeet,Mike Conley,O.J. Mayo,Rudy Gay,Zach Randolph,Dwight Howard,Jameer Nelson,Matt Barnes,Rashard Lewis,Vince Carter,1,11:44,MEM,foul,,,,,,,,Dwight Howard,,Hasheem Thabeet,,,,,,away from play,,
Hasheem Thabeet,Mike Conley,O.J. Mayo,Rudy Gay,Zach Randolph,Dwight Howard,Jameer Nelson,Matt Barnes,Rashard Lewis,Vince Carter,1,11:44,ORL,free throw,,,,,,,1,,1,Dwight Howard,,,foul,made,,,,
Hasheem Thabeet,Mike Conley,O.J. Mayo,Rudy Gay,Zach Randolph,Dwight Howard,Jameer Nelson,Matt Barnes,Rashard Lewis,Vince Carter,1,11:24,MEM,turnover,,,,,,,,,,Rudy Gay,,,bad pass,,Rashard Lewis,,,
Hasheem Thabeet,Mike Conley,O.J. Mayo,Rudy Gay,Zach Randolph,Dwight Howard,Jameer Nelson,Matt Barnes,Rashard Lewis,Vince Carter,1,11:17,ORL,shot,,,,,,,,,,Vince Carter,2,,,made,,driving layup,25,6
Hasheem Thabeet,Mike Conley,O.J. Mayo,Rudy Gay,Zach Randolph,Dwight Howard,Jameer Nelson,Matt Barnes,Rashard Lewis,Vince Carter,1,11:17,MEM,foul,,,,,,,,Vince Carter,,Rudy Gay,,,,,,shooting,,
Hasheem Thabeet,Mike Conley,O.J. Mayo,Rudy Gay,Zach Randolph,Dwight Howard,Jameer Nelson,Matt Barnes,Rashard Lewis,Vince Carter,1,11:17,ORL,free throw,,,,,,,1,,1,Vince Carter,,,foul,made,,,,
Hasheem Thabeet,Mike Conley,O.J. Mayo,Rudy Gay,Zach Randolph,Dwight Howard,Jameer Nelson,Matt Barnes,Rashard Lewis,Vince Carter,1,10:52,MEM,shot,,,,,,,,,,O.J. Mayo,2,,,made,,fade away jumper,27,19
Hasheem Thabeet,Mike Conley,O.J. Mayo,Rudy Gay,Zach Randolph,Dwight Howard,Jameer Nelson,Matt Barnes,Rashard Lewis,Vince Carter,1,10:32,ORL,turnover,,,,,,,,,,Dwight Howard,,,traveling,,,,,
Hasheem Thabeet,Mike Conley,O.J. Mayo,Rudy Gay,Zach Randolph,Dwight Howard,Jameer Nelson,Matt Barnes,Rashard Lewis,Vince Carter,1,10:14,MEM,shot,,,,,,,,,,Mike Conley,2,,,made,,floating jump,31,16
Hasheem Thabeet,Mike Conley,O.J. Mayo,Rudy Gay,Zach Randolph,Dwight Howard,Jameer Nelson,Matt Barnes,Rashard Lewis,Vince Carter,1,10:03,ORL,shot,,,,,,,,,,Dwight Howard,2,,,made,,running hook,20,13
Hasheem Thabeet,Mike Conley,O.J. Mayo,Rudy Gay,Zach Randolph,Dwight Howard,Jameer Nelson,Matt Barnes,Rashard Lewis,Vince Carter,1,9:41,ORL,foul,,,,,,,,Rudy Gay,,Vince Carter,,,,,,shooting,,
Hasheem Thabeet,Mike Conley,O.J. Mayo,Rudy Gay,Zach Randolph,Dwight Howard,Jameer Nelson,Matt Barnes,Rashard Lewis,Vince Carter,1,9:41,MEM,free throw,,,,,,,1,,2,Rudy Gay,,,foul,missed,,,,
Hasheem Thabeet,Mike Conley,O.J. Mayo,Rudy Gay,Zach Randolph,Dwight Howard,Jameer Nelson,Matt Barnes,Rashard Lewis,Vince Carter,1,9:41,MEM,rebound,,,,,,,,,,,,,,,,,,
Hasheem Thabeet,Mike Conley,O.J. Mayo,Rudy Gay,Zach Randolph,Dwight Howard,Jameer Nelson,Matt Barnes,Rashard Lewis,Vince Carter,1,9:41,MEM,free throw,,,,,,,2,,2,Rudy Gay,,,foul,missed,,,,
Hasheem Thabeet,Mike Conley,O.J. Mayo,Rudy Gay,Zach Randolph,Dwight Howard,Jameer Nelson,Matt Barnes,Rashard Lewis,Vince Carter,1,9:40,ORL,rebound,,,,,,,,,,Matt Barnes,,,,,,def,,
Hasheem Thabeet,Mike Conley,O.J. Mayo,Rudy Gay,Zach Randolph,Dwight Howard,Jameer Nelson,Matt Barnes,Rashard Lewis,Vince Carter,1,9:18,ORL,shot,,,,,,,,,,Jameer Nelson,,,,missed,,3pt,21,31
Hasheem Thabeet,Mike Conley,O.J. Mayo,Rudy Gay,Zach Randolph,Dwight Howard,Jameer Nelson,Matt Barnes,Rashard Lewis,Vince Carter,1,9:17,MEM,rebound,,,,,,,,,,Rudy Gay,,,,,,def,,
Hasheem Thabeet,Mike Conley,O.J. Mayo,Rudy Gay,Zach Randolph,Dwight Howard,Jameer Nelson,Matt Barnes,Rashard Lewis,Vince Carter,1,9:11,ORL,foul,,,,,,,,Zach Randolph,,Dwight Howard,,,,,,shooting,,
Hasheem Thabeet,Mike Conley,O.J. Mayo,Rudy Gay,Zach Randolph,Dwight Howard,Jameer Nelson,Matt Barnes,Rashard Lewis,Vince Carter,1,9:11,MEM,free throw,,,,,,,1,,2,Zach Randolph,,,foul,made,,,,
Hasheem Thabeet,Mike Conley,O.J. Mayo,Rudy Gay,Zach Randolph,Dwight Howard,Jameer Nelson,Matt Barnes,Rashard Lewis,Vince Carter,1,9:11,MEM,free throw,,,,,,,2,,2,Zach Randolph,,,foul,made,,,,
Hasheem Thabeet,Mike Conley,O.J. Mayo,Rudy Gay,Zach Randolph,Dwight Howard,Jameer Nelson,Matt Barnes,Rashard Lewis,Vince Carter,1,8:58,ORL,shot,,,,,,,,,,Jameer Nelson,2,,,made,,turnaround jump,34,14
Hasheem Thabeet,Mike Conley,O.J. Mayo,Rudy Gay,Zach Randolph,Dwight Howard,Jameer Nelson,Matt Barnes,Rashard Lewis,Vince Carter,1,8:40,MEM,shot,,,,,,,,,,Hasheem Thabeet,,,,missed,,dunk,25,6
Hasheem Thabeet,Mike Conley,O.J. Mayo,Rudy Gay,Zach Randolph,Dwight Howard,Jameer Nelson,Matt Barnes,Rashard Lewis,Vince Carter,1,8:39,MEM,rebound,,,,,,,,,,Rudy Gay,,,,,,off,,
Hasheem Thabeet,Mike Conley,O.J. Mayo,Rudy Gay,Zach Randolph,Dwight Howard,Jameer Nelson,Matt Barnes,Rashard Lewis,Vince Carter,1,8:36,MEM,shot,,,,,,,,,,Rudy Gay,,,,missed,,3pt,1,10
Hasheem Thabeet,Mike Conley,O.J. Mayo,Rudy Gay,Zach Randolph,Dwight Howard,Jameer Nelson,Matt Barnes,Rashard Lewis,Vince Carter,1,8:33,ORL,rebound,,,,,,,,,,Dwight Howard,,,,,,def,,
Hasheem Thabeet,Mike Conley,O.J. Mayo,Rudy Gay,Zach Randolph,Dwight Howard,Jameer Nelson,Matt Barnes,Rashard Lewis,Vince Carter,1,8:27,ORL,shot,Jameer Nelson,,,,,,,,,Vince Carter,3,,,made,,3pt,2,19
Hasheem Thabeet,Mike Conley,O.J. Mayo,Rudy Gay,Zach Randolph,Dwight Howard,Jameer Nelson,Matt Barnes,Rashard Lewis,Vince Carter,1,8:14,ORL,foul,,,,,,,,Zach Randolph,,Rashard Lewis,,,,,,personal,,
Hasheem Thabeet,Mike Conley,O.J. Mayo,Rudy Gay,Zach Randolph,Dwight Howard,Jameer Nelson,Matt Barnes,Rashard Lewis,Vince Carter,1,8:14,MEM,timeout,,,,,,,,,,,,,,,,regular,,
Hasheem Thabeet,Mike Conley,O.J. Mayo,Rudy Gay,Zach Randolph,Dwight Howard,Jameer Nelson,Matt Barnes,Rashard Lewis,Vince Carter,1,8:03,MEM,shot,,,,,,,,,,Mike Conley,,,,missed,,3pt,43,24
Hasheem Thabeet,Mike Conley,O.J. Mayo,Rudy Gay,Zach Randolph,Dwight Howard,Jameer Nelson,Matt Barnes,Rashard Lewis,Vince Carter,1,8:02,ORL,rebound,,,,,,,,,,Matt Barnes,,,,,,def,,
Hasheem Thabeet,Mike Conley,O.J. Mayo,Rudy Gay,Zach Randolph,Dwight Howard,Jameer Nelson,Matt Barnes,Rashard Lewis,Vince Carter,1,7:53,ORL,shot,,,,,,,,,,Vince Carter,,,,missed,,3pt,49,10
Hasheem Thabeet,Mike Conley,O.J. Mayo,Rudy Gay,Zach Randolph,Dwight Howard,Jameer Nelson,Matt Barnes,Rashard Lewis,Vince Carter,1,7:52,ORL,rebound,,,,,,,,,,Matt Barnes,,,,,,off,,
Hasheem Thabeet,Mike Conley,O.J. Mayo,Rudy Gay,Zach Randolph,Dwight Howard,Jameer Nelson,Matt Barnes,Rashard Lewis,Vince Carter,1,7:49,ORL,shot,Matt Barnes,,,,,,,,,Vince Carter,2,,,made,,alley oop dunk,25,6
Hasheem Thabeet,Mike Conley,O.J. Mayo,Rudy Gay,Zach Randolph,Dwight Howard,Jameer Nelson,Matt Barnes,Rashard Lewis,Vince Carter,1,7:27,MEM,shot,O.J. Mayo,,,,,,,,,Mike Conley,2,,,made,,floating jump,18,13
Hasheem Thabeet,Mike Conley,O.J. Mayo,Rudy Gay,Zach Randolph,Dwight Howard,Jameer Nelson,Matt Barnes,Rashard Lewis,Vince Carter,1,7:10,ORL,turnover,,,,,,,,,,Jameer Nelson,,,bad pass,,Zach Randolph,,,
Hasheem Thabeet,Mike Conley,O.J. Mayo,Rudy Gay,Zach Randolph,Dwight Howard,Jameer Nelson,Matt Barnes,Rashard Lewis,Vince Carter,1,7:03,MEM,shot,,,,,,,,,,Mike Conley,2,,,made,,driving layup,25,6
Hasheem Thabeet,Mike Conley,O.J. Mayo,Rudy Gay,Zach Randolph,Dwight Howard,Jameer Nelson,Matt Barnes,Rashard Lewis,Vince Carter,1,6:42,MEM,foul,,,,,,,,,,O.J. Mayo,,,,,,defense 3 second,,
Hasheem Thabeet,Mike Conley,O.J. Mayo,Rudy Gay,Zach Randolph,Dwight Howard,Jameer Nelson,Matt Barnes,Rashard Lewis,Vince Carter,1,6:42,ORL,free throw,,,,,,,1,,1,Vince Carter,,,technical,made,,,,
Hasheem Thabeet,Mike Conley,O.J. Mayo,Rudy Gay,Zach Randolph,Dwight Howard,Jameer Nelson,Matt Barnes,Rashard Lewis,Vince Carter,1,6:29,MEM,foul,,,,,,,,Dwight Howard,,Hasheem Thabeet,,,,,,shooting,,
Hasheem Thabeet,Mike Conley,O.J. Mayo,Rudy Gay,Zach Randolph,Dwight Howard,Jameer Nelson,Matt Barnes,Rashard Lewis,Vince Carter,1,6:29,ORL,free throw,,,,,,,1,,2,Dwight Howard,,,foul,missed,,,,
Hasheem Thabeet,Mike Conley,O.J. Mayo,Rudy Gay,Zach Randolph,Dwight Howard,Jameer Nelson,Matt Barnes,Rashard Lewis,Vince Carter,1,6:29,ORL,rebound,,,,,,,,,,,,,,,,,,
Hamed Haddadi,Mike Conley,O.J. Mayo,Rudy Gay,Zach Randolph,Dwight Howard,Jameer Nelson,Matt Barnes,Rashard Lewis,Vince Carter,1,6:29,MEM,sub,,,,Hamed Haddadi,,Hasheem Thabeet,,,,,,,,,,,,
Hamed Haddadi,Mike Conley,O.J. Mayo,Rudy Gay,Zach Randolph,Dwight Howard,Jameer Nelson,Matt Barnes,Rashard Lewis,Vince Carter,1,6:29,ORL,free throw,,,,,,,2,,2,Dwight Howard,,,foul,missed,,,,
Hamed Haddadi,Mike Conley,O.J. Mayo,Rudy Gay,Zach Randolph,Dwight Howard,Jameer Nelson,Matt Barnes,Rashard Lewis,Vince Carter,1,6:28,MEM,rebound,,,,,,,,,,Zach Randolph,,,,,,def,,
Hamed Haddadi,Mike Conley,O.J. Mayo,Rudy Gay,Zach Randolph,Dwight Howard,Jameer Nelson,Matt Barnes,Rashard Lewis,Vince Carter,1,6:16,MEM,shot,,,,,,,,,,O.J. Mayo,,,,missed,,jump,39,23
Hamed Haddadi,Mike Conley,O.J. Mayo,Rudy Gay,Zach Randolph,Dwight Howard,Jameer Nelson,Matt Barnes,Rashard Lewis,Vince Carter,1,6:14,ORL,rebound,,,,,,,,,,Rashard Lewis,,,,,,def,,
Hamed Haddadi,Mike Conley,O.J. Mayo,Rudy Gay,Zach Randolph,Dwight Howard,Jameer Nelson,Matt Barnes,Rashard Lewis,Vince Carter,1,6:10,MEM,foul,,,,,,,,Dwight Howard,,Hamed Haddadi,,,,,,personal,,
Hamed Haddadi,Mike Conley,O.J. Mayo,Rudy Gay,Zach Randolph,Dwight Howard,Jameer Nelson,Matt Barnes,Rashard Lewis,Vince Carter,1,6:07,ORL,turnover,,,,,,,,,,Rashard Lewis,,,bad pass,,Hamed Haddadi,,,
Hamed Haddadi,Mike Conley,O.J. Mayo,Rudy Gay,Zach Randolph,Dwight Howard,Jameer Nelson,Matt Barnes,Rashard Lewis,Vince Carter,1,6:01,MEM,shot,,,,,,,,,,Mike Conley,,,,missed,,floating jump,20,14
Hamed Haddadi,Mike Conley,O.J. Mayo,Rudy Gay,Zach Randolph,Dwight Howard,Jameer Nelson,Matt Barnes,Rashard Lewis,Vince Carter,1,5:59,ORL,rebound,,,,,,,,,,Dwight Howard,,,,,,def,,
Hamed Haddadi,Mike Conley,O.J. Mayo,Rudy Gay,Zach Randolph,Dwight Howard,Jameer Nelson,Matt Barnes,Rashard Lewis,Vince Carter,1,5:44,ORL,turnover,,,,,,,,,,Dwight Howard,,,traveling,,,,,
Hamed Haddadi,Mike Conley,O.J. Mayo,Rudy Gay,Zach Randolph,Dwight Howard,Jameer Nelson,Matt Barnes,Rashard Lewis,Vince Carter,1,5:27,MEM,shot,,,,,,,,,,Zach Randolph,2,,,made,,fade away jumper,27,19
Hamed Haddadi,Mike Conley,O.J. Mayo,Rudy Gay,Zach Randolph,Dwight Howard,Jameer Nelson,Matt Barnes,Rashard Lewis,Vince Carter,1,5:12,ORL,shot,,,,,,,,,,Jameer Nelson,2,,,made,,floating jump,27,14
Hamed Haddadi,Mike Conley,O.J. Mayo,Rudy Gay,Zach Randolph,Dwight Howard,Jameer Nelson,Matt Barnes,Rashard Lewis,Vince Carter,1,4:59,MEM,shot,,,,,,,,,,Rudy Gay,2,,,made,,jump,31,22
Hamed Haddadi,Mike Conley,O.J. Mayo,Rudy Gay,Zach Randolph,Dwight Howard,Jameer Nelson,Matt Barnes,Rashard Lewis,Vince Carter,1,4:37,MEM,violation,,,,,,,,,,Hamed Haddadi,,,,,,defensive goaltending,,
Hamed Haddadi,Mike Conley,O.J. Mayo,Rudy Gay,Zach Randolph,Dwight Howard,Jameer Nelson,Matt Barnes,Rashard Lewis,Vince Carter,1,4:37,ORL,shot,,,,,,,,,,Vince Carter,2,,,made,,driving layup,25,6
Hamed Haddadi,Mike Conley,O.J. Mayo,Rudy Gay,Zach Randolph,Dwight Howard,Jameer Nelson,Matt Barnes,Rashard Lewis,Vince Carter,1,4:17,MEM,shot,,,Dwight Howard,,,,,,,Rudy Gay,,,,missed,,running hook,31,11
Hamed Haddadi,Mike Conley,O.J. Mayo,Rudy Gay,Zach Randolph,Dwight Howard,Jameer Nelson,Matt Barnes,Rashard Lewis,Vince Carter,1,4:15,ORL,rebound,,,,,,,,,,Matt Barnes,,,,,,def,,
Hamed Haddadi,Mike Conley,O.J. Mayo,Rudy Gay,Zach Randolph,Dwight Howard,Jameer Nelson,Matt Barnes,Rashard Lewis,Vince Carter,1,4:11,ORL,shot,,,,,,,,,,Jameer Nelson,,,,missed,,layup,25,6
Hamed Haddadi,Mike Conley,O.J. Mayo,Rudy Gay,Zach Randolph,Dwight Howard,Jameer Nelson,Matt Barnes,Rashard Lewis,Vince Carter,1,4:09,ORL,rebound,,,,,,,,,,Dwight Howard,,,,,,off,,
Hamed Haddadi,Mike Conley,O.J. Mayo,Rudy Gay,Zach Randolph,Dwight Howard,Jameer Nelson,Matt Barnes,Rashard Lewis,Vince Carter,1,4:07,ORL,shot,,,,,,,,,,Dwight Howard,,,,missed,,layup,25,6
Hamed Haddadi,Mike Conley,O.J. Mayo,Rudy Gay,Zach Randolph,Dwight Howard,Jameer Nelson,Matt Barnes,Rashard Lewis,Vince Carter,1,4:06,MEM,rebound,,,,,,,,,,Hamed Haddadi,,,,,,def,,
Hamed Haddadi,Mike Conley,O.J. Mayo,Rudy Gay,Zach Randolph,Dwight Howard,Jameer Nelson,Matt Barnes,Rashard Lewis,Vince Carter,1,3:57,MEM,shot,,,Rashard Lewis,,,,,,,Zach Randolph,,,,missed,,layup,25,6
Hamed Haddadi,Mike Conley,O.J. Mayo,Rudy Gay,Zach Randolph,Dwight Howard,Jameer Nelson,Matt Barnes,Rashard Lewis,Vince Carter,1,3:55,ORL,rebound,,,,,,,,,,Dwight Howard,,,,,,def,,
Hamed Haddadi,Mike Conley,O.J. Mayo,Rudy Gay,Zach Randolph,Dwight Howard,Jameer Nelson,Matt Barnes,Rashard Lewis,Vince Carter,1,3:51,MEM,foul,,,,,,,,Dwight Howard,,Hamed Haddadi,,,,,,personal,,
Hamed Haddadi,Mike Conley,O.J. Mayo,Rudy Gay,Zach Randolph,Dwight Howard,Jameer Nelson,Matt Barnes,Rashard Lewis,Vince Carter,1,3:51,ORL,free throw,,,,,,,1,,2,Dwight Howard,,,foul,made,,,,
Hamed Haddadi,Mike Conley,O.J. Mayo,Rudy Gay,Zach Randolph,Dwight Howard,Jameer Nelson,Matt Barnes,Rashard Lewis,Vince Carter,1,3:51,ORL,free throw,,,,,,,2,,2,Dwight Howard,,,foul,missed,,,,
Hamed Haddadi,Mike Conley,O.J. Mayo,Rudy Gay,Zach Randolph,Dwight Howard,Jameer Nelson,Matt Barnes,Rashard Lewis,Vince Carter,1,3:50,MEM,rebound,,,,,,,,,,Rudy Gay,,,,,,def,,
Hamed Haddadi,Mike Conley,O.J. Mayo,Rudy Gay,Zach Randolph,Dwight Howard,Jameer Nelson,Matt Barnes,Rashard Lewis,Vince Carter,1,3:40,ORL,foul,,,,,,,,Rudy Gay,,Vince Carter,,,,,,personal,,
Darrell Arthur,Mike Conley,O.J. Mayo,Rudy Gay,Zach Randolph,Dwight Howard,Jameer Nelson,Matt Barnes,Rashard Lewis,Vince Carter,1,3:40,MEM,sub,,,,Darrell Arthur,,Hamed Haddadi,,,,,,,,,,,,
Darrell Arthur,Mike Conley,O.J. Mayo,Rudy Gay,Zach Randolph,Dwight Howard,J.J. Redick,Jameer Nelson,Matt Barnes,Rashard Lewis,1,3:40,ORL,sub,,,,J.J. Redick,,Vince Carter,,,,,,,,,,,,
Darrell Arthur,Mike Conley,O.J. Mayo,Rudy Gay,Zach Randolph,Dwight Howard,J.J. Redick,Jameer Nelson,Matt Barnes,Rashard Lewis,1,3:40,MEM,free throw,,,,,,,1,,2,Rudy Gay,,,foul,made,,,,
Darrell Arthur,Mike Conley,O.J. Mayo,Rudy Gay,Zach Randolph,Dwight Howard,J.J. Redick,Jameer Nelson,Matt Barnes,Rashard Lewis,1,3:40,MEM,free throw,,,,,,,2,,2,Rudy Gay,,,foul,missed,,,,
Darrell Arthur,Mike Conley,O.J. Mayo,Rudy Gay,Zach Randolph,Dwight Howard,J.J. Redick,Jameer Nelson,Matt Barnes,Rashard Lewis,1,3:39,ORL,rebound,,,,,,,,,,Dwight Howard,,,,,,def,,
Darrell Arthur,Mike Conley,O.J. Mayo,Rudy Gay,Zach Randolph,Dwight Howard,J.J. Redick,Jameer Nelson,Matt Barnes,Rashard Lewis,1,3:29,MEM,foul,,,,,,,,Rashard Lewis,,Zach Randolph,,,,,,personal,,
Darrell Arthur,Mike Conley,O.J. Mayo,Rudy Gay,Zach Randolph,Dwight Howard,J.J. Redick,Jameer Nelson,Matt Barnes,Rashard Lewis,1,3:29,ORL,free throw,,,,,,,1,,2,Rashard Lewis,,,foul,made,,,,
Darrell Arthur,Mike Conley,O.J. Mayo,Rudy Gay,Zach Randolph,Dwight Howard,J.J. Redick,Jameer Nelson,Matt Barnes,Rashard Lewis,1,3:29,ORL,free throw,,,,,,,2,,2,Rashard Lewis,,,foul,missed,,,,
Darrell Arthur,Mike Conley,O.J. Mayo,Rudy Gay,Zach Randolph,Dwight Howard,J.J. Redick,Jameer Nelson,Matt Barnes,Rashard Lewis,1,3:28,MEM,rebound,,,,,,,,,,Zach Randolph,,,,,,def,,
Darrell Arthur,Mike Conley,O.J. Mayo,Rudy Gay,Zach Randolph,Dwight Howard,J.J. Redick,Jameer Nelson,Matt Barnes,Rashard Lewis,1,3:13,MEM,shot,,,,,,,,,,Mike Conley,2,,,made,,running jump,23,16
Darrell Arthur,Mike Conley,O.J. Mayo,Rudy Gay,Zach Randolph,Dwight Howard,J.J. Redick,Jameer Nelson,Matt Barnes,Rashard Lewis,1,2:59,ORL,shot,,,,,,,,,,J.J. Redick,,,,missed,,3pt,34,30
Darrell Arthur,Mike Conley,O.J. Mayo,Rudy Gay,Zach Randolph,Dwight Howard,J.J. Redick,Jameer Nelson,Matt Barnes,Rashard Lewis,1,2:57,ORL,rebound,,,,,,,,,,Rashard Lewis,,,,,,off,,
Darrell Arthur,Mike Conley,O.J. Mayo,Rudy Gay,Zach Randolph,Dwight Howard,J.J. Redick,Jameer Nelson,Matt Barnes,Rashard Lewis,1,2:53,ORL,turnover,,,,,,,,,,Rashard Lewis,,,lost ball,,Zach Randolph,,,
Darrell Arthur,Mike Conley,O.J. Mayo,Rudy Gay,Zach Randolph,Dwight Howard,J.J. Redick,Jameer Nelson,Matt Barnes,Rashard Lewis,1,2:49,ORL,foul,,,,,,,,Rudy Gay,,Matt Barnes,,,,,,shooting,,
Darrell Arthur,Mike Conley,O.J. Mayo,Rudy Gay,Zach Randolph,Dwight Howard,J.J. Redick,Jameer Nelson,Matt Barnes,Rashard Lewis,1,2:49,ORL,timeout,,,,,,,,,,,,,,,,regular,,
Darrell Arthur,Mike Conley,O.J. Mayo,Rudy Gay,Zach Randolph,Dwight Howard,J.J. Redick,Jason Williams,Matt Barnes,Rashard Lewis,1,2:49,ORL,sub,,,,Jason Williams,,Jameer Nelson,,,,,,,,,,,,
Darrell Arthur,Mike Conley,O.J. Mayo,Rudy Gay,Zach Randolph,Dwight Howard,J.J. Redick,Jason Williams,Matt Barnes,Rashard Lewis,1,2:49,MEM,free throw,,,,,,,1,,2,Zach Randolph,,,foul,made,,,,
Darrell Arthur,Mike Conley,O.J. Mayo,Rudy Gay,Zach Randolph,Dwight Howard,J.J. Redick,Jason Williams,Matt Barnes,Rashard Lewis,1,2:49,MEM,free throw,,,,,,,2,,2,Zach Randolph,,,foul,made,,,,
Darrell Arthur,Mike Conley,O.J. Mayo,Rudy Gay,Zach Randolph,Dwight Howard,J.J. Redick,Jason Williams,Matt Barnes,Rashard Lewis,1,2:28,ORL,shot,,,,,,,,,,Matt Barnes,,,,missed,,3pt,41,24
Darrell Arthur,Mike Conley,O.J. Mayo,Rudy Gay,Zach Randolph,Dwight Howard,J.J. Redick,Jason Williams,Matt Barnes,Rashard Lewis,1,2:27,MEM,rebound,,,,,,,,,,Zach Randolph,,,,,,def,,
Darrell Arthur,Mike Conley,O.J. Mayo,Rudy Gay,Zach Randolph,Dwight Howard,J.J. Redick,Jason Williams,Matt Barnes,Rashard Lewis,1,2:09,MEM,shot,,,,,,,,,,Zach Randolph,2,,,made,,fade away jumper,10,13
Darrell Arthur,Mike Conley,O.J. Mayo,Rudy Gay,Zach Randolph,Dwight Howard,J.J. Redick,Jason Williams,Matt Barnes,Rashard Lewis,1,2:00,ORL,shot,Jason Williams,,,,,,,,,Rashard Lewis,3,,,made,,3pt,36,29
Darrell Arthur,Mike Conley,O.J. Mayo,Rudy Gay,Zach Randolph,Dwight Howard,J.J. Redick,Jason Williams,Matt Barnes,Rashard Lewis,1,1:42,MEM,shot,,,,,,,,,,Darrell Arthur,,,,missed,,jump,27,13
Darrell Arthur,Mike Conley,O.J. Mayo,Rudy Gay,Zach Randolph,Dwight Howard,J.J. Redick,Jason Williams,Matt Barnes,Rashard Lewis,1,1:41,MEM,rebound,,,,,,,,,,Zach Randolph,,,,,,off,,
Darrell Arthur,Mike Conley,O.J. Mayo,Rudy Gay,Zach Randolph,Dwight Howard,J.J. Redick,Jason Williams,Matt Barnes,Rashard Lewis,1,1:40,MEM,shot,,,,,,,,,,Zach Randolph,,,,missed,,layup,25,6
Darrell Arthur,Mike Conley,O.J. Mayo,Rudy Gay,Zach Randolph,Dwight Howard,J.J. Redick,Jason Williams,Matt Barnes,Rashard Lewis,1,1:39,ORL,rebound,,,,,,,,,,Rashard Lewis,,,,,,def,,
Darrell Arthur,Mike Conley,O.J. Mayo,Rudy Gay,Zach Randolph,Dwight Howard,J.J. Redick,Jason Williams,Matt Barnes,Rashard Lewis,1,1:33,ORL,shot,Jason Williams,,,,,,,,,J.J. Redick,3,,,made,,3pt,43,24
Darrell Arthur,Mike Conley,O.J. Mayo,Rudy Gay,Zach Randolph,Dwight Howard,J.J. Redick,Jason Williams,Matt Barnes,Rashard Lewis,1,1:17,MEM,shot,,,,,,,,,,Rudy Gay,2,,,made,,layup,25,6
Darrell Arthur,Mike Conley,O.J. Mayo,Rudy Gay,Zach Randolph,Dwight Howard,J.J. Redick,Jason Williams,Matt Barnes,Rashard Lewis,1,1:17,ORL,foul,,,,,,,,Rudy Gay,,Rashard Lewis,,,,,,shooting,,
Darrell Arthur,Marcus Williams,O.J. Mayo,Rudy Gay,Zach Randolph,Dwight Howard,J.J. Redick,Jason Williams,Matt Barnes,Rashard Lewis,1,1:17,MEM,sub,,,,Marcus Williams,,Mike Conley,,,,,,,,,,,,
Darrell Arthur,Marcus Williams,O.J. Mayo,Rudy Gay,Zach Randolph,Brandon Bass,Dwight Howard,J.J. Redick,Jason Williams,Matt Barnes,1,1:17,ORL,sub,,,,Brandon Bass,,Rashard Lewis,,,,,,,,,,,,
Darrell Arthur,Marcus Williams,O.J. Mayo,Rudy Gay,Zach Randolph,Brandon Bass,Dwight Howard,J.J. Redick,Jason Williams,Matt Barnes,1,1:17,MEM,free throw,,,,,,,1,,1,Rudy Gay,,,foul,made,,,,
Darrell Arthur,Marcus Williams,O.J. Mayo,Rudy Gay,Zach Randolph,Brandon Bass,Dwight Howard,J.J. Redick,Jason Williams,Matt Barnes,1,1:06,ORL,turnover,,,,,,,,,,Jason Williams,,,bad pass,,Zach Randolph,,,
Darrell Arthur,Marcus Williams,O.J. Mayo,Rudy Gay,Zach Randolph,Brandon Bass,Dwight Howard,J.J. Redick,Jason Williams,Matt Barnes,1,0:56,MEM,turnover,,,,,,,,,,Rudy Gay,,,lost ball,,Brandon Bass,,,
Darrell Arthur,Marcus Williams,Rudy Gay,Sam Young,Zach Randolph,Brandon Bass,Dwight Howard,J.J. Redick,Jason Williams,Matt Barnes,1,0:50,MEM,sub,,,,Sam Young,,O.J. Mayo,,,,,,,,,,,,
Darrell Arthur,Marcus Williams,Rudy Gay,Sam Young,Zach Randolph,Brandon Bass,Dwight Howard,J.J. Redick,Jason Williams,Matt Barnes,1,0:37,ORL,shot,Matt Barnes,,,,,,,,,Brandon Bass,2,,,made,,driving dunk,25,6
Darrell Arthur,Marcus Williams,Rudy Gay,Sam Young,Zach Randolph,Brandon Bass,Dwight Howard,J.J. Redick,Jason Williams,Matt Barnes,1,0:27,MEM,shot,,,Dwight Howard,,,,,,,Darrell Arthur,,,,missed,,jump,20,9
Darrell Arthur,Marcus Williams,Rudy Gay,Sam Young,Zach Randolph,Brandon Bass,Dwight Howard,J.J. Redick,Jason Williams,Matt Barnes,1,0:24,MEM,rebound,,,,,,,,,,Darrell Arthur,,,,,,off,,
Darrell Arthur,Marcus Williams,Rudy Gay,Sam Young,Zach Randolph,Brandon Bass,Dwight Howard,J.J. Redick,Jason Williams,Matt Barnes,1,0:21,MEM,shot,,,,,,,,,,Darrell Arthur,,,,missed,,jump,18,9
Darrell Arthur,Marcus Williams,Rudy Gay,Sam Young,Zach Randolph,Brandon Bass,Dwight Howard,J.J. Redick,Jason Williams,Matt Barnes,1,0:19,ORL,rebound,,,,,,,,,,Dwight Howard,,,,,,def,,
Darrell Arthur,Marcus Williams,Rudy Gay,Sam Young,Zach Randolph,Brandon Bass,Dwight Howard,J.J. Redick,Jason Williams,Matt Barnes,1,0:18,MEM,foul,,,,,,,,J.J. Redick,,Darrell Arthur,,,,,,shooting,,
Darrell Arthur,Marcus Williams,Rudy Gay,Sam Young,Zach Randolph,Brandon Bass,Dwight Howard,J.J. Redick,Jason Williams,Matt Barnes,1,0:18,ORL,free throw,,,,,,,1,,2,J.J. Redick,,,foul,made,,,,
Darrell Arthur,Marcus Williams,Rudy Gay,Sam Young,Zach Randolph,Brandon Bass,Dwight Howard,J.J. Redick,Jason Williams,Matt Barnes,1,0:18,ORL,free throw,,,,,,,2,,2,J.J. Redick,,,foul,missed,,,,
Darrell Arthur,Marcus Williams,Rudy Gay,Sam Young,Zach Randolph,Brandon Bass,Dwight Howard,J.J. Redick,Jason Williams,Matt Barnes,1,0:17,MEM,rebound,,,,,,,,,,Zach Randolph,,,,,,def,,
Darrell Arthur,Marcus Williams,Rudy Gay,Sam Young,Zach Randolph,Brandon Bass,Dwight Howard,J.J. Redick,Jason Williams,Matt Barnes,1,0:04,ORL,foul,,,,,,,,,,Dwight Howard,,,,,,defense 3 second,,
Darrell Arthur,Marcus Williams,Rudy Gay,Sam Young,Zach Randolph,Brandon Bass,Dwight Howard,J.J. Redick,Jason Williams,Matt Barnes,1,0:04,MEM,free throw,,,,,,,1,,1,Zach Randolph,,,technical,missed,,,,
Darrell Arthur,Marcus Williams,Rudy Gay,Sam Young,Zach Randolph,Brandon Bass,Dwight Howard,J.J. Redick,Jason Williams,Matt Barnes,1,0:04,MEM,rebound,,,,,,,,,,,,,,,,,,
Darrell Arthur,Marcus Williams,Rudy Gay,Sam Young,Zach Randolph,Brandon Bass,Dwight Howard,J.J. Redick,Jason Williams,Matt Barnes,1,0:00,MEM,shot,,,,,,,,,,Rudy Gay,,,,missed,,jump,21,28
Darrell Arthur,Marcus Williams,Rudy Gay,Sam Young,Zach Randolph,Brandon Bass,Dwight Howard,J.J. Redick,Jason Williams,Matt Barnes,1,0:00,MEM,rebound,,,,,,,,,,,,,,,,,,
Darrell Arthur,Marcus Williams,O.J. Mayo,Sam Young,Zach Randolph,Brandon Bass,Dwight Howard,J.J. Redick,Jason Williams,Mickael Pietrus,2,11:41,MEM,shot,,,,,,,,,,O.J. Mayo,,,,missed,,jump,10,16
Darrell Arthur,Marcus Williams,O.J. Mayo,Sam Young,Zach Randolph,Brandon Bass,Dwight Howard,J.J. Redick,Jason Williams,Mickael Pietrus,2,11:39,ORL,rebound,,,,,,,,,,Jason Williams,,,,,,def,,
Darrell Arthur,Marcus Williams,O.J. Mayo,Sam Young,Zach Randolph,Brandon Bass,Dwight Howard,J.J. Redick,Jason Williams,Mickael Pietrus,2,11:24,ORL,shot,,,,,,,,,,Jason Williams,,,,missed,,driving layup,25,6
Darrell Arthur,Marcus Williams,O.J. Mayo,Sam Young,Zach Randolph,Brandon Bass,Dwight Howard,J.J. Redick,Jason Williams,Mickael Pietrus,2,11:22,MEM,rebound,,,,,,,,,,Darrell Arthur,,,,,,def,,
Darrell Arthur,Marcus Williams,O.J. Mayo,Sam Young,Zach Randolph,Brandon Bass,Dwight Howard,J.J. Redick,Jason Williams,Mickael Pietrus,2,11:03,MEM,shot,,,,,,,,,,Darrell Arthur,,,,missed,,jump,36,22
Darrell Arthur,Marcus Williams,O.J. Mayo,Sam Young,Zach Randolph,Brandon Bass,Dwight Howard,J.J. Redick,Jason Williams,Mickael Pietrus,2,11:02,MEM,rebound,,,,,,,,,,Sam Young,,,,,,off,,