a1,a2,a3,a4,a5,h1,h2,h3,h4,h5,period,time,team,etype,assist,away,block,entered,home,left,num,opponent,outof,player,points,possession,reason,result,steal,type,x,y
Chris Kaman,Drew Gooden,Eric Gordon,Rasual Butler,Steve Blake,Andrew Bogut,Brandon Jennings,Charlie Bell,John Salmons,Luc Richard Mbah a Moute,1,12:00,OFF,jump ball,,Drew Gooden,,,Andrew Bogut,,,,,,,Brandon Jennings,,,,,,
Chris Kaman,Drew Gooden,Eric Gordon,Rasual Butler,Steve Blake,Andrew Bogut,Brandon Jennings,Charlie Bell,John Salmons,Luc Richard Mbah a Moute,1,11:49,LAC,foul,,,,,,,,Andrew Bogut,,Eric Gordon,,,,,,personal,,
Chris Kaman,Drew Gooden,Eric Gordon,Rasual Butler,Steve Blake,Andrew Bogut,Brandon Jennings,Charlie Bell,John Salmons,Luc Richard Mbah a Moute,1,11:40,LAC,foul,,,,,,,,Luc Richard Mbah a Moute,,Chris Kaman,,,,,,shooting,,
Chris Kaman,Drew Gooden,Eric Gordon,Rasual Butler,Steve Blake,Andrew Bogut,Brandon Jennings,Charlie Bell,John Salmons,Luc Richard Mbah a Moute,1,11:40,MIL,free throw,,,,,,,1,,2,Luc Richard Mbah a Moute,,,foul,made,,,,
Chris Kaman,Drew Gooden,Eric Gordon,Rasual Butler,Steve Blake,Andrew Bogut,Brandon Jennings,Charlie Bell,John Salmons,Luc Richard Mbah a Moute,1,11:40,MIL,free throw,,,,,,,2,,2,Luc Richard Mbah a Moute,,,foul,made,,,,
Chris Kaman,Drew Gooden,Eric Gordon,Rasual Butler,Steve Blake,Andrew Bogut,Brandon Jennings,Charlie Bell,John Salmons,Luc Richard Mbah a Moute,1,11:17,LAC,shot,Steve Blake,,,,,,,,,Rasual Butler,3,,,made,,3pt,49,8
Chris Kaman,Drew Gooden,Eric Gordon,Rasual Butler,Steve Blake,Andrew Bogut,Brandon Jennings,Charlie Bell,John Salmons,Luc Richard Mbah a Moute,1,10:51,MIL,shot,,,,,,,,,,John Salmons,,,,missed,,layup,25,6
Chris Kaman,Drew Gooden,Eric Gordon,Rasual Butler,Steve Blake,Andrew Bogut,Brandon Jennings,Charlie Bell,John Salmons,Luc Richard Mbah a Moute,1,10:50,MIL,rebound,,,,,,,,,,Andrew Bogut,,,,,,off,,
Chris Kaman,Drew Gooden,Eric Gordon,Rasual Butler,Steve Blake,Andrew Bogut,Brandon Jennings,Charlie Bell,John Salmons,Luc Richard Mbah a Moute,1,10:49,MIL,shot,,,,,,,,,,Andrew Bogut,2,,,made,,layup,25,6
Chris Kaman,Drew Gooden,Eric Gordon,Rasual Butler,Steve Blake,Andrew Bogut,Brandon Jennings,Charlie Bell,John Salmons,Luc Richard Mbah a Moute,1,10:40,LAC,shot,,,,,,,,,,Rasual Butler,,,,missed,,jump,42,14
Chris Kaman,Drew Gooden,Eric Gordon,Rasual Butler,Steve Blake,Andrew Bogut,Brandon Jennings,Charlie Bell,John Salmons,Luc Richard Mbah a Moute,1,10:39,MIL,rebound,,,,,,,,,,Brandon Jennings,,,,,,def,,
Chris Kaman,Drew Gooden,Eric Gordon,Rasual Butler,Steve Blake,Andrew Bogut,Brandon Jennings,Charlie Bell,John Salmons,Luc Richard Mbah a Moute,1,10:21,MIL,turnover,,,,,,,,,,Charlie Bell,,,bad pass,,Chris Kaman,,,
Chris Kaman,Drew Gooden,Eric Gordon,Rasual Butler,Steve Blake,Andrew Bogut,Brandon Jennings,Charlie Bell,John Salmons,Luc Richard Mbah a Moute,1,10:13,LAC,shot,,,,,,,,,,Drew Gooden,,,,missed,,jump,8,6
Chris Kaman,Drew Gooden,Eric Gordon,Rasual Butler,Steve Blake,Andrew Bogut,Brandon Jennings,Charlie Bell,John Salmons,Luc Richard Mbah a Moute,1,10:12,MIL,rebound,,,,,,,,,,Luc Richard Mbah a Moute,,,,,,def,,
Chris Kaman,Drew Gooden,Eric Gordon,Rasual Butler,Steve Blake,Andrew Bogut,Brandon Jennings,Charlie Bell,John Salmons,Luc Richard Mbah a Moute,1,9:55,MIL,shot,,,Drew Gooden,,,,,,,Andrew Bogut,,,,missed,,layup,25,6
Chris Kaman,Drew Gooden,Eric Gordon,Rasual Butler,Steve Blake,Andrew Bogut,Brandon Jennings,Charlie Bell,John Salmons,Luc Richard Mbah a Moute,1,9:54,LAC,rebound,,,,,,,,,,Chris Kaman,,,,,,def,,
Chris Kaman,Drew Gooden,Eric Gordon,Rasual Butler,Steve Blake,Andrew Bogut,Brandon Jennings,Charlie Bell,John Salmons,Luc Richard Mbah a Moute,1,9:43,LAC,shot,Steve Blake,,,,,,,,,Chris Kaman,2,,,made,,jump,41,7
Chris Kaman,Drew Gooden,Eric Gordon,Rasual Butler,Steve Blake,Andrew Bogut,Brandon Jennings,Charlie Bell,John Salmons,Luc Richard Mbah a Moute,1,9:23,MIL,shot,,,,,,,,,,Brandon Jennings,,,,missed,,3pt,15,30
Chris Kaman,Drew Gooden,Eric Gordon,Rasual Butler,Steve Blake,Andrew Bogut,Brandon Jennings,Charlie Bell,John Salmons,Luc Richard Mbah a Moute,1,9:22,MIL,rebound,,,,,,,,,,Luc Richard Mbah a Moute,,,,,,off,,
Chris Kaman,Drew Gooden,Eric Gordon,Rasual Butler,Steve Blake,Andrew Bogut,Brandon Jennings,Charlie Bell,John Salmons,Luc Richard Mbah a Moute,1,9:18,MIL,shot,Luc Richard Mbah a Moute,,,,,,,,,Brandon Jennings,2,,,made,,floating jump,36,9
Chris Kaman,Drew Gooden,Eric Gordon,Rasual Butler,Steve Blake,Andrew Bogut,Brandon Jennings,Charlie Bell,John Salmons,Luc Richard Mbah a Moute,1,8:57,LAC,shot,,,,,,,,,,Rasual Butler,2,,,made,,jump,16,18
Chris Kaman,Drew Gooden,Eric Gordon,Rasual Butler,Steve Blake,Andrew Bogut,Brandon Jennings,Charlie Bell,John Salmons,Luc Richard Mbah a Moute,1,8:36,MIL,shot,John Salmons,,,,,,,,,Luc Richard Mbah a Moute,2,,,made,,a moute driving layup,25,6
Chris Kaman,Drew Gooden,Eric Gordon,Rasual Butler,Steve Blake,Andrew Bogut,Brandon Jennings,Charlie Bell,John Salmons,Luc Richard Mbah a Moute,1,8:21,MIL,foul,,,,,,,,Eric Gordon,,Charlie Bell,,,,,,personal,,
Chris Kaman,Drew Gooden,Eric Gordon,Rasual Butler,Steve Blake,Andrew Bogut,Brandon Jennings,Charlie Bell,John Salmons,Luc Richard Mbah a Moute,1,8:18,MIL,foul,,,,,,,,Drew Gooden,,Luc Richard Mbah a Moute,,,,,,shooting,,
Chris Kaman,Drew Gooden,Eric Gordon,Rasual Butler,Steve Blake,Andrew Bogut,Brandon Jennings,Charlie Bell,John Salmons,Luc Richard Mbah a Moute,1,8:18,LAC,free throw,,,,,,,1,,2,Drew Gooden,,,foul,made,,,,
Chris Kaman,Drew Gooden,Eric Gordon,Rasual Butler,Steve Blake,Andrew Bogut,Brandon Jennings,Charlie Bell,John Salmons,Luc Richard Mbah a Moute,1,8:18,LAC,free throw,,,,,,,2,,2,Drew Gooden,,,foul,made,,,,
Chris Kaman,Drew Gooden,Eric Gordon,Rasual Butler,Steve Blake,Andrew Bogut,Brandon Jennings,Charlie Bell,John Salmons,Luc Richard Mbah a Moute,1,8:03,MIL,shot,Andrew Bogut,,,,,,,,,Charlie Bell,3,,,made,,3pt,48,4
Chris Kaman,Drew Gooden,Eric Gordon,Rasual Butler,Steve Blake,Andrew Bogut,Brandon Jennings,Charlie Bell,John Salmons,Luc Richard Mbah a Moute,1,7:48,LAC,shot,,,,,,,,,,Drew Gooden,,,,missed,,jump,15,9
Chris Kaman,Drew Gooden,Eric Gordon,Rasual Butler,Steve Blake,Andrew Bogut,Brandon Jennings,Charlie Bell,John Salmons,Luc Richard Mbah a Moute,1,7:47,MIL,rebound,,,,,,,,,,Brandon Jennings,,,,,,def,,
Chris Kaman,Drew Gooden,Eric Gordon,Rasual Butler,Steve Blake,Andrew Bogut,Brandon Jennings,Charlie Bell,John Salmons,Luc Richard Mbah a Moute,1,7:39,MIL,shot,,,,,,,,,,Brandon Jennings,,,,missed,,jump,17,13
Chris Kaman,Drew Gooden,Eric Gordon,Rasual Butler,Steve Blake,Andrew Bogut,Brandon Jennings,Charlie Bell,John Salmons,Luc Richard Mbah a Moute,1,7:38,MIL,rebound,,,,,,,,,,Luc Richard Mbah a Moute,,,,,,off,,
Chris Kaman,Drew Gooden,Eric Gordon,Rasual Butler,Steve Blake,Andrew Bogut,Brandon Jennings,Charlie Bell,John Salmons,Luc Richard Mbah a Moute,1,7:32,MIL,shot,,,,,,,,,,Brandon Jennings,,,,missed,,jump,33,6
Chris Kaman,Drew Gooden,Eric Gordon,Rasual Butler,Steve Blake,Andrew Bogut,Brandon Jennings,Charlie Bell,John Salmons,Luc Richard Mbah a Moute,1,7:31,LAC,rebound,,,,,,,,,,Drew Gooden,,,,,,def,,
Chris Kaman,Drew Gooden,Eric Gordon,Rasual Butler,Steve Blake,Andrew Bogut,Brandon Jennings,Charlie Bell,John Salmons,Luc Richard Mbah a Moute,1,7:20,LAC,shot,,,,,,,,,,Chris Kaman,,,,missed,,layup,25,6
Chris Kaman,Drew Gooden,Eric Gordon,Rasual Butler,Steve Blake,Andrew Bogut,Brandon Jennings,Charlie Bell,John Salmons,Luc Richard Mbah a Moute,1,7:19,LAC,rebound,,,,,,,,,,Drew Gooden,,,,,,off,,
Chris Kaman,Drew Gooden,Eric Gordon,Rasual Butler,Steve Blake,Andrew Bogut,Brandon Jennings,Charlie Bell,John Salmons,Luc Richard Mbah a Moute,1,7:19,LAC,shot,,,,,,,,,,Drew Gooden,2,,,made,,tip,25,6
Chris Kaman,Drew Gooden,Eric Gordon,Rasual Butler,Steve Blake,Andrew Bogut,Brandon Jennings,Charlie Bell,John Salmons,Luc Richard Mbah a Moute,1,6:56,MIL,shot,,,,,,,,,,John Salmons,2,,,made,,layup,25,6
Chris Kaman,Drew Gooden,Eric Gordon,Rasual Butler,Steve Blake,Andrew Bogut,Brandon Jennings,Charlie Bell,John Salmons,Luc Richard Mbah a Moute,1,6:38,LAC,shot,,,,,,,,,,Chris Kaman,2,,,made,,jump,18,12
Chris Kaman,Drew Gooden,Eric Gordon,Rasual Butler,Steve Blake,Andrew Bogut,Brandon Jennings,Charlie Bell,John Salmons,Luc Richard Mbah a Moute,1,6:19,MIL,shot,Brandon Jennings,,,,,,,,,John Salmons,2,,,made,,driving layup,25,6
Chris Kaman,Drew Gooden,Eric Gordon,Rasual Butler,Steve Blake,Andrew Bogut,Brandon Jennings,Charlie Bell,John Salmons,Luc Richard Mbah a Moute,1,5:55,LAC,turnover,,,,,,,,,,Drew Gooden,,,traveling,,,,,
Chris Kaman,Drew Gooden,Eric Gordon,Rasual Butler,Steve Blake,Andrew Bogut,Brandon Jennings,Charlie Bell,John Salmons,Luc Richard Mbah a Moute,1,5:55,MIL,timeout,,,,,,,,,,,,,,,,regular,,
Chris Kaman,Drew Gooden,Eric Gordon,Rasual Butler,Steve Blake,Andrew Bogut,Brandon Jennings,Charlie Bell,John Salmons,Luc Richard Mbah a Moute,1,5:36,MIL,shot,,,,,,,,,,Charlie Bell,,,,missed,,3pt,46,19
Chris Kaman,Drew Gooden,Eric Gordon,Rasual Butler,Steve Blake,Andrew Bogut,Brandon Jennings,Charlie Bell,John Salmons,Luc Richard Mbah a Moute,1,5:35,LAC,rebound,,,,,,,,,,Steve Blake,,,,,,def,,
Chris Kaman,Drew Gooden,Eric Gordon,Rasual Butler,Steve Blake,Andrew Bogut,Brandon Jennings,Charlie Bell,John Salmons,Luc Richard Mbah a Moute,1,5:21,LAC,shot,,,,,,,,,,Steve Blake,,,,missed,,3pt,42,25
Chris Kaman,Drew Gooden,Eric Gordon,Rasual Butler,Steve Blake,Andrew Bogut,Brandon Jennings,Charlie Bell,John Salmons,Luc Richard Mbah a Moute,1,5:20,MIL,rebound,,,,,,,,,,John Salmons,,,,,,def,,
Chris Kaman,Drew Gooden,Eric Gordon,Rasual Butler,Steve Blake,Andrew Bogut,Brandon Jennings,Charlie Bell,John Salmons,Luc Richard Mbah a Moute,1,4:59,MIL,shot,,,,,,,,,,Andrew Bogut,,,,missed,,hook,36,6
Chris Kaman,Drew Gooden,Eric Gordon,Rasual Butler,Steve Blake,Andrew Bogut,Brandon Jennings,Charlie Bell,John Salmons,Luc Richard Mbah a Moute,1,4:58,LAC,rebound,,,,,,,,,,Steve Blake,,,,,,def,,
Chris Kaman,Drew Gooden,Eric Gordon,Rasual Butler,Steve Blake,Andrew Bogut,Brandon Jennings,Charlie Bell,John Salmons,Luc Richard Mbah a Moute,1,4:52,LAC,shot,,,,,,,,,,Eric Gordon,,,,missed,,3pt,5,21
Chris Kaman,Drew Gooden,Eric Gordon,Rasual Butler,Steve Blake,Andrew Bogut,Brandon Jennings,Charlie Bell,John Salmons,Luc Richard Mbah a Moute,1,4:50,MIL,rebound,,,,,,,,,,Charlie Bell,,,,,,def,,
Chris Kaman,Drew Gooden,Eric Gordon,Rasual Butler,Steve Blake,Andrew Bogut,Brandon Jennings,Charlie Bell,John Salmons,Luc Richard Mbah a Moute,1,4:39,MIL,shot,,,,,,,,,,Luc Richard Mbah a Moute,,,,missed,,a moute jump,22,24
Chris Kaman,Drew Gooden,Eric Gordon,Rasual Butler,Steve Blake,Andrew Bogut,Brandon Jennings,Charlie Bell,John Salmons,Luc Richard Mbah a Moute,1,4:37,MIL,rebound,,,,,,,,,,Charlie Bell,,,,,,off,,
Chris Kaman,Drew Gooden,Eric Gordon,Rasual Butler,Steve Blake,Andrew Bogut,Brandon Jennings,Charlie Bell,John Salmons,Luc Richard Mbah a Moute,1,4:13,MIL,shot,,,,,,,,,,Charlie Bell,2,,,made,,jump,42,11
Chris Kaman,Drew Gooden,Eric Gordon,Rasual Butler,Steve Blake,Andrew Bogut,Brandon Jennings,Charlie Bell,John Salmons,Luc Richard Mbah a Moute,1,3:45,LAC,turnover,,,,,,,,,,Eric Gordon,,,bad pass,,Luc Richard Mbah a Moute,,,
Chris Kaman,Drew Gooden,Eric Gordon,Rasual Butler,Steve Blake,Andrew Bogut,Brandon Jennings,Charlie Bell,John Salmons,Luc Richard Mbah a Moute,1,3:42,MIL,shot,,,,,,,,,,Charlie Bell,2,,,made,,reverse layup,25,6
Chris Kaman,Drew Gooden,Eric Gordon,Rasual Butler,Steve Blake,Andrew Bogut,Brandon Jennings,Charlie Bell,John Salmons,Luc Richard Mbah a Moute,1,3:42,LAC,foul,,,,,,,,Charlie Bell,,Drew Gooden,,,,,,shooting,,
Chris Kaman,Drew Gooden,Eric Gordon,Rasual Butler,Steve Blake,Brandon Jennings,Charlie Bell,John Salmons,Kurt Thomas,Luc Richard Mbah a Moute,1,3:42,MIL,sub,,,,Kurt Thomas,,Andrew Bogut,,,,,,,,,,,,
Chris Kaman,Drew Gooden,Eric Gordon,Steve Blake,Travis Outlaw,Brandon Jennings,Charlie Bell,John Salmons,Kurt Thomas,Luc Richard Mbah a Moute,1,3:42,LAC,sub,,,,Travis Outlaw,,Rasual Butler,,,,,,,,,,,,
Chris Kaman,Drew Gooden,Eric Gordon,Steve Blake,Travis Outlaw,Brandon Jennings,Charlie Bell,John Salmons,Kurt Thomas,Luc Richard Mbah a Moute,1,3:42,MIL,free throw,,,,,,,1,,1,Charlie Bell,,,foul,made,,,,
Chris Kaman,Drew Gooden,Eric Gordon,Steve Blake,Travis Outlaw,Brandon Jennings,Charlie Bell,John Salmons,Kurt Thomas,Luc Richard Mbah a Moute,1,3:26,LAC,shot,,,,,,,,,,Chris Kaman,,,,missed,,jump,39,15
Chris Kaman,Drew Gooden,Eric Gordon,Steve Blake,Travis Outlaw,Brandon Jennings,Charlie Bell,John Salmons,Kurt Thomas,Luc Richard Mbah a Moute,1,3:24,LAC,rebound,,,,,,,,,,Drew Gooden,,,,,,off,,
Chris Kaman,Drew Gooden,Eric Gordon,Steve Blake,Travis Outlaw,Brandon Jennings,Charlie Bell,John Salmons,Kurt Thomas,Luc Richard Mbah a Moute,1,3:24,LAC,shot,,,,,,,,,,Drew Gooden,,,,missed,,tip,25,6
Chris Kaman,Drew Gooden,Eric Gordon,Steve Blake,Travis Outlaw,Brandon Jennings,Charlie Bell,John Salmons,Kurt Thomas,Luc Richard Mbah a Moute,1,3:22,MIL,rebound,,,,,,,,,,Charlie Bell,,,,,,def,,
Chris Kaman,Drew Gooden,Eric Gordon,Steve Blake,Travis Outlaw,Brandon Jennings,Charlie Bell,John Salmons,Kurt Thomas,Luc Richard Mbah a Moute,1,3:04,MIL,shot,,,,,,,,,,Luc Richard Mbah a Moute,,,,missed,,a moute jump,42,15
Chris Kaman,Drew Gooden,Eric Gordon,Steve Blake,Travis Outlaw,Brandon Jennings,Charlie Bell,John Salmons,Kurt Thomas,Luc Richard Mbah a Moute,1,3:03,MIL,rebound,,,,,,,,,,Kurt Thomas,,,,,,off,,
Chris Kaman,Drew Gooden,Eric Gordon,Steve Blake,Travis Outlaw,Brandon Jennings,Charlie Bell,John Salmons,Kurt Thomas,Luc Richard Mbah a Moute,1,2:59,MIL,shot,Kurt Thomas,,,,,,,,,Brandon Jennings,3,,,made,,3pt,38,27
Chris Kaman,Drew Gooden,Eric Gordon,Steve Blake,Travis Outlaw,Brandon Jennings,Charlie Bell,John Salmons,Kurt Thomas,Luc Richard Mbah a Moute,1,2:50,LAC,timeout,,,,,,,,,,,,,,,,regular,,
Chris Kaman,DeAndre Jordan,Eric Gordon,Steve Blake,Travis Outlaw,Brandon Jennings,Charlie Bell,John Salmons,Kurt Thomas,Luc Richard Mbah a Moute,1,2:50,LAC,sub,,,,DeAndre Jordan,,Drew Gooden,,,,,,,,,,,,
Chris Kaman,DeAndre Jordan,Eric Gordon,Steve Blake,Travis Outlaw,Brandon Jennings,Charlie Bell,Ersan Ilyasova,John Salmons,Kurt Thomas,1,2:50,MIL,sub,,,,Ersan Ilyasova,,Luc Richard Mbah a Moute,,,,,,,,,,,,
Chris Kaman,DeAndre Jordan,Eric Gordon,Steve Blake,Travis Outlaw,Brandon Jennings,Charlie Bell,Ersan Ilyasova,John Salmons,Kurt Thomas,1,2:33,LAC,shot,,,,,,,,,,Travis Outlaw,,,,missed,,3pt,43,26
Chris Kaman,DeAndre Jordan,Eric Gordon,Steve Blake,Travis Outlaw,Brandon Jennings,Charlie Bell,Ersan Ilyasova,John Salmons,Kurt Thomas,1,2:32,LAC,rebound,,,,,,,,,,Chris Kaman,,,,,,off,,
Chris Kaman,DeAndre Jordan,Eric Gordon,Steve Blake,Travis Outlaw,Brandon Jennings,Charlie Bell,Ersan Ilyasova,John Salmons,Kurt Thomas,1,2:30,LAC,shot,,,,,,,,,,Chris Kaman,,,,missed,,layup,25,6
Chris Kaman,DeAndre Jordan,Eric Gordon,Steve Blake,Travis Outlaw,Brandon Jennings,Charlie Bell,Ersan Ilyasova,John Salmons,Kurt Thomas,1,2:29,MIL,rebound,,,,,,,,,,Kurt Thomas,,,,,,def,,
Chris Kaman,DeAndre Jordan,Eric Gordon,Steve Blake,Travis Outlaw,Brandon Jennings,Charlie Bell,Ersan Ilyasova,John Salmons,Kurt Thomas,1,2:14,MIL,shot,,,,,,,,,,Kurt Thomas,,,,missed,,layup,25,6
Chris Kaman,DeAndre Jordan,Eric Gordon,Steve Blake,Travis Outlaw,Brandon Jennings,Charlie Bell,Ersan Ilyasova,John Salmons,Kurt Thomas,1,2:13,MIL,rebound,,,,,,,,,,Ersan Ilyasova,,,,,,off,,
Chris Kaman,DeAndre Jordan,Eric Gordon,Steve Blake,Travis Outlaw,Brandon Jennings,Charlie Bell,Ersan Ilyasova,John Salmons,Kurt Thomas,1,2:07,MIL,shot,,,,,,,,,,John Salmons,,,,missed,,3pt,38,28
Chris Kaman,DeAndre Jordan,Eric Gordon,Steve Blake,Travis Outlaw,Brandon Jennings,Charlie Bell,Ersan Ilyasova,John Salmons,Kurt Thomas,1,2:05,LAC,rebound,,,,,,,,,,DeAndre Jordan,,,,,,def,,
Chris Kaman,DeAndre Jordan,Eric Gordon,Steve Blake,Travis Outlaw,Brandon Jennings,Charlie Bell,Ersan Ilyasova,John Salmons,Kurt Thomas,1,1:47,MIL,foul,,,,,,,,Travis Outlaw,,John Salmons,,,,,,shooting,,
Chris Kaman,DeAndre Jordan,Eric Gordon,Steve Blake,Travis Outlaw,Brandon Jennings,Charlie Bell,Ersan Ilyasova,Jerry Stackhouse,Kurt Thomas,1,1:47,MIL,sub,,,,Jerry Stackhouse,,John Salmons,,,,,,,,,,,,
Chris Kaman,DeAndre Jordan,Eric Gordon,Steve Blake,Travis Outlaw,Brandon Jennings,Charlie Bell,Ersan Ilyasova,Jerry Stackhouse,Kurt Thomas,1,1:47,LAC,free throw,,,,,,,1,,2,Travis Outlaw,,,foul,made,,,,
Chris Kaman,DeAndre Jordan,Eric Gordon,Steve Blake,Travis Outlaw,Brandon Jennings,Charlie Bell,Ersan Ilyasova,Jerry Stackhouse,Kurt Thomas,1,1:47,LAC,free throw,,,,,,,2,,2,Travis Outlaw,,,foul,made,,,,
Chris Kaman,DeAndre Jordan,Eric Gordon,Steve Blake,Travis Outlaw,Brandon Jennings,Charlie Bell,Ersan Ilyasova,Jerry Stackhouse,Kurt Thomas,1,1:32,MIL,shot,,,,,,,,,,Kurt Thomas,,,,missed,,jump,41,5
Chris Kaman,DeAndre Jordan,Eric Gordon,Steve Blake,Travis Outlaw,Brandon Jennings,Charlie Bell,Ersan Ilyasova,Jerry Stackhouse,Kurt Thomas,1,1:31,LAC,rebound,,,,,,,,,,Travis Outlaw,,,,,,def,,
Chris Kaman,DeAndre Jordan,Eric Gordon,Steve Blake,Travis Outlaw,Brandon Jennings,Charlie Bell,Ersan Ilyasova,Jerry Stackhouse,Kurt Thomas,1,1:25,LAC,turnover,,,,,,,,,,Steve Blake,,,bad pass,,Kurt Thomas,,,
Chris Kaman,DeAndre Jordan,Eric Gordon,Steve Blake,Travis Outlaw,Brandon Jennings,Charlie Bell,Ersan Ilyasova,Jerry Stackhouse,Kurt Thomas,1,1:16,MIL,shot,,,,,,,,,,Charlie Bell,,,,missed,,3pt,15,30
Chris Kaman,DeAndre Jordan,Eric Gordon,Steve Blake,Travis Outlaw,Brandon Jennings,Charlie Bell,Ersan Ilyasova,Jerry Stackhouse,Kurt Thomas,1,1:14,MIL,rebound,,,,,,,,,,Ersan Ilyasova,,,,,,off,,
Chris Kaman,DeAndre Jordan,Eric Gordon,Steve Blake,Travis Outlaw,Brandon Jennings,Charlie Bell,Ersan Ilyasova,Jerry Stackhouse,Kurt Thomas,1,1:14,MIL,shot,,,,,,,,,,Ersan Ilyasova,,,,missed,,tip,25,6
Chris Kaman,DeAndre Jordan,Eric Gordon,Steve Blake,Travis Outlaw,Brandon Jennings,Charlie Bell,Ersan Ilyasova,Jerry Stackhouse,Kurt Thomas,1,1:13,MIL,rebound,,,,,,,,,,Kurt Thomas,,,,,,off,,
Chris Kaman,DeAndre Jordan,Eric Gordon,Steve Blake,Travis Outlaw,Brandon Jennings,Charlie Bell,Ersan Ilyasova,Jerry Stackhouse,Kurt Thomas,1,1:13,MIL,shot,,,,,,,,,,Kurt Thomas,,,,missed,,tip,25,6
Chris Kaman,DeAndre Jordan,Eric Gordon,Steve Blake,Travis Outlaw,Brandon Jennings,Charlie Bell,Ersan Ilyasova,Jerry Stackhouse,Kurt Thomas,1,1:12,MIL,rebound,,,,,,,,,,Kurt Thomas,,,,,,off,,
Chris Kaman,DeAndre Jordan,Eric Gordon,Steve Blake,Travis Outlaw,Brandon Jennings,Charlie Bell,Ersan Ilyasova,Jerry Stackhouse,Kurt Thomas,1,1:08,MIL,shot,Kurt Thomas,,,,,,,,,Brandon Jennings,3,,,made,,3pt,48,6
Chris Kaman,DeAndre Jordan,Eric Gordon,Steve Blake,Travis Outlaw,Brandon Jennings,Charlie Bell,Ersan Ilyasova,Jerry Stackhouse,Kurt Thomas,1,0:49,LAC,shot,,,,,,,,,,Chris Kaman,,,,missed,,layup,25,6
Chris Kaman,DeAndre Jordan,Eric Gordon,Steve Blake,Travis Outlaw,Brandon Jennings,Charlie Bell,Ersan Ilyasova,Jerry Stackhouse,Kurt Thomas,1,0:48,MIL,rebound,,,,,,,,,,Ersan Ilyasova,,,,,,def,,
Chris Kaman,DeAndre Jordan,Eric Gordon,Steve Blake,Travis Outlaw,Brandon Jennings,Charlie Bell,Ersan Ilyasova,Jerry Stackhouse,Kurt Thomas,1,0:38,MIL,shot,,,,,,,,,,Brandon Jennings,,,,missed,,layup,25,6
Chris Kaman,DeAndre Jordan,Eric Gordon,Steve Blake,Travis Outlaw,Brandon Jennings,Charlie Bell,Ersan Ilyasova,Jerry Stackhouse,Kurt Thomas,1,0:37,LAC,rebound,,,,,,,,,,Chris Kaman,,,,,,def,,
Chris Kaman,DeAndre Jordan,Eric Gordon,Steve Blake,Travis Outlaw,Brandon Jennings,Charlie Bell,Ersan Ilyasova,Jerry Stackhouse,Kurt Thomas,1,0:29,LAC,shot,Steve Blake,,,,,,,,,DeAndre Jordan,2,,,made,,alley oop dunk,25,6
Chris Kaman,DeAndre Jordan,Eric Gordon,Steve Blake,Travis Outlaw,Brandon Jennings,Charlie Bell,Ersan Ilyasova,Jerry Stackhouse,Kurt Thomas,1,0:07,MIL,shot,,,,,,,,,,Jerry Stackhouse,,,,missed,,3pt,49,9
Chris Kaman,DeAndre Jordan,Eric Gordon,Steve Blake,Travis Outlaw,Brandon Jennings,Charlie Bell,Ersan Ilyasova,Jerry Stackhouse,Kurt Thomas,1,0:05,LAC,rebound,,,,,,,,,,Steve Blake,,,,,,def,,
Chris Kaman,DeAndre Jordan,Eric Gordon,Steve Blake,Travis Outlaw,Brandon Jennings,Charlie Bell,Ersan Ilyasova,Jerry Stackhouse,Kurt Thomas,1,0:00,LAC,shot,Steve Blake,,,,,,,,,DeAndre Jordan,2,,,made,,layup,25,6
Chris Kaman,DeAndre Jordan,Eric Gordon,Steve Blake,Travis Outlaw,Brandon Jennings,Charlie Bell,Ersan Ilyasova,Jerry Stackhouse,Kurt Thomas,1,0:00,MIL,shot,,,,,,,,,,Ersan Ilyasova,,,,missed,,3pt,35,40
Chris Kaman,DeAndre Jordan,Eric Gordon,Steve Blake,Travis Outlaw,Brandon Jennings,Charlie Bell,Ersan Ilyasova,Jerry Stackhouse,Kurt Thomas,1,0:00,MIL,rebound,,,,,,,,,,,,,,,,,,
Craig Smith,DeAndre Jordan,Eric Gordon,Rasual Butler,Travis Outlaw,Charlie Bell,Ersan Ilyasova,Jerry Stackhouse,Kurt Thomas,Luke Ridnour,2,11:45,LAC,shot,,,,,,,,,,Rasual Butler,,,,missed,,layup,25,6
Craig Smith,DeAndre Jordan,Eric Gordon,Rasual Butler,Travis Outlaw,Charlie Bell,Ersan Ilyasova,Jerry Stackhouse,Kurt Thomas,Luke Ridnour,2,11:44,LAC,rebound,,,,,,,,,,DeAndre Jordan,,,,,,off,,
Craig Smith,DeAndre Jordan,Eric Gordon,Rasual Butler,Travis Outlaw,Charlie Bell,Ersan Ilyasova,Jerry Stackhouse,Kurt Thomas,Luke Ridnour,2,11:44,LAC,shot,,,,,,,,,,DeAndre Jordan,,,,missed,,tip,25,6
Craig Smith,DeAndre Jordan,Eric Gordon,Rasual Butler,Travis Outlaw,Charlie Bell,Ersan Ilyasova,Jerry Stackhouse,Kurt Thomas,Luke Ridnour,2,11:42,LAC,rebound,,,,,,,,,,Travis Outlaw,,,,,,off,,
Craig Smith,DeAndre Jordan,Eric Gordon,Rasual Butler,Travis Outlaw,Charlie Bell,Ersan Ilyasova,Jerry Stackhouse,Kurt Thomas,Luke Ridnour,2,11:33,LAC,shot,,,,,,,,,,Travis Outlaw,2,,,made,,jump,17,10
Craig Smith,DeAndre Jordan,Eric Gordon,Rasual Butler,Travis Outlaw,Charlie Bell,Ersan Ilyasova,Jerry Stackhouse,Kurt Thomas,Luke Ridnour,2,11:15,MIL,shot,,,,,,,,,,Ersan Ilyasova,2,,,made,,hook,30,9
Craig Smith,DeAndre Jordan,Eric Gordon,Rasual Butler,Travis Outlaw,Charlie Bell,Ersan Ilyasova,Jerry Stackhouse,Kurt Thomas,Luke Ridnour,2,11:15,LAC,foul,,,,,,,,Ersan Ilyasova,,Craig Smith,,,,,,shooting,,
Craig Smith,DeAndre Jordan,Eric Gordon,Rasual Butler,Travis Outlaw,Charlie Bell,Ersan Ilyasova,Jerry Stackhouse,Kurt Thomas,Luke Ridnour,2,11:15,MIL,free throw,,,,,,,1,,1,Ersan Ilyasova,,,foul,made,,,,
Craig Smith,DeAndre Jordan,Eric Gordon,Rasual Butler,Travis Outlaw,Charlie Bell,Ersan Ilyasova,Jerry Stackhouse,Kurt Thomas,Luke Ridnour,2,11:04,LAC,turnover,,,,,,,,,,Travis Outlaw,,,out of bounds lost ball turnover,,,,,
Craig Smith,DeAndre Jordan,Eric Gordon,Rasual Butler,Travis Outlaw,Charlie Bell,Ersan Ilyasova,Jerry Stackhouse,Kurt Thomas,Luke Ridnour,2,10:52,MIL,turnover,,,,,,,,,,Jerry Stackhouse,,,bad pass,,,,,
Craig Smith,DeAndre Jordan,Eric Gordon,Rasual Butler,Travis Outlaw,Charlie Bell,Ersan Ilyasova,Jerry Stackhouse,Kurt Thomas,Luke Ridnour,2,10:35,LAC,shot,,,,,,,,,,Eric Gordon,2,,,made,,layup,25,6
Craig Smith,DeAndre Jordan,Eric Gordon,Rasual Butler,Travis Outlaw,Charlie Bell,Ersan Ilyasova,Jerry Stackhouse,Kurt Thomas,Luke Ridnour,2,10:35,MIL,foul,,,,,,,,Eric Gordon,,Charlie Bell,,,,,,shooting,,
Craig Smith,DeAndre Jordan,Eric Gordon,Rasual Butler,Travis Outlaw,Ersan Ilyasova,Jerry Stackhouse,John Salmons,Kurt Thomas,Luke Ridnour,2,10:35,MIL,sub,,,,John Salmons,,Charlie Bell,,,,,,,,,,,,
Craig Smith,DeAndre Jordan,Eric Gordon,Rasual Butler,Travis Outlaw,Ersan Ilyasova,Jerry Stackhouse,John Salmons,Kurt Thomas,Luke Ridnour,2,10:35,LAC,free throw,,,,,,,1,,1,Eric Gordon,,,foul,made,,,,
Craig Smith,DeAndre Jordan,Eric Gordon,Rasual Butler,Travis Outlaw,Ersan Ilyasova,Jerry Stackhouse,John Salmons,Kurt Thomas,Luke Ridnour,2,10:21,MIL,shot,John Salmons,,,,,,,,,Jerry Stackhouse,3,,,made,,3pt,49,7
Craig Smith,DeAndre Jordan,Eric Gordon,Rasual Butler,Travis Outlaw,Ersan Ilyasova,Jerry Stackhouse,John Salmons,Kurt Thomas,Luke Ridnour,2,10:04,LAC,shot,Craig Smith,,,,,,,,,Travis Outlaw,3,,,made,,3pt,49,8
Craig Smith,DeAndre Jordan,Eric Gordon,Rasual Butler,Travis Outlaw,Ersan Ilyasova,Jerry Stackhouse,John Salmons,Kurt Thomas,Luke Ridnour,2,9:53,LAC,foul,,,,,,,,Ersan Ilyasova,,Eric Gordon,,,,,,shooting,,