a1,a2,a3,a4,a5,h1,h2,h3,h4,h5,period,time,team,etype,assist,away,block,entered,home,left,num,opponent,outof,player,points,possession,reason,result,steal,type,x,y
Marc Gasol,Mike Conley,O.J. Mayo,Rudy Gay,Zach Randolph,Andrew Bogut,Brandon Jennings,Charlie Bell,John Salmons,Luc Richard Mbah a Moute,1,12:00,OFF,jump ball,,Marc Gasol,,,Andrew Bogut,,,,,,,O.J. Mayo,,,,,,
Marc Gasol,Mike Conley,O.J. Mayo,Rudy Gay,Zach Randolph,Andrew Bogut,Brandon Jennings,Charlie Bell,John Salmons,Luc Richard Mbah a Moute,1,11:38,MEM,shot,,,,,,,,,,Zach Randolph,2,,,made,,jump,17,14
Marc Gasol,Mike Conley,O.J. Mayo,Rudy Gay,Zach Randolph,Andrew Bogut,Brandon Jennings,Charlie Bell,John Salmons,Luc Richard Mbah a Moute,1,11:18,MIL,shot,John Salmons,,,,,,,,,Andrew Bogut,2,,,made,,hook,32,9
Marc Gasol,Mike Conley,O.J. Mayo,Rudy Gay,Zach Randolph,Andrew Bogut,Brandon Jennings,Charlie Bell,John Salmons,Luc Richard Mbah a Moute,1,11:06,MEM,shot,,,Luc Richard Mbah a Moute,,,,,,,Zach Randolph,,,,missed,,layup,25,6
Marc Gasol,Mike Conley,O.J. Mayo,Rudy Gay,Zach Randolph,Andrew Bogut,Brandon Jennings,Charlie Bell,John Salmons,Luc Richard Mbah a Moute,1,11:03,MIL,rebound,,,,,,,,,,Brandon Jennings,,,,,,def,,
Marc Gasol,Mike Conley,O.J. Mayo,Rudy Gay,Zach Randolph,Andrew Bogut,Brandon Jennings,Charlie Bell,John Salmons,Luc Richard Mbah a Moute,1,10:54,MIL,shot,Brandon Jennings,,,,,,,,,Charlie Bell,2,,,made,,layup,25,6
Marc Gasol,Mike Conley,O.J. Mayo,Rudy Gay,Zach Randolph,Andrew Bogut,Brandon Jennings,Charlie Bell,John Salmons,Luc Richard Mbah a Moute,1,10:28,MEM,turnover,,,,,,,,,,Rudy Gay,,,lost ball,,John Salmons,,,
Marc Gasol,Mike Conley,O.J. Mayo,Rudy Gay,Zach Randolph,Andrew Bogut,Brandon Jennings,Charlie Bell,John Salmons,Luc Richard Mbah a Moute,1,10:18,MIL,shot,,,,,,,,,,Andrew Bogut,,,,missed,,jump,28,8
Marc Gasol,Mike Conley,O.J. Mayo,Rudy Gay,Zach Randolph,Andrew Bogut,Brandon Jennings,Charlie Bell,John Salmons,Luc Richard Mbah a Moute,1,10:16,MEM,rebound,,,,,,,,,,Marc Gasol,,,,,,def,,
Marc Gasol,Mike Conley,O.J. Mayo,Rudy Gay,Zach Randolph,Andrew Bogut,Brandon Jennings,Charlie Bell,John Salmons,Luc Richard Mbah a Moute,1,10:12,MIL,foul,,,,,,,,Zach Randolph,,Luc Richard Mbah a Moute,,,,,,personal,,
Marc Gasol,Mike Conley,O.J. Mayo,Rudy Gay,Zach Randolph,Andrew Bogut,Brandon Jennings,Charlie Bell,John Salmons,Luc Richard Mbah a Moute,1,9:56,MEM,shot,,,,,,,,,,Zach Randolph,,,,missed,,jump,34,21
Marc Gasol,Mike Conley,O.J. Mayo,Rudy Gay,Zach Randolph,Andrew Bogut,Brandon Jennings,Charlie Bell,John Salmons,Luc Richard Mbah a Moute,1,9:55,MIL,rebound,,,,,,,,,,Luc Richard Mbah a Moute,,,,,,def,,
Marc Gasol,Mike Conley,O.J. Mayo,Rudy Gay,Zach Randolph,Andrew Bogut,Brandon Jennings,Charlie Bell,John Salmons,Luc Richard Mbah a Moute,1,9:47,MIL,shot,,,,,,,,,,Brandon Jennings,,,,missed,,jump,42,11
Marc Gasol,Mike Conley,O.J. Mayo,Rudy Gay,Zach Randolph,Andrew Bogut,Brandon Jennings,Charlie Bell,John Salmons,Luc Richard Mbah a Moute,1,9:46,MEM,rebound,,,,,,,,,,Zach Randolph,,,,,,def,,
Marc Gasol,Mike Conley,O.J. Mayo,Rudy Gay,Zach Randolph,Andrew Bogut,Brandon Jennings,Charlie Bell,John Salmons,Luc Richard Mbah a Moute,1,9:35,MEM,foul,,,,,,,,Andrew Bogut,,Marc Gasol,,,,,,offensive,,
Marc Gasol,Mike Conley,O.J. Mayo,Rudy Gay,Zach Randolph,Andrew Bogut,Brandon Jennings,Charlie Bell,John Salmons,Luc Richard Mbah a Moute,1,9:35,MEM,turnover,,,,,,,,,,Marc Gasol,,,foul,,,,,
Marc Gasol,Mike Conley,O.J. Mayo,Rudy Gay,Zach Randolph,Andrew Bogut,Brandon Jennings,Charlie Bell,John Salmons,Luc Richard Mbah a Moute,1,9:27,MIL,shot,Brandon Jennings,,,,,,,,,Andrew Bogut,2,,,made,,layup,25,6
Marc Gasol,Mike Conley,O.J. Mayo,Rudy Gay,Zach Randolph,Andrew Bogut,Brandon Jennings,Charlie Bell,John Salmons,Luc Richard Mbah a Moute,1,9:10,MEM,shot,,,,,,,,,,O.J. Mayo,,,,missed,,jump,19,12
Marc Gasol,Mike Conley,O.J. Mayo,Rudy Gay,Zach Randolph,Andrew Bogut,Brandon Jennings,Charlie Bell,John Salmons,Luc Richard Mbah a Moute,1,9:08,MIL,rebound,,,,,,,,,,Brandon Jennings,,,,,,def,,
Marc Gasol,Mike Conley,O.J. Mayo,Rudy Gay,Zach Randolph,Andrew Bogut,Brandon Jennings,Charlie Bell,John Salmons,Luc Richard Mbah a Moute,1,8:55,MIL,shot,Brandon Jennings,,,,,,,,,Andrew Bogut,2,,,made,,hook,20,5
Marc Gasol,Mike Conley,O.J. Mayo,Rudy Gay,Zach Randolph,Andrew Bogut,Brandon Jennings,Charlie Bell,John Salmons,Luc Richard Mbah a Moute,1,8:50,MEM,timeout,,,,,,,,,,,,,,,,regular,,
Marc Gasol,Mike Conley,O.J. Mayo,Rudy Gay,Zach Randolph,Andrew Bogut,Brandon Jennings,Charlie Bell,John Salmons,Luc Richard Mbah a Moute,1,8:46,MEM,shot,,,,,,,,,,Rudy Gay,,,,missed,,layup,25,6
Marc Gasol,Mike Conley,O.J. Mayo,Rudy Gay,Zach Randolph,Andrew Bogut,Brandon Jennings,Charlie Bell,John Salmons,Luc Richard Mbah a Moute,1,8:45,MEM,rebound,,,,,,,,,,Zach Randolph,,,,,,off,,
Marc Gasol,Mike Conley,O.J. Mayo,Rudy Gay,Zach Randolph,Andrew Bogut,Brandon Jennings,Charlie Bell,John Salmons,Luc Richard Mbah a Moute,1,8:44,MEM,shot,,,,,,,,,,Zach Randolph,2,,,made,,layup,25,6
Marc Gasol,Mike Conley,O.J. Mayo,Rudy Gay,Zach Randolph,Andrew Bogut,Brandon Jennings,Charlie Bell,John Salmons,Luc Richard Mbah a Moute,1,8:44,MIL,foul,,,,,,,,Zach Randolph,,Luc Richard Mbah a Moute,,,,,,shooting,,
Marc Gasol,Mike Conley,O.J. Mayo,Rudy Gay,Zach Randolph,Andrew Bogut,Brandon Jennings,Charlie Bell,Ersan Ilyasova,John Salmons,1,8:44,MIL,sub,,,,Ersan Ilyasova,,Luc Richard Mbah a Moute,,,,,,,,,,,,
Marc Gasol,Mike Conley,O.J. Mayo,Rudy Gay,Zach Randolph,Andrew Bogut,Brandon Jennings,Charlie Bell,Ersan Ilyasova,John Salmons,1,8:44,MEM,free throw,,,,,,,1,,1,Zach Randolph,,,foul,missed,,,,
Marc Gasol,Mike Conley,O.J. Mayo,Rudy Gay,Zach Randolph,Andrew Bogut,Brandon Jennings,Charlie Bell,Ersan Ilyasova,John Salmons,1,8:43,MIL,rebound,,,,,,,,,,Ersan Ilyasova,,,,,,def,,
Marc Gasol,Mike Conley,O.J. Mayo,Rudy Gay,Zach Randolph,Andrew Bogut,Brandon Jennings,Charlie Bell,Ersan Ilyasova,John Salmons,1,8:29,MIL,shot,Brandon Jennings,,,,,,,,,John Salmons,2,,,made,,jump,39,13
Marc Gasol,Mike Conley,O.J. Mayo,Rudy Gay,Zach Randolph,Andrew Bogut,Brandon Jennings,Charlie Bell,Ersan Ilyasova,John Salmons,1,8:08,MEM,shot,,,,,,,,,,Zach Randolph,2,,,made,,hook,24,10
Marc Gasol,Mike Conley,O.J. Mayo,Rudy Gay,Zach Randolph,Andrew Bogut,Brandon Jennings,Charlie Bell,Ersan Ilyasova,John Salmons,1,8:08,MIL,foul,,,,,,,,Zach Randolph,,Ersan Ilyasova,,,,,,shooting,,
Marc Gasol,Mike Conley,O.J. Mayo,Rudy Gay,Zach Randolph,Andrew Bogut,Brandon Jennings,Charlie Bell,Ersan Ilyasova,John Salmons,1,8:08,MEM,free throw,,,,,,,1,,1,Zach Randolph,,,foul,missed,,,,
Marc Gasol,Mike Conley,O.J. Mayo,Rudy Gay,Zach Randolph,Andrew Bogut,Brandon Jennings,Charlie Bell,Ersan Ilyasova,John Salmons,1,8:08,MEM,rebound,,,,,,,,,,Rudy Gay,,,,,,off,,
Marc Gasol,Mike Conley,O.J. Mayo,Rudy Gay,Zach Randolph,Andrew Bogut,Brandon Jennings,Charlie Bell,Ersan Ilyasova,John Salmons,1,7:51,MEM,shot,Rudy Gay,,,,,,,,,Zach Randolph,2,,,made,,layup,25,6
Marc Gasol,Mike Conley,O.J. Mayo,Rudy Gay,Zach Randolph,Andrew Bogut,Brandon Jennings,Charlie Bell,Ersan Ilyasova,John Salmons,1,7:33,MIL,shot,Charlie Bell,,,,,,,,,Brandon Jennings,3,,,made,,3pt,43,25
Marc Gasol,Mike Conley,O.J. Mayo,Rudy Gay,Zach Randolph,Andrew Bogut,Brandon Jennings,Charlie Bell,Ersan Ilyasova,John Salmons,1,7:12,MEM,shot,Mike Conley,,,,,,,,,Rudy Gay,2,,,made,,jump,14,16
Marc Gasol,Mike Conley,O.J. Mayo,Rudy Gay,Zach Randolph,Andrew Bogut,Brandon Jennings,Charlie Bell,Ersan Ilyasova,John Salmons,1,6:53,MIL,shot,,,,,,,,,,Brandon Jennings,,,,missed,,3pt,46,21
Marc Gasol,Mike Conley,O.J. Mayo,Rudy Gay,Zach Randolph,Andrew Bogut,Brandon Jennings,Charlie Bell,Ersan Ilyasova,John Salmons,1,6:52,MIL,rebound,,,,,,,,,,Andrew Bogut,,,,,,off,,
Marc Gasol,Mike Conley,O.J. Mayo,Rudy Gay,Zach Randolph,Andrew Bogut,Brandon Jennings,Charlie Bell,Ersan Ilyasova,John Salmons,1,6:44,MIL,turnover,,,,,,,,,,Brandon Jennings,,,lost ball,,Mike Conley,,,
Marc Gasol,Mike Conley,O.J. Mayo,Rudy Gay,Zach Randolph,Andrew Bogut,Brandon Jennings,Charlie Bell,Ersan Ilyasova,John Salmons,1,6:43,MEM,timeout,,,,,,,,,,,,,,,,short,,
Hasheem Thabeet,Mike Conley,O.J. Mayo,Rudy Gay,Zach Randolph,Andrew Bogut,Brandon Jennings,Charlie Bell,Ersan Ilyasova,John Salmons,1,6:43,MEM,sub,,,,Hasheem Thabeet,,Marc Gasol,,,,,,,,,,,,
Hasheem Thabeet,Mike Conley,O.J. Mayo,Rudy Gay,Zach Randolph,Andrew Bogut,Brandon Jennings,Charlie Bell,Ersan Ilyasova,John Salmons,1,6:20,MEM,shot,,,,,,,,,,Mike Conley,,,,missed,,jump,24,18
Hasheem Thabeet,Mike Conley,O.J. Mayo,Rudy Gay,Zach Randolph,Andrew Bogut,Brandon Jennings,Charlie Bell,Ersan Ilyasova,John Salmons,1,6:19,MEM,rebound,,,,,,,,,,Zach Randolph,,,,,,off,,
Hasheem Thabeet,Mike Conley,O.J. Mayo,Rudy Gay,Zach Randolph,Andrew Bogut,Brandon Jennings,Charlie Bell,Ersan Ilyasova,John Salmons,1,6:17,MEM,shot,,,,,,,,,,Zach Randolph,,,,missed,,layup,25,6
Hasheem Thabeet,Mike Conley,O.J. Mayo,Rudy Gay,Zach Randolph,Andrew Bogut,Brandon Jennings,Charlie Bell,Ersan Ilyasova,John Salmons,1,6:16,MEM,rebound,,,,,,,,,,Mike Conley,,,,,,off,,
Hasheem Thabeet,Mike Conley,O.J. Mayo,Rudy Gay,Zach Randolph,Andrew Bogut,Brandon Jennings,Charlie Bell,Ersan Ilyasova,John Salmons,1,6:13,MEM,shot,,,,,,,,,,Mike Conley,,,,missed,,3pt,5,24
Hasheem Thabeet,Mike Conley,O.J. Mayo,Rudy Gay,Zach Randolph,Andrew Bogut,Brandon Jennings,Charlie Bell,Ersan Ilyasova,John Salmons,1,6:13,MEM,rebound,,,,,,,,,,Zach Randolph,,,,,,off,,
Hasheem Thabeet,Mike Conley,O.J. Mayo,Rudy Gay,Zach Randolph,Andrew Bogut,Brandon Jennings,Charlie Bell,Ersan Ilyasova,John Salmons,1,6:13,MEM,shot,,,,,,,,,,Zach Randolph,2,,,made,,layup,25,6
Hasheem Thabeet,Mike Conley,O.J. Mayo,Rudy Gay,Zach Randolph,Andrew Bogut,Brandon Jennings,Charlie Bell,Ersan Ilyasova,John Salmons,1,6:13,MIL,foul,,,,,,,,Zach Randolph,,Ersan Ilyasova,,,,,,shooting,,
Hasheem Thabeet,Mike Conley,O.J. Mayo,Rudy Gay,Zach Randolph,Andrew Bogut,Brandon Jennings,Charlie Bell,John Salmons,Kurt Thomas,1,6:13,MIL,sub,,,,Kurt Thomas,,Ersan Ilyasova,,,,,,,,,,,,
Hasheem Thabeet,Mike Conley,O.J. Mayo,Rudy Gay,Zach Randolph,Andrew Bogut,Brandon Jennings,Charlie Bell,John Salmons,Kurt Thomas,1,6:13,MEM,free throw,,,,,,,1,,1,Zach Randolph,,,foul,made,,,,
Hasheem Thabeet,Mike Conley,O.J. Mayo,Rudy Gay,Zach Randolph,Andrew Bogut,Brandon Jennings,Charlie Bell,John Salmons,Kurt Thomas,1,5:55,MIL,shot,,,,,,,,,,Andrew Bogut,,,,missed,,hook,27,10
Hasheem Thabeet,Mike Conley,O.J. Mayo,Rudy Gay,Zach Randolph,Andrew Bogut,Brandon Jennings,Charlie Bell,John Salmons,Kurt Thomas,1,5:54,MEM,rebound,,,,,,,,,,Hasheem Thabeet,,,,,,def,,
Hasheem Thabeet,Mike Conley,O.J. Mayo,Rudy Gay,Zach Randolph,Andrew Bogut,Brandon Jennings,Charlie Bell,John Salmons,Kurt Thomas,1,5:41,MEM,shot,Mike Conley,,,,,,,,,O.J. Mayo,2,,,made,,jump,17,16
Hasheem Thabeet,Mike Conley,O.J. Mayo,Rudy Gay,Zach Randolph,Andrew Bogut,Brandon Jennings,Charlie Bell,John Salmons,Kurt Thomas,1,5:15,MIL,shot,,,,,,,,,,Brandon Jennings,,,,missed,,jump,20,10
Hasheem Thabeet,Mike Conley,O.J. Mayo,Rudy Gay,Zach Randolph,Andrew Bogut,Brandon Jennings,Charlie Bell,John Salmons,Kurt Thomas,1,5:13,MIL,rebound,,,,,,,,,,Charlie Bell,,,,,,off,,
Hasheem Thabeet,Mike Conley,O.J. Mayo,Rudy Gay,Zach Randolph,Andrew Bogut,Brandon Jennings,Charlie Bell,John Salmons,Kurt Thomas,1,5:05,MIL,shot,,,,,,,,,,Brandon Jennings,,,,missed,,jump,38,5
Hasheem Thabeet,Mike Conley,O.J. Mayo,Rudy Gay,Zach Randolph,Andrew Bogut,Brandon Jennings,Charlie Bell,John Salmons,Kurt Thomas,1,5:04,MEM,rebound,,,,,,,,,,O.J. Mayo,,,,,,def,,
Hasheem Thabeet,Mike Conley,O.J. Mayo,Rudy Gay,Zach Randolph,Andrew Bogut,Brandon Jennings,Charlie Bell,John Salmons,Kurt Thomas,1,4:49,MEM,shot,,,,,,,,,,Zach Randolph,,,,missed,,jump,39,16
Hasheem Thabeet,Mike Conley,O.J. Mayo,Rudy Gay,Zach Randolph,Andrew Bogut,Brandon Jennings,Charlie Bell,John Salmons,Kurt Thomas,1,4:47,MIL,rebound,,,,,,,,,,Andrew Bogut,,,,,,def,,
Hasheem Thabeet,Mike Conley,O.J. Mayo,Rudy Gay,Zach Randolph,Andrew Bogut,Brandon Jennings,Charlie Bell,John Salmons,Kurt Thomas,1,4:39,MIL,shot,,,,,,,,,,Andrew Bogut,,,,missed,,jump,22,9
Hasheem Thabeet,Mike Conley,O.J. Mayo,Rudy Gay,Zach Randolph,Andrew Bogut,Brandon Jennings,Charlie Bell,John Salmons,Kurt Thomas,1,4:39,MEM,rebound,,,,,,,,,,,,,,,,,,
Hasheem Thabeet,Mike Conley,O.J. Mayo,Rudy Gay,Zach Randolph,Andrew Bogut,Brandon Jennings,Charlie Bell,John Salmons,Kurt Thomas,1,4:21,MEM,turnover,,,,,,,,,,Zach Randolph,,,lost ball,,Brandon Jennings,,,
Hasheem Thabeet,Mike Conley,O.J. Mayo,Rudy Gay,Zach Randolph,Andrew Bogut,Brandon Jennings,Charlie Bell,John Salmons,Kurt Thomas,1,4:16,MIL,shot,,,,,,,,,,Brandon Jennings,2,,,made,,layup,25,6
Hasheem Thabeet,Mike Conley,O.J. Mayo,Rudy Gay,Zach Randolph,Andrew Bogut,Brandon Jennings,Charlie Bell,John Salmons,Kurt Thomas,1,3:55,MEM,shot,,,Andrew Bogut,,,,,,,Rudy Gay,,,,missed,,layup,25,6
Hasheem Thabeet,Mike Conley,O.J. Mayo,Rudy Gay,Zach Randolph,Andrew Bogut,Brandon Jennings,Charlie Bell,John Salmons,Kurt Thomas,1,3:55,MEM,rebound,,,,,,,,,,,,,,,,,,
Hasheem Thabeet,Mike Conley,O.J. Mayo,Rudy Gay,Zach Randolph,Andrew Bogut,Brandon Jennings,Jerry Stackhouse,John Salmons,Kurt Thomas,1,3:55,MIL,sub,,,,Jerry Stackhouse,,Charlie Bell,,,,,,,,,,,,
Hasheem Thabeet,Mike Conley,O.J. Mayo,Rudy Gay,Zach Randolph,Andrew Bogut,Brandon Jennings,Jerry Stackhouse,John Salmons,Kurt Thomas,1,3:48,MEM,shot,,,,,,,,,,Zach Randolph,2,,,made,,jump,8,8
Hasheem Thabeet,Mike Conley,O.J. Mayo,Rudy Gay,Zach Randolph,Andrew Bogut,Brandon Jennings,Jerry Stackhouse,John Salmons,Kurt Thomas,1,3:29,MIL,shot,,,,,,,,,,Andrew Bogut,2,,,made,,hook,27,11
Hasheem Thabeet,Mike Conley,O.J. Mayo,Rudy Gay,Zach Randolph,Andrew Bogut,Brandon Jennings,Jerry Stackhouse,John Salmons,Kurt Thomas,1,3:05,MEM,shot,,,,,,,,,,Zach Randolph,,,,missed,,layup,25,6
Hasheem Thabeet,Mike Conley,O.J. Mayo,Rudy Gay,Zach Randolph,Andrew Bogut,Brandon Jennings,Jerry Stackhouse,John Salmons,Kurt Thomas,1,3:04,MIL,rebound,,,,,,,,,,Andrew Bogut,,,,,,def,,
Hasheem Thabeet,Mike Conley,O.J. Mayo,Rudy Gay,Zach Randolph,Andrew Bogut,Brandon Jennings,Jerry Stackhouse,John Salmons,Kurt Thomas,1,3:04,MEM,foul,,,,,,,,Andrew Bogut,,Hasheem Thabeet,,,,,,personal,,
Hasheem Thabeet,Mike Conley,O.J. Mayo,Rudy Gay,Zach Randolph,Andrew Bogut,Brandon Jennings,Jerry Stackhouse,John Salmons,Kurt Thomas,1,2:57,MIL,turnover,,,,,,,,,,Andrew Bogut,,,lost ball,,Mike Conley,,,
Hasheem Thabeet,Mike Conley,O.J. Mayo,Rudy Gay,Zach Randolph,Andrew Bogut,Brandon Jennings,Jerry Stackhouse,John Salmons,Kurt Thomas,1,2:53,MEM,shot,Rudy Gay,,,,,,,,,Mike Conley,2,,,made,,layup,25,6
Hasheem Thabeet,Mike Conley,O.J. Mayo,Rudy Gay,Zach Randolph,Andrew Bogut,Brandon Jennings,Jerry Stackhouse,John Salmons,Kurt Thomas,1,2:27,MIL,shot,,,,,,,,,,Kurt Thomas,,,,missed,,jump,16,17
Hasheem Thabeet,Mike Conley,O.J. Mayo,Rudy Gay,Zach Randolph,Andrew Bogut,Brandon Jennings,Jerry Stackhouse,John Salmons,Kurt Thomas,1,2:26,MEM,rebound,,,,,,,,,,Hasheem Thabeet,,,,,,def,,
Hasheem Thabeet,Mike Conley,O.J. Mayo,Rudy Gay,Zach Randolph,Andrew Bogut,Brandon Jennings,Jerry Stackhouse,John Salmons,Kurt Thomas,1,2:18,MEM,shot,Mike Conley,,,,,,,,,O.J. Mayo,2,,,made,,jump,9,8
Hasheem Thabeet,Mike Conley,O.J. Mayo,Rudy Gay,Zach Randolph,Andrew Bogut,Brandon Jennings,Jerry Stackhouse,John Salmons,Kurt Thomas,1,2:10,MIL,timeout,,,,,,,,,,,,,,,,regular,,
Hasheem Thabeet,Mike Conley,O.J. Mayo,Rudy Gay,Zach Randolph,Andrew Bogut,Jerry Stackhouse,John Salmons,Kurt Thomas,Luke Ridnour,1,2:10,MIL,sub,,,,Luke Ridnour,,Brandon Jennings,,,,,,,,,,,,
Hasheem Thabeet,Marcus Williams,O.J. Mayo,Rudy Gay,Zach Randolph,Andrew Bogut,Jerry Stackhouse,John Salmons,Kurt Thomas,Luke Ridnour,1,2:10,MEM,sub,,,,Marcus Williams,,Mike Conley,,,,,,,,,,,,
Hasheem Thabeet,Marcus Williams,O.J. Mayo,Rudy Gay,Zach Randolph,Andrew Bogut,Jerry Stackhouse,John Salmons,Kurt Thomas,Luke Ridnour,1,2:00,MIL,shot,Luke Ridnour,,,,,,,,,John Salmons,2,,,made,,jump,16,21
Hasheem Thabeet,Marcus Williams,O.J. Mayo,Rudy Gay,Zach Randolph,Andrew Bogut,Jerry Stackhouse,John Salmons,Kurt Thomas,Luke Ridnour,1,1:44,MEM,shot,,,,,,,,,,Rudy Gay,2,,,made,,jump,15,5
Hasheem Thabeet,Marcus Williams,O.J. Mayo,Rudy Gay,Zach Randolph,Andrew Bogut,Jerry Stackhouse,John Salmons,Kurt Thomas,Luke Ridnour,1,1:44,MEM,foul,,,,,,,,Kurt Thomas,,Zach Randolph,,,,,,personal,,
Hasheem Thabeet,Marcus Williams,O.J. Mayo,Rudy Gay,Zach Randolph,Andrew Bogut,Jerry Stackhouse,John Salmons,Kurt Thomas,Luke Ridnour,1,1:30,MEM,foul,,,,,,,,,,Marcus Williams,,,,,,defense 3 second,,
Hasheem Thabeet,Marcus Williams,O.J. Mayo,Rudy Gay,Zach Randolph,Andrew Bogut,Jerry Stackhouse,John Salmons,Kurt Thomas,Luke Ridnour,1,1:30,MIL,free throw,,,,,,,1,,1,John Salmons,,,technical,made,,,,
Hasheem Thabeet,Marcus Williams,O.J. Mayo,Rudy Gay,Zach Randolph,Andrew Bogut,Jerry Stackhouse,John Salmons,Kurt Thomas,Luke Ridnour,1,1:26,MIL,turnover,,,,,,,,,,Luke Ridnour,,,lost ball,,Marcus Williams,,,
Hasheem Thabeet,Marcus Williams,O.J. Mayo,Rudy Gay,Zach Randolph,Andrew Bogut,Jerry Stackhouse,John Salmons,Kurt Thomas,Luke Ridnour,1,1:21,MEM,shot,,,,,,,,,,O.J. Mayo,,,,missed,,layup,25,6
Hasheem Thabeet,Marcus Williams,O.J. Mayo,Rudy Gay,Zach Randolph,Andrew Bogut,Jerry Stackhouse,John Salmons,Kurt Thomas,Luke Ridnour,1,1:20,MIL,rebound,,,,,,,,,,Kurt Thomas,,,,,,def,,
Hasheem Thabeet,Marcus Williams,O.J. Mayo,Rudy Gay,Zach Randolph,Andrew Bogut,Jerry Stackhouse,John Salmons,Kurt Thomas,Luke Ridnour,1,1:12,MIL,shot,John Salmons,,,,,,,,,Kurt Thomas,2,,,made,,jump,41,8
Hasheem Thabeet,Marcus Williams,O.J. Mayo,Rudy Gay,Zach Randolph,Andrew Bogut,Jerry Stackhouse,John Salmons,Kurt Thomas,Luke Ridnour,1,0:52,MEM,shot,,,,,,,,,,Hasheem Thabeet,,,,missed,,hook,20,8
Hasheem Thabeet,Marcus Williams,O.J. Mayo,Rudy Gay,Zach Randolph,Andrew Bogut,Jerry Stackhouse,John Salmons,Kurt Thomas,Luke Ridnour,1,0:51,MIL,rebound,,,,,,,,,,Luke Ridnour,,,,,,def,,
Hasheem Thabeet,Marcus Williams,O.J. Mayo,Rudy Gay,Zach Randolph,Andrew Bogut,Jerry Stackhouse,John Salmons,Kurt Thomas,Luke Ridnour,1,0:37,MIL,shot,,,,,,,,,,Andrew Bogut,2,,,made,,hook,33,6
Hasheem Thabeet,Marcus Williams,O.J. Mayo,Rudy Gay,Zach Randolph,Andrew Bogut,Jerry Stackhouse,John Salmons,Kurt Thomas,Luke Ridnour,1,0:22,MEM,foul,,,,,,,,Kurt Thomas,,O.J. Mayo,,,,,,offensive,,
Hasheem Thabeet,Marcus Williams,O.J. Mayo,Rudy Gay,Zach Randolph,Andrew Bogut,Jerry Stackhouse,John Salmons,Kurt Thomas,Luke Ridnour,1,0:22,MEM,turnover,,,,,,,,,,O.J. Mayo,,,foul,,,,,
Hasheem Thabeet,Marcus Williams,O.J. Mayo,Rudy Gay,Zach Randolph,Andrew Bogut,Jerry Stackhouse,John Salmons,Kurt Thomas,Luke Ridnour,1,0:03,MIL,shot,,,,,,,,,,Jerry Stackhouse,,,,missed,,jump,24,26
Hasheem Thabeet,Marcus Williams,O.J. Mayo,Rudy Gay,Zach Randolph,Andrew Bogut,Jerry Stackhouse,John Salmons,Kurt Thomas,Luke Ridnour,1,0:02,MEM,rebound,,,,,,,,,,Hasheem Thabeet,,,,,,def,,
Hasheem Thabeet,Marcus Williams,O.J. Mayo,Rudy Gay,Zach Randolph,Andrew Bogut,Jerry Stackhouse,John Salmons,Kurt Thomas,Luke Ridnour,1,0:00,MEM,shot,,,,,,,,,,O.J. Mayo,,,,missed,,3pt,9,44
Hasheem Thabeet,Marcus Williams,O.J. Mayo,Rudy Gay,Zach Randolph,Andrew Bogut,Jerry Stackhouse,John Salmons,Kurt Thomas,Luke Ridnour,1,0:00,MEM,rebound,,,,,,,,,,,,,,,,,,
Darrell Arthur,Marc Gasol,Marcus Williams,O.J. Mayo,Rudy Gay,Charlie Bell,Dan Gadzuric,Jerry Stackhouse,Kurt Thomas,Luke Ridnour,2,11:37,MIL,shot,,,,,,,,,,Charlie Bell,,,,missed,,layup,25,6
Darrell Arthur,Marc Gasol,Marcus Williams,O.J. Mayo,Rudy Gay,Charlie Bell,Dan Gadzuric,Jerry Stackhouse,Kurt Thomas,Luke Ridnour,2,11:35,MIL,rebound,,,,,,,,,,Kurt Thomas,,,,,,off,,
Darrell Arthur,Marc Gasol,Marcus Williams,O.J. Mayo,Rudy Gay,Charlie Bell,Dan Gadzuric,Jerry Stackhouse,Kurt Thomas,Luke Ridnour,2,11:29,MIL,shot,,,,,,,,,,Charlie Bell,,,,missed,,jump,21,17
Darrell Arthur,Marc Gasol,Marcus Williams,O.J. Mayo,Rudy Gay,Charlie Bell,Dan Gadzuric,Jerry Stackhouse,Kurt Thomas,Luke Ridnour,2,11:28,MIL,rebound,,,,,,,,,,Jerry Stackhouse,,,,,,off,,
Darrell Arthur,Marc Gasol,Marcus Williams,O.J. Mayo,Rudy Gay,Charlie Bell,Dan Gadzuric,Jerry Stackhouse,Kurt Thomas,Luke Ridnour,2,11:28,MEM,foul,,,,,,,,Jerry Stackhouse,,Darrell Arthur,,,,,,shooting,,
Darrell Arthur,Marc Gasol,Marcus Williams,O.J. Mayo,Rudy Gay,Charlie Bell,Dan Gadzuric,Jerry Stackhouse,Kurt Thomas,Luke Ridnour,2,11:28,MIL,free throw,,,,,,,1,,2,Jerry Stackhouse,,,foul,made,,,,
Darrell Arthur,Marc Gasol,Marcus Williams,O.J. Mayo,Rudy Gay,Charlie Bell,Dan Gadzuric,Jerry Stackhouse,Kurt Thomas,Luke Ridnour,2,11:28,MIL,free throw,,,,,,,2,,2,Jerry Stackhouse,,,foul,made,,,,
Darrell Arthur,Marc Gasol,Marcus Williams,O.J. Mayo,Rudy Gay,Charlie Bell,Dan Gadzuric,Jerry Stackhouse,Kurt Thomas,Luke Ridnour,2,11:28,MEM,shot,,,,,,,,,,O.J. Mayo,,,,missed,,jump,26,24
Darrell Arthur,Marc Gasol,Marcus Williams,O.J. Mayo,Rudy Gay,Charlie Bell,Dan Gadzuric,Jerry Stackhouse,Kurt Thomas,Luke Ridnour,2,11:00,MIL,rebound,,,,,,,,,,Jerry Stackhouse,,,,,,def,,
Darrell Arthur,Marc Gasol,Marcus Williams,O.J. Mayo,Rudy Gay,Charlie Bell,Dan Gadzuric,Jerry Stackhouse,Kurt Thomas,Luke Ridnour,2,10:47,MIL,shot,Charlie Bell,,,,,,,,,Jerry Stackhouse,3,,,made,,3pt,49,6
Darrell Arthur,Marc Gasol,Marcus Williams,O.J. Mayo,Rudy Gay,Charlie Bell,Dan Gadzuric,Jerry Stackhouse,Kurt Thomas,Luke Ridnour,2,10:34,MEM,shot,,,,,,,,,,O.J. Mayo,2,,,made,,layup,25,6
Darrell Arthur,Marc Gasol,Marcus Williams,O.J. Mayo,Rudy Gay,Charlie Bell,Dan Gadzuric,Jerry Stackhouse,Kurt Thomas,Luke Ridnour,2,10:18,MIL,turnover,,,,,,,,,,Luke Ridnour,,,bad pass,,O.J. Mayo,,,
Darrell Arthur,Marc Gasol,Marcus Williams,O.J. Mayo,Rudy Gay,Charlie Bell,Dan Gadzuric,Jerry Stackhouse,Kurt Thomas,Luke Ridnour,2,10:15,MIL,foul,,,,,,,,Rudy Gay,,Kurt Thomas,,,,,,shooting,,
Darrell Arthur,Marc Gasol,Marcus Williams,O.J. Mayo,Rudy Gay,Charlie Bell,Dan Gadzuric,Jerry Stackhouse,Kurt Thomas,Luke Ridnour,2,10:15,MEM,free throw,,,,,,,1,,2,Rudy Gay,,,foul,missed,,,,
Darrell Arthur,Marc Gasol,Marcus Williams,O.J. Mayo,Rudy Gay,Charlie Bell,Dan Gadzuric,Jerry Stackhouse,Kurt Thomas,Luke Ridnour,2,10:15,MEM,rebound,,,,,,,,,,,,,,,,,,
Darrell Arthur,Marc Gasol,Marcus Williams,Rudy Gay,Sam Young,Charlie Bell,Dan Gadzuric,Jerry Stackhouse,Kurt Thomas,Luke Ridnour,2,10:15,MEM,sub,,,,Sam Young,,O.J. Mayo,,,,,,,,,,,,
Darrell Arthur,Marc Gasol,Marcus Williams,Rudy Gay,Sam Young,Charlie Bell,Dan Gadzuric,Jerry Stackhouse,Kurt Thomas,Luke Ridnour,2,10:15,MEM,free throw,,,,,,,2,,2,Rudy Gay,,,foul,made,,,,
Darrell Arthur,Marc Gasol,Marcus Williams,Rudy Gay,Sam Young,Charlie Bell,Dan Gadzuric,Jerry Stackhouse,Kurt Thomas,Luke Ridnour,2,10:00,MIL,shot,Charlie Bell,,,,,,,,,Kurt Thomas,2,,,made,,jump,40,12
Darrell Arthur,Marc Gasol,Marcus Williams,Rudy Gay,Sam Young,Charlie Bell,Dan Gadzuric,Jerry Stackhouse,Kurt Thomas,Luke Ridnour,2,9:38,MEM,shot,,,,,,,,,,Sam Young,,,,missed,,jump,12,8
Darrell Arthur,Marc Gasol,Marcus Williams,Rudy Gay,Sam Young,Charlie Bell,Dan Gadzuric,Jerry Stackhouse,Kurt Thomas,Luke Ridnour,2,9:37,MIL,rebound,,,,,,,,,,Charlie Bell,,,,,,def,,
Darrell Arthur,Marc Gasol,Marcus Williams,Rudy Gay,Sam Young,Charlie Bell,Dan Gadzuric,Jerry Stackhouse,Kurt Thomas,Luke Ridnour,2,9:19,MIL,shot,,,,,,,,,,Charlie Bell,,,,missed,,3pt,11,28
Darrell Arthur,Marc Gasol,Marcus Williams,Rudy Gay,Sam Young,Charlie Bell,Dan Gadzuric,Jerry Stackhouse,Kurt Thomas,Luke Ridnour,2,9:17,MEM,rebound,,,,,,,,,,Marcus Williams,,,,,,def,,
Darrell Arthur,Marc Gasol,Marcus Williams,Rudy Gay,Sam Young,Charlie Bell,Dan Gadzuric,Jerry Stackhouse,Kurt Thomas,Luke Ridnour,2,9:14,MEM,turnover,,,,,,,,,,Marcus Williams,,,bad pass,,Charlie Bell,,,
Darrell Arthur,Marc Gasol,Marcus Williams,Rudy Gay,Sam Young,Charlie Bell,Dan Gadzuric,Jerry Stackhouse,Kurt Thomas,Luke Ridnour,2,9:08,MIL,shot,,,,,,,,,,Charlie Bell,,,,missed,,layup,25,6
Darrell Arthur,Marc Gasol,Marcus Williams,Rudy Gay,Sam Young,Charlie Bell,Dan Gadzuric,Jerry Stackhouse,Kurt Thomas,Luke Ridnour,2,9:06,MIL,rebound,,,,,,,,,,Dan Gadzuric,,,,,,off,,
Darrell Arthur,Marc Gasol,Marcus Williams,Rudy Gay,Sam Young,Charlie Bell,Dan Gadzuric,Jerry Stackhouse,Kurt Thomas,Luke Ridnour,2,9:05,MIL,shot,,,,,,,,,,Dan Gadzuric,,,,missed,,layup,25,6