a1,a2,a3,a4,a5,h1,h2,h3,h4,h5,period,time,team,etype,assist,away,block,entered,home,left,num,opponent,outof,player,points,possession,reason,result,steal,type,x,y
Al Thornton,Andray Blatche,JaVale McGee,Mike Miller,Shaun Livingston,Brandon Rush,Danny Granger,Earl Watson,Josh McRoberts,Troy Murphy,1,12:00,OFF,jump ball,,JaVale McGee,,,Josh McRoberts,,,,,,,Danny Granger,,,,,,
Al Thornton,Andray Blatche,JaVale McGee,Mike Miller,Shaun Livingston,Brandon Rush,Danny Granger,Earl Watson,Josh McRoberts,Troy Murphy,1,11:49,IND,shot,Josh McRoberts,,,,,,,,,Danny Granger,2,,,made,,alley oop layup,26,6
Al Thornton,Andray Blatche,JaVale McGee,Mike Miller,Shaun Livingston,Brandon Rush,Danny Granger,Earl Watson,Josh McRoberts,Troy Murphy,1,11:25,WAS,shot,,,,,,,,,,JaVale McGee,,,,missed,,jump,17,10
Al Thornton,Andray Blatche,JaVale McGee,Mike Miller,Shaun Livingston,Brandon Rush,Danny Granger,Earl Watson,Josh McRoberts,Troy Murphy,1,11:24,IND,rebound,,,,,,,,,,Troy Murphy,,,,,,def,,
Al Thornton,Andray Blatche,JaVale McGee,Mike Miller,Shaun Livingston,Brandon Rush,Danny Granger,Earl Watson,Josh McRoberts,Troy Murphy,1,11:17,IND,shot,,,,,,,,,,Danny Granger,2,,,made,,layup,24,7
Al Thornton,Andray Blatche,JaVale McGee,Mike Miller,Shaun Livingston,Brandon Rush,Danny Granger,Earl Watson,Josh McRoberts,Troy Murphy,1,10:58,IND,foul,,,,,,,,Andray Blatche,,Danny Granger,,,,,,shooting,,
Al Thornton,Andray Blatche,JaVale McGee,Mike Miller,Shaun Livingston,Brandon Rush,Danny Granger,Earl Watson,Josh McRoberts,Troy Murphy,1,10:58,WAS,free throw,,,,,,,1,,2,Andray Blatche,,,foul,made,,,,
Al Thornton,Andray Blatche,JaVale McGee,Mike Miller,Shaun Livingston,Brandon Rush,Danny Granger,Earl Watson,Josh McRoberts,Troy Murphy,1,10:58,WAS,free throw,,,,,,,2,,2,Andray Blatche,,,foul,made,,,,
Al Thornton,Andray Blatche,JaVale McGee,Mike Miller,Shaun Livingston,Brandon Rush,Danny Granger,Earl Watson,Josh McRoberts,Troy Murphy,1,10:49,IND,shot,,,,,,,,,,Brandon Rush,,,,missed,,jump,10,17
Al Thornton,Andray Blatche,JaVale McGee,Mike Miller,Shaun Livingston,Brandon Rush,Danny Granger,Earl Watson,Josh McRoberts,Troy Murphy,1,10:47,IND,rebound,,,,,,,,,,Josh McRoberts,,,,,,off,,
Al Thornton,Andray Blatche,JaVale McGee,Mike Miller,Shaun Livingston,Brandon Rush,Danny Granger,Earl Watson,Josh McRoberts,Troy Murphy,1,10:46,IND,shot,,,,,,,,,,Josh McRoberts,2,,,made,,jump,30,11
Al Thornton,Andray Blatche,JaVale McGee,Mike Miller,Shaun Livingston,Brandon Rush,Danny Granger,Earl Watson,Josh McRoberts,Troy Murphy,1,10:29,WAS,turnover,,,,,,,,,,Andray Blatche,,,lost ball,,Danny Granger,,,
Al Thornton,Andray Blatche,JaVale McGee,Mike Miller,Shaun Livingston,Brandon Rush,Danny Granger,Earl Watson,Josh McRoberts,Troy Murphy,1,10:17,IND,shot,Troy Murphy,,,,,,,,,Danny Granger,2,,,made,,jump,37,12
Al Thornton,Andray Blatche,JaVale McGee,Mike Miller,Shaun Livingston,Brandon Rush,Danny Granger,Earl Watson,Josh McRoberts,Troy Murphy,1,9:51,WAS,shot,,,,,,,,,,Andray Blatche,,,,missed,,jump,40,5
Al Thornton,Andray Blatche,JaVale McGee,Mike Miller,Shaun Livingston,Brandon Rush,Danny Granger,Earl Watson,Josh McRoberts,Troy Murphy,1,9:49,IND,rebound,,,,,,,,,,Josh McRoberts,,,,,,def,,
Al Thornton,Andray Blatche,JaVale McGee,Mike Miller,Shaun Livingston,Brandon Rush,Danny Granger,Earl Watson,Josh McRoberts,Troy Murphy,1,9:39,IND,shot,,,,,,,,,,Troy Murphy,,,,missed,,3pt,32,31
Al Thornton,Andray Blatche,JaVale McGee,Mike Miller,Shaun Livingston,Brandon Rush,Danny Granger,Earl Watson,Josh McRoberts,Troy Murphy,1,9:37,IND,rebound,,,,,,,,,,Josh McRoberts,,,,,,off,,
Al Thornton,Andray Blatche,JaVale McGee,Mike Miller,Shaun Livingston,Brandon Rush,Danny Granger,Earl Watson,Josh McRoberts,Troy Murphy,1,9:30,IND,shot,,,,,,,,,,Troy Murphy,,,,missed,,jump,13,13
Al Thornton,Andray Blatche,JaVale McGee,Mike Miller,Shaun Livingston,Brandon Rush,Danny Granger,Earl Watson,Josh McRoberts,Troy Murphy,1,9:28,WAS,rebound,,,,,,,,,,JaVale McGee,,,,,,def,,
Al Thornton,Andray Blatche,JaVale McGee,Mike Miller,Shaun Livingston,Brandon Rush,Danny Granger,Earl Watson,Josh McRoberts,Troy Murphy,1,9:23,WAS,shot,,,,,,,,,,Shaun Livingston,,,,missed,,layup,26,6
Al Thornton,Andray Blatche,JaVale McGee,Mike Miller,Shaun Livingston,Brandon Rush,Danny Granger,Earl Watson,Josh McRoberts,Troy Murphy,1,9:20,WAS,rebound,,,,,,,,,,Andray Blatche,,,,,,off,,
Al Thornton,Andray Blatche,JaVale McGee,Mike Miller,Shaun Livingston,Brandon Rush,Danny Granger,Earl Watson,Josh McRoberts,Troy Murphy,1,9:20,WAS,shot,,,,,,,,,,Andray Blatche,2,,,made,,tip,25,6
Al Thornton,Andray Blatche,JaVale McGee,Mike Miller,Shaun Livingston,Brandon Rush,Danny Granger,Earl Watson,Josh McRoberts,Troy Murphy,1,9:08,IND,shot,Troy Murphy,,,,,,,,,Josh McRoberts,2,,,made,,jump,45,5
Al Thornton,Andray Blatche,JaVale McGee,Mike Miller,Shaun Livingston,Brandon Rush,Danny Granger,Earl Watson,Josh McRoberts,Troy Murphy,1,8:47,WAS,shot,,,,,,,,,,Andray Blatche,2,,,made,,jump,25,11
Al Thornton,Andray Blatche,JaVale McGee,Mike Miller,Shaun Livingston,Brandon Rush,Danny Granger,Earl Watson,Josh McRoberts,Troy Murphy,1,8:38,WAS,foul,,,,,,,,Troy Murphy,,Shaun Livingston,,,,,,shooting,,
Al Thornton,Andray Blatche,JaVale McGee,Mike Miller,Shaun Livingston,Brandon Rush,Danny Granger,Earl Watson,Josh McRoberts,Troy Murphy,1,8:38,IND,free throw,,,,,,,1,,2,Troy Murphy,,,foul,made,,,,
Al Thornton,Andray Blatche,James Singleton,Mike Miller,Shaun Livingston,Brandon Rush,Danny Granger,Earl Watson,Josh McRoberts,Troy Murphy,1,8:38,WAS,sub,,,,James Singleton,,JaVale McGee,,,,,,,,,,,,
Al Thornton,Andray Blatche,James Singleton,Mike Miller,Shaun Livingston,Brandon Rush,Danny Granger,Earl Watson,Josh McRoberts,Troy Murphy,1,8:38,IND,free throw,,,,,,,2,,2,Troy Murphy,,,foul,made,,,,
Al Thornton,Andray Blatche,James Singleton,Mike Miller,Shaun Livingston,Brandon Rush,Danny Granger,Earl Watson,Josh McRoberts,Troy Murphy,1,8:20,WAS,shot,,,,,,,,,,Al Thornton,2,,,made,,reverse layup,25,6
Al Thornton,Andray Blatche,James Singleton,Mike Miller,Shaun Livingston,Brandon Rush,Danny Granger,Earl Watson,Josh McRoberts,Troy Murphy,1,8:04,IND,shot,,,,,,,,,,Troy Murphy,,,,missed,,3pt,32,31
Al Thornton,Andray Blatche,James Singleton,Mike Miller,Shaun Livingston,Brandon Rush,Danny Granger,Earl Watson,Josh McRoberts,Troy Murphy,1,8:02,WAS,rebound,,,,,,,,,,James Singleton,,,,,,def,,
Al Thornton,Andray Blatche,James Singleton,Mike Miller,Shaun Livingston,Brandon Rush,Danny Granger,Earl Watson,Josh McRoberts,Troy Murphy,1,7:41,WAS,shot,,,,,,,,,,Shaun Livingston,2,,,made,,jump,36,9
Al Thornton,Andray Blatche,James Singleton,Mike Miller,Shaun Livingston,Brandon Rush,Danny Granger,Earl Watson,Josh McRoberts,Troy Murphy,1,7:28,IND,shot,,,,,,,,,,Brandon Rush,,,,missed,,jump,27,18
Al Thornton,Andray Blatche,James Singleton,Mike Miller,Shaun Livingston,Brandon Rush,Danny Granger,Earl Watson,Josh McRoberts,Troy Murphy,1,7:27,WAS,rebound,,,,,,,,,,Mike Miller,,,,,,def,,
Al Thornton,Andray Blatche,James Singleton,Mike Miller,Shaun Livingston,Brandon Rush,Danny Granger,Earl Watson,Josh McRoberts,Troy Murphy,1,7:19,WAS,shot,,,,,,,,,,Mike Miller,,,,missed,,jump,30,7
Al Thornton,Andray Blatche,James Singleton,Mike Miller,Shaun Livingston,Brandon Rush,Danny Granger,Earl Watson,Josh McRoberts,Troy Murphy,1,7:18,IND,rebound,,,,,,,,,,Danny Granger,,,,,,def,,
Al Thornton,Andray Blatche,James Singleton,Mike Miller,Shaun Livingston,Brandon Rush,Danny Granger,Earl Watson,Josh McRoberts,Troy Murphy,1,7:09,WAS,foul,,,,,,,,Earl Watson,,James Singleton,,,,,,shooting,,
Al Thornton,Andray Blatche,James Singleton,Mike Miller,Shaun Livingston,Brandon Rush,Danny Granger,Earl Watson,Josh McRoberts,Troy Murphy,1,7:09,IND,free throw,,,,,,,1,,2,Earl Watson,,,foul,made,,,,
Al Thornton,Andray Blatche,James Singleton,Mike Miller,Shaun Livingston,Brandon Rush,Danny Granger,Earl Watson,Josh McRoberts,Troy Murphy,1,7:09,IND,free throw,,,,,,,2,,2,Earl Watson,,,foul,missed,,,,
Al Thornton,Andray Blatche,James Singleton,Mike Miller,Shaun Livingston,Brandon Rush,Danny Granger,Earl Watson,Josh McRoberts,Troy Murphy,1,7:09,WAS,rebound,,,,,,,,,,Al Thornton,,,,,,def,,
Al Thornton,Andray Blatche,James Singleton,Mike Miller,Shaun Livingston,Brandon Rush,Danny Granger,Earl Watson,Josh McRoberts,Troy Murphy,1,6:54,WAS,turnover,,,,,,,,,,Shaun Livingston,,,bad pass,,Brandon Rush,,,
Al Thornton,Andray Blatche,James Singleton,Mike Miller,Shaun Livingston,Brandon Rush,Danny Granger,Earl Watson,Josh McRoberts,Troy Murphy,1,6:36,IND,shot,Brandon Rush,,,,,,,,,Josh McRoberts,2,,,made,,layup,26,6
Al Thornton,Andray Blatche,James Singleton,Mike Miller,Shaun Livingston,Brandon Rush,Danny Granger,Earl Watson,Josh McRoberts,Troy Murphy,1,6:36,WAS,foul,,,,,,,,Josh McRoberts,,Shaun Livingston,,,,,,shooting,,
Al Thornton,Andray Blatche,Earl Boykins,James Singleton,Mike Miller,Brandon Rush,Danny Granger,Earl Watson,Josh McRoberts,Troy Murphy,1,6:36,WAS,sub,,,,Earl Boykins,,Shaun Livingston,,,,,,,,,,,,
Al Thornton,Andray Blatche,Earl Boykins,James Singleton,Mike Miller,Brandon Rush,Danny Granger,Earl Watson,Josh McRoberts,Troy Murphy,1,6:36,IND,free throw,,,,,,,1,,1,Josh McRoberts,,,foul,missed,,,,
Al Thornton,Andray Blatche,Earl Boykins,James Singleton,Mike Miller,Brandon Rush,Danny Granger,Earl Watson,Josh McRoberts,Troy Murphy,1,6:36,WAS,rebound,,,,,,,,,,Al Thornton,,,,,,def,,
Al Thornton,Andray Blatche,Earl Boykins,James Singleton,Mike Miller,Brandon Rush,Danny Granger,Earl Watson,Josh McRoberts,Troy Murphy,1,6:18,WAS,shot,,,,,,,,,,Earl Boykins,,,,missed,,3pt,49,3
Al Thornton,Andray Blatche,Earl Boykins,James Singleton,Mike Miller,Brandon Rush,Danny Granger,Earl Watson,Josh McRoberts,Troy Murphy,1,6:17,WAS,rebound,,,,,,,,,,James Singleton,,,,,,off,,
Al Thornton,Andray Blatche,Earl Boykins,James Singleton,Mike Miller,Brandon Rush,Danny Granger,Earl Watson,Josh McRoberts,Troy Murphy,1,5:55,WAS,shot,,,,,,,,,,Al Thornton,,,,missed,,jump,28,23
Al Thornton,Andray Blatche,Earl Boykins,James Singleton,Mike Miller,Brandon Rush,Danny Granger,Earl Watson,Josh McRoberts,Troy Murphy,1,5:54,IND,rebound,,,,,,,,,,Earl Watson,,,,,,def,,
Al Thornton,Andray Blatche,Earl Boykins,James Singleton,Mike Miller,Brandon Rush,Danny Granger,Earl Watson,Josh McRoberts,Troy Murphy,1,5:44,IND,shot,,,,,,,,,,Josh McRoberts,,,,missed,,3pt,,
Al Thornton,Andray Blatche,Earl Boykins,James Singleton,Mike Miller,Brandon Rush,Danny Granger,Earl Watson,Josh McRoberts,Troy Murphy,1,5:42,WAS,rebound,,,,,,,,,,James Singleton,,,,,,def,,
Al Thornton,Andray Blatche,Earl Boykins,James Singleton,Mike Miller,Brandon Rush,Danny Granger,Earl Watson,Josh McRoberts,Troy Murphy,1,5:33,WAS,shot,Al Thornton,,,,,,,,,Mike Miller,3,,,made,,3pt,36,30
Al Thornton,Andray Blatche,Earl Boykins,James Singleton,Mike Miller,Brandon Rush,Danny Granger,Earl Watson,Josh McRoberts,Troy Murphy,1,5:16,IND,shot,Earl Watson,,,,,,,,,Danny Granger,3,,,made,,3pt,37,30
Al Thornton,Andray Blatche,Earl Boykins,James Singleton,Mike Miller,Brandon Rush,Danny Granger,Earl Watson,Josh McRoberts,Troy Murphy,1,5:03,WAS,shot,,,,,,,,,,Andray Blatche,,,,missed,,jump,42,16
Al Thornton,Andray Blatche,Earl Boykins,James Singleton,Mike Miller,Brandon Rush,Danny Granger,Earl Watson,Josh McRoberts,Troy Murphy,1,5:02,IND,rebound,,,,,,,,,,Josh McRoberts,,,,,,def,,
Al Thornton,Andray Blatche,Earl Boykins,James Singleton,Mike Miller,Brandon Rush,Danny Granger,Earl Watson,Josh McRoberts,Troy Murphy,1,4:53,IND,shot,,,,,,,,,,Brandon Rush,,,,missed,,3pt,50,12
Al Thornton,Andray Blatche,Earl Boykins,James Singleton,Mike Miller,Brandon Rush,Danny Granger,Earl Watson,Josh McRoberts,Troy Murphy,1,4:52,WAS,rebound,,,,,,,,,,James Singleton,,,,,,def,,
Al Thornton,Andray Blatche,Earl Boykins,James Singleton,Mike Miller,Brandon Rush,Danny Granger,Earl Watson,Josh McRoberts,Troy Murphy,1,4:38,IND,foul,,,,,,,,Al Thornton,,Brandon Rush,,,,,,personal,,
Al Thornton,Andray Blatche,Earl Boykins,James Singleton,Mike Miller,Brandon Rush,Danny Granger,Earl Watson,Josh McRoberts,Troy Murphy,1,4:38,IND,timeout,,,,,,,,,,,,,,,,regular,,
Al Thornton,Andray Blatche,Earl Boykins,James Singleton,Mike Miller,Brandon Rush,Danny Granger,Earl Watson,Josh McRoberts,Troy Murphy,1,4:27,WAS,shot,Earl Boykins,,,,,,,,,James Singleton,2,,,made,,layup,24,5
Al Thornton,Andray Blatche,Earl Boykins,James Singleton,Mike Miller,Brandon Rush,Danny Granger,Earl Watson,Josh McRoberts,Troy Murphy,1,4:17,IND,foul,,,,,,,,Earl Boykins,,Earl Watson,,,,,,offensive,,
Al Thornton,Andray Blatche,Earl Boykins,James Singleton,Mike Miller,Brandon Rush,Danny Granger,Earl Watson,Josh McRoberts,Troy Murphy,1,4:17,IND,turnover,,,,,,,,,,Earl Watson,,,foul,,,,,
Al Thornton,Andray Blatche,Earl Boykins,James Singleton,Mike Miller,Brandon Rush,Danny Granger,Earl Watson,Josh McRoberts,Troy Murphy,1,4:03,WAS,shot,,,,,,,,,,Mike Miller,,,,missed,,jump,33,22
Al Thornton,Andray Blatche,Earl Boykins,James Singleton,Mike Miller,Brandon Rush,Danny Granger,Earl Watson,Josh McRoberts,Troy Murphy,1,4:02,WAS,rebound,,,,,,,,,,Andray Blatche,,,,,,off,,
Al Thornton,Andray Blatche,Earl Boykins,James Singleton,Mike Miller,Brandon Rush,Danny Granger,Earl Watson,Josh McRoberts,Troy Murphy,1,3:53,IND,violation,,,,,,,,,,Josh McRoberts,,,,,,defensive goaltending,,
Al Thornton,Andray Blatche,Earl Boykins,James Singleton,Mike Miller,Brandon Rush,Danny Granger,Earl Watson,Josh McRoberts,Troy Murphy,1,3:53,WAS,shot,,,,,,,,,,Al Thornton,2,,,made,,jump,27,10
Al Thornton,Andray Blatche,Earl Boykins,James Singleton,Mike Miller,Brandon Rush,Danny Granger,Earl Watson,Josh McRoberts,Troy Murphy,1,3:38,IND,shot,,,,,,,,,,Troy Murphy,2,,,made,,layup,27,6
Al Thornton,Andray Blatche,Earl Boykins,James Singleton,Mike Miller,Brandon Rush,Danny Granger,Earl Watson,Josh McRoberts,Troy Murphy,1,3:38,WAS,foul,,,,,,,,Troy Murphy,,Al Thornton,,,,,,shooting,,
Al Thornton,Andray Blatche,Earl Boykins,James Singleton,Mike Miller,Brandon Rush,Earl Watson,Josh McRoberts,Mike Dunleavy,Troy Murphy,1,3:38,IND,sub,,,,Mike Dunleavy,,Danny Granger,,,,,,,,,,,,
Al Thornton,Andray Blatche,Earl Boykins,James Singleton,Mike Miller,Brandon Rush,Earl Watson,Mike Dunleavy,Solomon Jones,Troy Murphy,1,3:38,IND,sub,,,,Solomon Jones,,Josh McRoberts,,,,,,,,,,,,
Al Thornton,Andray Blatche,Earl Boykins,James Singleton,Mike Miller,Brandon Rush,Earl Watson,Mike Dunleavy,Solomon Jones,Troy Murphy,1,3:38,IND,free throw,,,,,,,1,,1,Troy Murphy,,,foul,missed,,,,
Al Thornton,Andray Blatche,Earl Boykins,James Singleton,Mike Miller,Brandon Rush,Earl Watson,Mike Dunleavy,Solomon Jones,Troy Murphy,1,3:37,WAS,rebound,,,,,,,,,,Andray Blatche,,,,,,def,,
Al Thornton,Andray Blatche,Earl Boykins,James Singleton,Mike Miller,Brandon Rush,Earl Watson,Mike Dunleavy,Solomon Jones,Troy Murphy,1,3:23,IND,foul,,,,,,,,Andray Blatche,,Solomon Jones,,,,,,shooting,,
Al Thornton,Andray Blatche,Earl Boykins,James Singleton,Mike Miller,Brandon Rush,Earl Watson,Mike Dunleavy,Solomon Jones,Troy Murphy,1,3:23,WAS,free throw,,,,,,,1,,2,Andray Blatche,,,foul,made,,,,
Andray Blatche,Earl Boykins,James Singleton,Mike Miller,Quinton Ross,Brandon Rush,Earl Watson,Mike Dunleavy,Solomon Jones,Troy Murphy,1,3:23,WAS,sub,,,,Quinton Ross,,Al Thornton,,,,,,,,,,,,
Andray Blatche,Earl Boykins,James Singleton,Mike Miller,Quinton Ross,Brandon Rush,Earl Watson,Mike Dunleavy,Solomon Jones,Troy Murphy,1,3:23,WAS,free throw,,,,,,,2,,2,Andray Blatche,,,foul,missed,,,,
Andray Blatche,Earl Boykins,James Singleton,Mike Miller,Quinton Ross,Brandon Rush,Earl Watson,Mike Dunleavy,Solomon Jones,Troy Murphy,1,3:23,IND,rebound,,,,,,,,,,Troy Murphy,,,,,,def,,
Andray Blatche,Earl Boykins,James Singleton,Mike Miller,Quinton Ross,Brandon Rush,Earl Watson,Mike Dunleavy,Solomon Jones,Troy Murphy,1,3:01,IND,shot,,,,,,,,,,Solomon Jones,,,,missed,,jump,23,27
Andray Blatche,Earl Boykins,James Singleton,Mike Miller,Quinton Ross,Brandon Rush,Earl Watson,Mike Dunleavy,Solomon Jones,Troy Murphy,1,3:00,WAS,rebound,,,,,,,,,,Quinton Ross,,,,,,def,,
Andray Blatche,Earl Boykins,James Singleton,Mike Miller,Quinton Ross,Brandon Rush,Earl Watson,Mike Dunleavy,Solomon Jones,Troy Murphy,1,2:53,WAS,timeout,,,,,,,,,,,,,,,,regular,,
Andray Blatche,Earl Boykins,James Singleton,Mike Miller,Quinton Ross,Dahntay Jones,Earl Watson,Mike Dunleavy,Solomon Jones,Troy Murphy,1,2:53,IND,sub,,,,Dahntay Jones,,Brandon Rush,,,,,,,,,,,,
Andray Blatche,Earl Boykins,James Singleton,Mike Miller,Quinton Ross,A.J. Price,Dahntay Jones,Mike Dunleavy,Solomon Jones,Troy Murphy,1,2:53,IND,sub,,,,A.J. Price,,Earl Watson,,,,,,,,,,,,
Andray Blatche,Earl Boykins,James Singleton,Mike Miller,Quinton Ross,A.J. Price,Dahntay Jones,Mike Dunleavy,Solomon Jones,Troy Murphy,1,2:45,WAS,shot,,,,,,,,,,Earl Boykins,,,,missed,,jump,7,18
Andray Blatche,Earl Boykins,James Singleton,Mike Miller,Quinton Ross,A.J. Price,Dahntay Jones,Mike Dunleavy,Solomon Jones,Troy Murphy,1,2:44,IND,rebound,,,,,,,,,,Troy Murphy,,,,,,def,,
Andray Blatche,Earl Boykins,James Singleton,Mike Miller,Quinton Ross,A.J. Price,Dahntay Jones,Mike Dunleavy,Solomon Jones,Troy Murphy,1,2:33,IND,shot,,,,,,,,,,A.J. Price,2,,,made,,driving layup,27,6
Andray Blatche,Earl Boykins,James Singleton,Mike Miller,Quinton Ross,A.J. Price,Dahntay Jones,Mike Dunleavy,Solomon Jones,Troy Murphy,1,2:15,WAS,shot,,,,,,,,,,James Singleton,2,,,made,,jump,28,24
Andray Blatche,Earl Boykins,James Singleton,Mike Miller,Quinton Ross,A.J. Price,Dahntay Jones,Mike Dunleavy,Solomon Jones,Troy Murphy,1,2:04,IND,turnover,,,,,,,,,,Mike Dunleavy,,,out of bounds lost ball turnover,,,,,
Andray Blatche,Earl Boykins,James Singleton,Mike Miller,Quinton Ross,A.J. Price,Dahntay Jones,Mike Dunleavy,Solomon Jones,Troy Murphy,1,1:50,WAS,shot,,,,,,,,,,Quinton Ross,,,,missed,,jump,32,23
Andray Blatche,Earl Boykins,James Singleton,Mike Miller,Quinton Ross,A.J. Price,Dahntay Jones,Mike Dunleavy,Solomon Jones,Troy Murphy,1,1:48,IND,rebound,,,,,,,,,,Solomon Jones,,,,,,def,,
Andray Blatche,Earl Boykins,James Singleton,Mike Miller,Quinton Ross,A.J. Price,Dahntay Jones,Mike Dunleavy,Solomon Jones,Troy Murphy,1,1:41,IND,shot,Dahntay Jones,,,,,,,,,Mike Dunleavy,2,,,made,,layup,26,7
Andray Blatche,Earl Boykins,James Singleton,Mike Miller,Quinton Ross,A.J. Price,Dahntay Jones,Mike Dunleavy,Solomon Jones,Troy Murphy,1,1:25,WAS,shot,,,,,,,,,,James Singleton,,,,missed,,jump,41,19
Andray Blatche,Earl Boykins,James Singleton,Mike Miller,Quinton Ross,A.J. Price,Dahntay Jones,Mike Dunleavy,Solomon Jones,Troy Murphy,1,1:23,IND,rebound,,,,,,,,,,Mike Dunleavy,,,,,,def,,
Andray Blatche,Earl Boykins,James Singleton,Mike Miller,Quinton Ross,A.J. Price,Dahntay Jones,Mike Dunleavy,Solomon Jones,Troy Murphy,1,1:19,WAS,foul,,,,,,,,Solomon Jones,,Andray Blatche,,,,,,personal,,
Andray Blatche,Earl Boykins,James Singleton,Mike Miller,Quinton Ross,A.J. Price,Dahntay Jones,Mike Dunleavy,Solomon Jones,Troy Murphy,1,1:19,IND,free throw,,,,,,,1,,2,Solomon Jones,,,foul,missed,,,,
Andray Blatche,Earl Boykins,James Singleton,Mike Miller,Quinton Ross,A.J. Price,Dahntay Jones,Mike Dunleavy,Solomon Jones,Troy Murphy,1,1:19,IND,rebound,,,,,,,,,,,,,,,,,,
Andray Blatche,Earl Boykins,James Singleton,Mike Miller,Quinton Ross,A.J. Price,Dahntay Jones,Mike Dunleavy,Solomon Jones,Troy Murphy,1,1:19,IND,free throw,,,,,,,2,,2,Solomon Jones,,,foul,made,,,,
Andray Blatche,Earl Boykins,James Singleton,Mike Miller,Quinton Ross,A.J. Price,Dahntay Jones,Mike Dunleavy,Solomon Jones,Troy Murphy,1,1:01,WAS,shot,,,,,,,,,,Andray Blatche,2,,,made,,layup,28,6
Andray Blatche,Earl Boykins,James Singleton,Mike Miller,Quinton Ross,A.J. Price,Dahntay Jones,Mike Dunleavy,Solomon Jones,Troy Murphy,1,0:49,WAS,foul,,,,,,,,Solomon Jones,,Quinton Ross,,,,,,personal,,
Andray Blatche,Earl Boykins,James Singleton,Mike Miller,Quinton Ross,A.J. Price,Dahntay Jones,Mike Dunleavy,Solomon Jones,Troy Murphy,1,0:49,IND,free throw,,,,,,,1,,2,Solomon Jones,,,foul,missed,,,,
Andray Blatche,Earl Boykins,James Singleton,Mike Miller,Quinton Ross,A.J. Price,Dahntay Jones,Mike Dunleavy,Solomon Jones,Troy Murphy,1,0:49,IND,rebound,,,,,,,,,,,,,,,,,,
Andray Blatche,Earl Boykins,James Singleton,Mike Miller,Quinton Ross,A.J. Price,Dahntay Jones,Mike Dunleavy,Solomon Jones,Troy Murphy,1,0:49,IND,free throw,,,,,,,2,,2,Solomon Jones,,,foul,missed,,,,
Andray Blatche,Earl Boykins,James Singleton,Mike Miller,Quinton Ross,A.J. Price,Dahntay Jones,Mike Dunleavy,Solomon Jones,Troy Murphy,1,0:49,WAS,rebound,,,,,,,,,,Mike Miller,,,,,,def,,
Andray Blatche,Earl Boykins,James Singleton,Mike Miller,Quinton Ross,A.J. Price,Dahntay Jones,Mike Dunleavy,Solomon Jones,Troy Murphy,1,0:43,WAS,turnover,,,,,,,,,,Earl Boykins,,,lost ball,,A.J. Price,,,
Andray Blatche,Earl Boykins,James Singleton,Mike Miller,Quinton Ross,A.J. Price,Dahntay Jones,Mike Dunleavy,Solomon Jones,Troy Murphy,1,0:39,WAS,foul,,,,,,,,A.J. Price,,Earl Boykins,,,,,,shooting,,
Andray Blatche,Earl Boykins,James Singleton,Mike Miller,Quinton Ross,A.J. Price,Dahntay Jones,Mike Dunleavy,Solomon Jones,Troy Murphy,1,0:39,IND,free throw,,,,,,,1,,2,A.J. Price,,,foul,missed,,,,
Andray Blatche,Earl Boykins,James Singleton,Mike Miller,Quinton Ross,A.J. Price,Dahntay Jones,Mike Dunleavy,Solomon Jones,Troy Murphy,1,0:39,IND,rebound,,,,,,,,,,,,,,,,,,
Andray Blatche,Earl Boykins,James Singleton,Mike Miller,Quinton Ross,A.J. Price,Dahntay Jones,Mike Dunleavy,Solomon Jones,Troy Murphy,1,0:39,IND,free throw,,,,,,,2,,2,A.J. Price,,,foul,made,,,,
Andray Blatche,Earl Boykins,James Singleton,Mike Miller,Quinton Ross,A.J. Price,Dahntay Jones,Mike Dunleavy,Solomon Jones,Troy Murphy,1,0:27,WAS,shot,,,,,,,,,,Earl Boykins,,,,missed,,jump,42,4
Andray Blatche,Earl Boykins,James Singleton,Mike Miller,Quinton Ross,A.J. Price,Dahntay Jones,Mike Dunleavy,Solomon Jones,Troy Murphy,1,0:25,WAS,rebound,,,,,,,,,,Quinton Ross,,,,,,off,,
Andray Blatche,Earl Boykins,James Singleton,Mike Miller,Quinton Ross,A.J. Price,Dahntay Jones,Mike Dunleavy,Solomon Jones,Troy Murphy,1,0:24,WAS,shot,,,,,,,,,,Quinton Ross,,,,missed,,jump,29,5
Andray Blatche,Earl Boykins,James Singleton,Mike Miller,Quinton Ross,A.J. Price,Dahntay Jones,Mike Dunleavy,Solomon Jones,Troy Murphy,1,0:22,IND,rebound,,,,,,,,,,Dahntay Jones,,,,,,def,,
Andray Blatche,Earl Boykins,James Singleton,Mike Miller,Quinton Ross,A.J. Price,Dahntay Jones,Mike Dunleavy,Solomon Jones,Troy Murphy,1,0:19,IND,turnover,,,,,,,,,,Dahntay Jones,,,discontinue dribble,,,,,
Andray Blatche,Earl Boykins,James Singleton,Mike Miller,Quinton Ross,A.J. Price,Dahntay Jones,Mike Dunleavy,Solomon Jones,Troy Murphy,1,0:03,WAS,shot,Mike Miller,,,,,,,,,Andray Blatche,3,,,made,,3pt,24,33
Andray Blatche,Earl Boykins,James Singleton,Mike Miller,Quinton Ross,A.J. Price,Dahntay Jones,Mike Dunleavy,Solomon Jones,Troy Murphy,1,0:00,WAS,foul,,,,,,,,A.J. Price,,Earl Boykins,,,,,,shooting,,
Andray Blatche,Earl Boykins,James Singleton,Mike Miller,Quinton Ross,A.J. Price,Dahntay Jones,Mike Dunleavy,Solomon Jones,Troy Murphy,1,0:00,IND,free throw,,,,,,,1,,3,A.J. Price,,,foul,made,,,,
Andray Blatche,Earl Boykins,James Singleton,Mike Miller,Quinton Ross,A.J. Price,Dahntay Jones,Mike Dunleavy,Solomon Jones,Troy Murphy,1,0:00,IND,free throw,,,,,,,2,,3,A.J. Price,,,foul,made,,,,
Andray Blatche,Earl Boykins,James Singleton,Mike Miller,Quinton Ross,A.J. Price,Dahntay Jones,Mike Dunleavy,Solomon Jones,Troy Murphy,1,0:00,IND,free throw,,,,,,,3,,3,A.J. Price,,,foul,made,,,,
Andray Blatche,James Singleton,Mike Miller,Nick Young,Randy Foye,A.J. Price,Dahntay Jones,Danny Granger,Josh McRoberts,Mike Dunleavy,2,11:40,WAS,shot,,,,,,,,,,Andray Blatche,,,,missed,,jump,33,9
Andray Blatche,James Singleton,Mike Miller,Nick Young,Randy Foye,A.J. Price,Dahntay Jones,Danny Granger,Josh McRoberts,Mike Dunleavy,2,11:38,IND,rebound,,,,,,,,,,Josh McRoberts,,,,,,def,,
Andray Blatche,James Singleton,Mike Miller,Nick Young,Randy Foye,A.J. Price,Dahntay Jones,Danny Granger,Josh McRoberts,Mike Dunleavy,2,11:16,IND,shot,,,,,,,,,,Danny Granger,,,,missed,,jump,17,8
Andray Blatche,James Singleton,Mike Miller,Nick Young,Randy Foye,A.J. Price,Dahntay Jones,Danny Granger,Josh McRoberts,Mike Dunleavy,2,11:14,WAS,rebound,,,,,,,,,,James Singleton,,,,,,def,,