a1,a2,a3,a4,a5,h1,h2,h3,h4,h5,period,time,team,etype,assist,away,block,entered,home,left,num,opponent,outof,player,points,possession,reason,result,steal,type,x,y
Anthony Morrow,Anthony Tolliver,C.J. Watson,Ronny Turiaf,Stephen Curry,Dwight Howard,Jameer Nelson,Matt Barnes,Rashard Lewis,Vince Carter,1,12:00,OFF,jump ball,,Ronny Turiaf,,,Dwight Howard,,,,,,,Jameer Nelson,,,,,,
Anthony Morrow,Anthony Tolliver,C.J. Watson,Ronny Turiaf,Stephen Curry,Dwight Howard,Jameer Nelson,Matt Barnes,Rashard Lewis,Vince Carter,1,11:45,GSW,foul,,,,,,,,Vince Carter,,C.J. Watson,,,,,,personal,,
Anthony Morrow,Anthony Tolliver,C.J. Watson,Ronny Turiaf,Stephen Curry,Dwight Howard,Jameer Nelson,Matt Barnes,Rashard Lewis,Vince Carter,1,11:37,ORL,shot,,,,,,,,,,Vince Carter,2,,,made,,jump,31,6
Anthony Morrow,Anthony Tolliver,C.J. Watson,Ronny Turiaf,Stephen Curry,Dwight Howard,Jameer Nelson,Matt Barnes,Rashard Lewis,Vince Carter,1,11:25,GSW,shot,,,,,,,,,,Anthony Tolliver,,,,missed,,3pt,5,21
Anthony Morrow,Anthony Tolliver,C.J. Watson,Ronny Turiaf,Stephen Curry,Dwight Howard,Jameer Nelson,Matt Barnes,Rashard Lewis,Vince Carter,1,11:25,ORL,rebound,,,,,,,,,,Jameer Nelson,,,,,,def,,
Anthony Morrow,Anthony Tolliver,C.J. Watson,Ronny Turiaf,Stephen Curry,Dwight Howard,Jameer Nelson,Matt Barnes,Rashard Lewis,Vince Carter,1,11:20,ORL,shot,,,,,,,,,,Jameer Nelson,,,,missed,,layup,25,6
Anthony Morrow,Anthony Tolliver,C.J. Watson,Ronny Turiaf,Stephen Curry,Dwight Howard,Jameer Nelson,Matt Barnes,Rashard Lewis,Vince Carter,1,11:16,GSW,rebound,,,,,,,,,,Ronny Turiaf,,,,,,def,,
Anthony Morrow,Anthony Tolliver,C.J. Watson,Ronny Turiaf,Stephen Curry,Dwight Howard,Jameer Nelson,Matt Barnes,Rashard Lewis,Vince Carter,1,11:13,GSW,shot,Stephen Curry,,,,,,,,,C.J. Watson,2,,,made,,jump,12,22
Anthony Morrow,Anthony Tolliver,C.J. Watson,Ronny Turiaf,Stephen Curry,Dwight Howard,Jameer Nelson,Matt Barnes,Rashard Lewis,Vince Carter,1,10:56,ORL,shot,,,,,,,,,,Vince Carter,2,,,made,,layup,25,6
Anthony Morrow,Anthony Tolliver,C.J. Watson,Ronny Turiaf,Stephen Curry,Dwight Howard,Jameer Nelson,Matt Barnes,Rashard Lewis,Vince Carter,1,10:42,ORL,foul,,,,,,,,C.J. Watson,,Jameer Nelson,,,,,,personal,,
Anthony Morrow,Anthony Tolliver,C.J. Watson,Ronny Turiaf,Stephen Curry,Dwight Howard,Jameer Nelson,Matt Barnes,Rashard Lewis,Vince Carter,1,10:39,GSW,shot,,,,,,,,,,Ronny Turiaf,,,,missed,,jump,34,23
Anthony Morrow,Anthony Tolliver,C.J. Watson,Ronny Turiaf,Stephen Curry,Dwight Howard,Jameer Nelson,Matt Barnes,Rashard Lewis,Vince Carter,1,10:38,ORL,rebound,,,,,,,,,,Rashard Lewis,,,,,,def,,
Anthony Morrow,Anthony Tolliver,C.J. Watson,Ronny Turiaf,Stephen Curry,Dwight Howard,Jameer Nelson,Matt Barnes,Rashard Lewis,Vince Carter,1,10:31,ORL,turnover,,,,,,,,,,Matt Barnes,,,bad pass,,Anthony Morrow,,,
Anthony Morrow,Anthony Tolliver,C.J. Watson,Ronny Turiaf,Stephen Curry,Dwight Howard,Jameer Nelson,Matt Barnes,Rashard Lewis,Vince Carter,1,10:14,ORL,foul,,,,,,,,C.J. Watson,,Rashard Lewis,,,,,,shooting,,
Anthony Morrow,Anthony Tolliver,C.J. Watson,Ronny Turiaf,Stephen Curry,Dwight Howard,Jameer Nelson,Matt Barnes,Rashard Lewis,Vince Carter,1,10:14,GSW,free throw,,,,,,,1,,2,C.J. Watson,,,foul,missed,,,,
Anthony Morrow,Anthony Tolliver,C.J. Watson,Ronny Turiaf,Stephen Curry,Dwight Howard,Jameer Nelson,Matt Barnes,Rashard Lewis,Vince Carter,1,10:14,GSW,rebound,,,,,,,,,,,,,,,,,,
Anthony Morrow,Anthony Tolliver,C.J. Watson,Ronny Turiaf,Stephen Curry,Dwight Howard,Jameer Nelson,Matt Barnes,Rashard Lewis,Vince Carter,1,10:14,GSW,free throw,,,,,,,2,,2,C.J. Watson,,,foul,made,,,,
Anthony Morrow,Anthony Tolliver,C.J. Watson,Ronny Turiaf,Stephen Curry,Dwight Howard,Jameer Nelson,Matt Barnes,Rashard Lewis,Vince Carter,1,10:03,ORL,shot,Rashard Lewis,,,,,,,,,Dwight Howard,2,,,made,,slam dunk,25,6
Anthony Morrow,Anthony Tolliver,C.J. Watson,Ronny Turiaf,Stephen Curry,Dwight Howard,Jameer Nelson,Matt Barnes,Rashard Lewis,Vince Carter,1,9:40,GSW,shot,,,,,,,,,,Anthony Morrow,,,,missed,,jump,45,9
Anthony Morrow,Anthony Tolliver,C.J. Watson,Ronny Turiaf,Stephen Curry,Dwight Howard,Jameer Nelson,Matt Barnes,Rashard Lewis,Vince Carter,1,9:39,ORL,rebound,,,,,,,,,,Dwight Howard,,,,,,def,,
Anthony Morrow,Anthony Tolliver,C.J. Watson,Ronny Turiaf,Stephen Curry,Dwight Howard,Jameer Nelson,Matt Barnes,Rashard Lewis,Vince Carter,1,9:32,ORL,shot,,,,,,,,,,Jameer Nelson,2,,,made,,jump,27,26
Anthony Morrow,Anthony Tolliver,C.J. Watson,Ronny Turiaf,Stephen Curry,Dwight Howard,Jameer Nelson,Matt Barnes,Rashard Lewis,Vince Carter,1,9:22,ORL,foul,,,,,,,,C.J. Watson,,Vince Carter,,,,,,personal,,
Anthony Morrow,Anthony Tolliver,C.J. Watson,Ronny Turiaf,Stephen Curry,Dwight Howard,Jameer Nelson,Matt Barnes,Rashard Lewis,Vince Carter,1,9:18,GSW,shot,,,,,,,,,,Stephen Curry,,,,missed,,jump,41,19
Anthony Morrow,Anthony Tolliver,C.J. Watson,Ronny Turiaf,Stephen Curry,Dwight Howard,Jameer Nelson,Matt Barnes,Rashard Lewis,Vince Carter,1,9:17,ORL,rebound,,,,,,,,,,Vince Carter,,,,,,def,,
Anthony Morrow,Anthony Tolliver,C.J. Watson,Ronny Turiaf,Stephen Curry,Dwight Howard,Jameer Nelson,Matt Barnes,Rashard Lewis,Vince Carter,1,9:07,ORL,turnover,,,,,,,,,,Dwight Howard,,,bad pass,,Stephen Curry,,,
Anthony Morrow,Anthony Tolliver,C.J. Watson,Ronny Turiaf,Stephen Curry,Dwight Howard,Jameer Nelson,Matt Barnes,Rashard Lewis,Vince Carter,1,9:00,GSW,shot,,,,,,,,,,Stephen Curry,2,,,made,,driving layup,25,6
Anthony Morrow,Anthony Tolliver,C.J. Watson,Ronny Turiaf,Stephen Curry,Dwight Howard,Jameer Nelson,Matt Barnes,Rashard Lewis,Vince Carter,1,8:50,ORL,shot,,,,,,,,,,Vince Carter,,,,missed,,3pt,41,26
Anthony Morrow,Anthony Tolliver,C.J. Watson,Ronny Turiaf,Stephen Curry,Dwight Howard,Jameer Nelson,Matt Barnes,Rashard Lewis,Vince Carter,1,8:49,GSW,rebound,,,,,,,,,,Anthony Tolliver,,,,,,def,,
Anthony Morrow,Anthony Tolliver,C.J. Watson,Ronny Turiaf,Stephen Curry,Dwight Howard,Jameer Nelson,Matt Barnes,Rashard Lewis,Vince Carter,1,8:36,GSW,shot,,,,,,,,,,Anthony Tolliver,,,,missed,,3pt,19,32
Anthony Morrow,Anthony Tolliver,C.J. Watson,Ronny Turiaf,Stephen Curry,Dwight Howard,Jameer Nelson,Matt Barnes,Rashard Lewis,Vince Carter,1,8:35,ORL,rebound,,,,,,,,,,Dwight Howard,,,,,,def,,
Anthony Morrow,Anthony Tolliver,C.J. Watson,Ronny Turiaf,Stephen Curry,Dwight Howard,Jameer Nelson,Matt Barnes,Rashard Lewis,Vince Carter,1,8:30,ORL,shot,Jameer Nelson,,,,,,,,,Matt Barnes,2,,,made,,layup,25,6
Anthony Morrow,Anthony Tolliver,C.J. Watson,Ronny Turiaf,Stephen Curry,Dwight Howard,Jameer Nelson,Matt Barnes,Rashard Lewis,Vince Carter,1,8:20,GSW,shot,,,,,,,,,,C.J. Watson,2,,,made,,layup,25,6
Anthony Morrow,Anthony Tolliver,C.J. Watson,Ronny Turiaf,Stephen Curry,Dwight Howard,Jameer Nelson,Matt Barnes,Rashard Lewis,Vince Carter,1,8:20,ORL,foul,,,,,,,,C.J. Watson,,Vince Carter,,,,,,shooting,,
Anthony Morrow,Anthony Tolliver,C.J. Watson,Ronny Turiaf,Stephen Curry,Dwight Howard,J.J. Redick,Jameer Nelson,Matt Barnes,Rashard Lewis,1,8:20,ORL,sub,,,,J.J. Redick,,Vince Carter,,,,,,,,,,,,
Anthony Morrow,Anthony Tolliver,C.J. Watson,Ronny Turiaf,Stephen Curry,Dwight Howard,J.J. Redick,Jameer Nelson,Matt Barnes,Rashard Lewis,1,8:20,GSW,free throw,,,,,,,1,,1,C.J. Watson,,,foul,made,,,,
Anthony Morrow,Anthony Tolliver,C.J. Watson,Ronny Turiaf,Stephen Curry,Dwight Howard,J.J. Redick,Jameer Nelson,Matt Barnes,Rashard Lewis,1,8:12,ORL,shot,,,,,,,,,,Jameer Nelson,,,,missed,,layup,25,6
Anthony Morrow,Anthony Tolliver,C.J. Watson,Ronny Turiaf,Stephen Curry,Dwight Howard,J.J. Redick,Jameer Nelson,Matt Barnes,Rashard Lewis,1,8:10,GSW,rebound,,,,,,,,,,C.J. Watson,,,,,,def,,
Anthony Morrow,Anthony Tolliver,C.J. Watson,Ronny Turiaf,Stephen Curry,Dwight Howard,J.J. Redick,Jameer Nelson,Matt Barnes,Rashard Lewis,1,8:02,GSW,shot,,,Dwight Howard,,,,,,,Anthony Tolliver,,,,missed,,layup,25,6
Anthony Morrow,Anthony Tolliver,C.J. Watson,Ronny Turiaf,Stephen Curry,Dwight Howard,J.J. Redick,Jameer Nelson,Matt Barnes,Rashard Lewis,1,8:01,GSW,rebound,,,,,,,,,,Anthony Tolliver,,,,,,off,,
Anthony Morrow,Anthony Tolliver,C.J. Watson,Ronny Turiaf,Stephen Curry,Dwight Howard,J.J. Redick,Jameer Nelson,Matt Barnes,Rashard Lewis,1,7:58,ORL,violation,,,,,,,,,,Dwight Howard,,,,,,defensive goaltending,,
Anthony Morrow,Anthony Tolliver,C.J. Watson,Ronny Turiaf,Stephen Curry,Dwight Howard,J.J. Redick,Jameer Nelson,Matt Barnes,Rashard Lewis,1,7:58,GSW,shot,,,,,,,,,,Anthony Tolliver,2,,,made,,jump,29,10
Anthony Morrow,Anthony Tolliver,C.J. Watson,Ronny Turiaf,Stephen Curry,Dwight Howard,J.J. Redick,Jameer Nelson,Matt Barnes,Rashard Lewis,1,7:43,ORL,shot,Dwight Howard,,,,,,,,,J.J. Redick,2,,,made,,jump,38,10
Anthony Morrow,Anthony Tolliver,C.J. Watson,Ronny Turiaf,Stephen Curry,Dwight Howard,J.J. Redick,Jameer Nelson,Matt Barnes,Rashard Lewis,1,7:31,GSW,shot,,,,,,,,,,Stephen Curry,,,,missed,,jump bank,38,16
Anthony Morrow,Anthony Tolliver,C.J. Watson,Ronny Turiaf,Stephen Curry,Dwight Howard,J.J. Redick,Jameer Nelson,Matt Barnes,Rashard Lewis,1,7:30,ORL,rebound,,,,,,,,,,Jameer Nelson,,,,,,def,,
Anthony Morrow,Anthony Tolliver,C.J. Watson,Ronny Turiaf,Stephen Curry,Dwight Howard,J.J. Redick,Jameer Nelson,Matt Barnes,Rashard Lewis,1,7:08,ORL,shot,,,,,,,,,,Dwight Howard,2,,,made,,layup,25,6
Anthony Morrow,Anthony Tolliver,C.J. Watson,Ronny Turiaf,Stephen Curry,Dwight Howard,J.J. Redick,Jameer Nelson,Matt Barnes,Rashard Lewis,1,7:02,GSW,shot,,,,,,,,,,Anthony Morrow,,,,missed,,layup,25,6
Anthony Morrow,Anthony Tolliver,C.J. Watson,Ronny Turiaf,Stephen Curry,Dwight Howard,J.J. Redick,Jameer Nelson,Matt Barnes,Rashard Lewis,1,7:00,ORL,rebound,,,,,,,,,,J.J. Redick,,,,,,def,,
Anthony Morrow,Anthony Tolliver,C.J. Watson,Ronny Turiaf,Stephen Curry,Dwight Howard,J.J. Redick,Jameer Nelson,Matt Barnes,Rashard Lewis,1,6:53,ORL,turnover,,,,,,,,,,Dwight Howard,,,lost ball,,C.J. Watson,,,
Anthony Morrow,Anthony Tolliver,C.J. Watson,Ronny Turiaf,Stephen Curry,Dwight Howard,J.J. Redick,Jameer Nelson,Matt Barnes,Rashard Lewis,1,6:46,GSW,shot,,,,,,,,,,Anthony Tolliver,,,,missed,,jump,9,15
Anthony Morrow,Anthony Tolliver,C.J. Watson,Ronny Turiaf,Stephen Curry,Dwight Howard,J.J. Redick,Jameer Nelson,Matt Barnes,Rashard Lewis,1,6:45,ORL,rebound,,,,,,,,,,Dwight Howard,,,,,,def,,
Anthony Morrow,Anthony Tolliver,C.J. Watson,Ronny Turiaf,Stephen Curry,Dwight Howard,J.J. Redick,Jameer Nelson,Matt Barnes,Rashard Lewis,1,6:35,ORL,turnover,,,,,,,,,,Matt Barnes,,,bad pass,,C.J. Watson,,,
Anthony Morrow,Anthony Tolliver,C.J. Watson,Ronny Turiaf,Stephen Curry,Dwight Howard,J.J. Redick,Jameer Nelson,Matt Barnes,Rashard Lewis,1,6:26,GSW,shot,,,,,,,,,,Stephen Curry,,,,missed,,3pt,48,10
Anthony Morrow,Anthony Tolliver,C.J. Watson,Ronny Turiaf,Stephen Curry,Dwight Howard,J.J. Redick,Jameer Nelson,Matt Barnes,Rashard Lewis,1,6:25,ORL,rebound,,,,,,,,,,Matt Barnes,,,,,,def,,
Anthony Morrow,Anthony Tolliver,C.J. Watson,Ronny Turiaf,Stephen Curry,Dwight Howard,J.J. Redick,Jameer Nelson,Matt Barnes,Rashard Lewis,1,5:58,ORL,shot,,,,,,,,,,Dwight Howard,,,,missed,,hook,16,9
Anthony Morrow,Anthony Tolliver,C.J. Watson,Ronny Turiaf,Stephen Curry,Dwight Howard,J.J. Redick,Jameer Nelson,Matt Barnes,Rashard Lewis,1,5:56,GSW,rebound,,,,,,,,,,Stephen Curry,,,,,,def,,
Anthony Morrow,Anthony Tolliver,C.J. Watson,Ronny Turiaf,Stephen Curry,Dwight Howard,J.J. Redick,Jameer Nelson,Matt Barnes,Rashard Lewis,1,5:49,GSW,turnover,,,,,,,,,,Anthony Morrow,,,lost ball,,Jameer Nelson,,,
Anthony Morrow,Anthony Tolliver,C.J. Watson,Ronny Turiaf,Stephen Curry,Dwight Howard,J.J. Redick,Jameer Nelson,Matt Barnes,Rashard Lewis,1,5:42,ORL,shot,,,,,,,,,,Jameer Nelson,2,,,made,,layup,25,6
Anthony Morrow,Anthony Tolliver,C.J. Watson,Ronny Turiaf,Stephen Curry,Dwight Howard,J.J. Redick,Jameer Nelson,Matt Barnes,Rashard Lewis,1,5:28,GSW,shot,Anthony Tolliver,,,,,,,,,Ronny Turiaf,2,,,made,,layup,25,6
Anthony Morrow,Anthony Tolliver,C.J. Watson,Ronny Turiaf,Stephen Curry,Dwight Howard,J.J. Redick,Jameer Nelson,Matt Barnes,Rashard Lewis,1,5:13,ORL,shot,,,,,,,,,,Jameer Nelson,,,,missed,,layup,25,6
Anthony Morrow,Anthony Tolliver,C.J. Watson,Ronny Turiaf,Stephen Curry,Dwight Howard,J.J. Redick,Jameer Nelson,Matt Barnes,Rashard Lewis,1,5:12,ORL,rebound,,,,,,,,,,Dwight Howard,,,,,,off,,
Anthony Morrow,Anthony Tolliver,C.J. Watson,Ronny Turiaf,Stephen Curry,Dwight Howard,J.J. Redick,Jameer Nelson,Matt Barnes,Rashard Lewis,1,5:10,GSW,foul,,,,,,,,Dwight Howard,,Anthony Tolliver,,,,,,shooting,,
Anthony Morrow,Anthony Tolliver,C.J. Watson,Ronny Turiaf,Stephen Curry,Dwight Howard,J.J. Redick,Jameer Nelson,Matt Barnes,Rashard Lewis,1,5:10,ORL,timeout,,,,,,,,,,,,,,,,regular,,
Anthony Tolliver,C.J. Watson,Reggie Williams,Ronny Turiaf,Stephen Curry,Dwight Howard,J.J. Redick,Jameer Nelson,Matt Barnes,Rashard Lewis,1,5:10,GSW,sub,,,,Reggie Williams,,Anthony Morrow,,,,,,,,,,,,
Anthony Tolliver,C.J. Watson,Reggie Williams,Ronny Turiaf,Stephen Curry,Dwight Howard,J.J. Redick,Jameer Nelson,Matt Barnes,Rashard Lewis,1,5:10,ORL,free throw,,,,,,,1,,2,Dwight Howard,,,foul,made,,,,
Anthony Tolliver,C.J. Watson,Reggie Williams,Ronny Turiaf,Stephen Curry,Dwight Howard,J.J. Redick,Jameer Nelson,Matt Barnes,Rashard Lewis,1,5:10,ORL,free throw,,,,,,,2,,2,Dwight Howard,,,foul,missed,,,,
Anthony Tolliver,C.J. Watson,Reggie Williams,Ronny Turiaf,Stephen Curry,Dwight Howard,J.J. Redick,Jameer Nelson,Matt Barnes,Rashard Lewis,1,5:10,GSW,rebound,,,,,,,,,,Anthony Tolliver,,,,,,def,,
Anthony Tolliver,C.J. Watson,Reggie Williams,Ronny Turiaf,Stephen Curry,Dwight Howard,J.J. Redick,Jameer Nelson,Matt Barnes,Rashard Lewis,1,4:56,GSW,shot,Anthony Tolliver,,,,,,,,,Ronny Turiaf,2,,,made,,jump,40,11
Anthony Tolliver,C.J. Watson,Reggie Williams,Ronny Turiaf,Stephen Curry,Dwight Howard,J.J. Redick,Jameer Nelson,Matt Barnes,Rashard Lewis,1,4:40,ORL,shot,,,,,,,,,,Rashard Lewis,,,,missed,,3pt,27,31
Anthony Tolliver,C.J. Watson,Reggie Williams,Ronny Turiaf,Stephen Curry,Dwight Howard,J.J. Redick,Jameer Nelson,Matt Barnes,Rashard Lewis,1,4:39,GSW,rebound,,,,,,,,,,,,,,,,,,
Anthony Tolliver,C.J. Watson,Reggie Williams,Ronny Turiaf,Stephen Curry,Dwight Howard,J.J. Redick,Jameer Nelson,Matt Barnes,Rashard Lewis,1,4:23,GSW,shot,,,,,,,,,,Anthony Tolliver,,,,missed,,hook,24,14
Anthony Tolliver,C.J. Watson,Reggie Williams,Ronny Turiaf,Stephen Curry,Dwight Howard,J.J. Redick,Jameer Nelson,Matt Barnes,Rashard Lewis,1,4:22,ORL,rebound,,,,,,,,,,Matt Barnes,,,,,,def,,
Anthony Tolliver,C.J. Watson,Reggie Williams,Ronny Turiaf,Stephen Curry,Dwight Howard,J.J. Redick,Jameer Nelson,Matt Barnes,Rashard Lewis,1,4:11,ORL,shot,,,,,,,,,,Rashard Lewis,,,,missed,,3pt,49,10
Anthony Tolliver,C.J. Watson,Reggie Williams,Ronny Turiaf,Stephen Curry,Dwight Howard,J.J. Redick,Jameer Nelson,Matt Barnes,Rashard Lewis,1,4:10,GSW,rebound,,,,,,,,,,Ronny Turiaf,,,,,,def,,
Anthony Tolliver,C.J. Watson,Reggie Williams,Ronny Turiaf,Stephen Curry,Dwight Howard,J.J. Redick,Jameer Nelson,Matt Barnes,Rashard Lewis,1,4:03,GSW,shot,,,Dwight Howard,,,,,,,C.J. Watson,,,,missed,,layup,25,6
Anthony Tolliver,C.J. Watson,Reggie Williams,Ronny Turiaf,Stephen Curry,Dwight Howard,J.J. Redick,Jameer Nelson,Matt Barnes,Rashard Lewis,1,3:59,ORL,rebound,,,,,,,,,,J.J. Redick,,,,,,def,,
Anthony Tolliver,C.J. Watson,Reggie Williams,Ronny Turiaf,Stephen Curry,Dwight Howard,J.J. Redick,Jameer Nelson,Matt Barnes,Rashard Lewis,1,3:56,ORL,shot,,,,,,,,,,J.J. Redick,2,,,made,,layup,25,6
Anthony Tolliver,C.J. Watson,Reggie Williams,Ronny Turiaf,Stephen Curry,Dwight Howard,J.J. Redick,Jameer Nelson,Matt Barnes,Rashard Lewis,1,3:50,ORL,foul,,,,,,,,Stephen Curry,,Matt Barnes,,,,,,personal,,
Anthony Tolliver,C.J. Watson,Reggie Williams,Ronny Turiaf,Stephen Curry,Dwight Howard,J.J. Redick,Jameer Nelson,Matt Barnes,Rashard Lewis,1,3:50,GSW,free throw,,,,,,,1,,2,Stephen Curry,,,foul,made,,,,
Anthony Tolliver,C.J. Watson,Chris Hunter,Reggie Williams,Stephen Curry,Dwight Howard,J.J. Redick,Jameer Nelson,Matt Barnes,Rashard Lewis,1,3:50,GSW,sub,,,,Chris Hunter,,Ronny Turiaf,,,,,,,,,,,,
Anthony Tolliver,C.J. Watson,Chris Hunter,Reggie Williams,Stephen Curry,Dwight Howard,J.J. Redick,Jameer Nelson,Matt Barnes,Rashard Lewis,1,3:50,GSW,free throw,,,,,,,2,,2,Stephen Curry,,,foul,made,,,,
Anthony Tolliver,C.J. Watson,Chris Hunter,Reggie Williams,Stephen Curry,Dwight Howard,J.J. Redick,Jameer Nelson,Matt Barnes,Rashard Lewis,1,3:34,ORL,turnover,,,,,,,,,,Dwight Howard,,,traveling,,,,,
Anthony Tolliver,C.J. Watson,Chris Hunter,Reggie Williams,Stephen Curry,Dwight Howard,J.J. Redick,Jameer Nelson,Matt Barnes,Rashard Lewis,1,3:24,GSW,shot,,,,,,,,,,Stephen Curry,,,,missed,,jump,23,20
Anthony Tolliver,C.J. Watson,Chris Hunter,Reggie Williams,Stephen Curry,Dwight Howard,J.J. Redick,Jameer Nelson,Matt Barnes,Rashard Lewis,1,3:23,GSW,rebound,,,,,,,,,,Reggie Williams,,,,,,off,,
Anthony Tolliver,C.J. Watson,Chris Hunter,Reggie Williams,Stephen Curry,Dwight Howard,J.J. Redick,Jameer Nelson,Matt Barnes,Rashard Lewis,1,3:18,GSW,shot,,,,,,,,,,Reggie Williams,2,,,made,,jump bank,17,11
Anthony Tolliver,C.J. Watson,Chris Hunter,Reggie Williams,Stephen Curry,Dwight Howard,J.J. Redick,Jameer Nelson,Matt Barnes,Rashard Lewis,1,3:05,GSW,foul,,,,,,,,Jameer Nelson,,Anthony Tolliver,,,,,,personal,,
Anthony Tolliver,C.J. Watson,Chris Hunter,Reggie Williams,Stephen Curry,Dwight Howard,J.J. Redick,Jameer Nelson,Matt Barnes,Rashard Lewis,1,2:52,ORL,shot,,,,,,,,,,Dwight Howard,2,,,made,,hook,32,9
Anthony Tolliver,C.J. Watson,Chris Hunter,Reggie Williams,Stephen Curry,Dwight Howard,J.J. Redick,Jameer Nelson,Matt Barnes,Rashard Lewis,1,2:34,GSW,shot,,,,,,,,,,Chris Hunter,,,,missed,,jump,13,16
Anthony Tolliver,C.J. Watson,Chris Hunter,Reggie Williams,Stephen Curry,Dwight Howard,J.J. Redick,Jameer Nelson,Matt Barnes,Rashard Lewis,1,2:33,ORL,rebound,,,,,,,,,,Matt Barnes,,,,,,def,,
Anthony Tolliver,C.J. Watson,Chris Hunter,Reggie Williams,Stephen Curry,Dwight Howard,J.J. Redick,Jameer Nelson,Matt Barnes,Rashard Lewis,1,2:26,ORL,shot,,,,,,,,,,Dwight Howard,2,,,made,,hook,22,12
Anthony Tolliver,C.J. Watson,Chris Hunter,Reggie Williams,Stephen Curry,Dwight Howard,J.J. Redick,Jameer Nelson,Matt Barnes,Rashard Lewis,1,2:26,GSW,foul,,,,,,,,Dwight Howard,,Chris Hunter,,,,,,shooting,,
Anthony Tolliver,C.J. Watson,Chris Hunter,Reggie Williams,Stephen Curry,Dwight Howard,J.J. Redick,Jameer Nelson,Matt Barnes,Rashard Lewis,1,2:26,GSW,timeout,,,,,,,,,,,,,,,,regular,,
Anthony Tolliver,C.J. Watson,Chris Hunter,Reggie Williams,Stephen Curry,Dwight Howard,J.J. Redick,Jason Williams,Matt Barnes,Rashard Lewis,1,2:26,ORL,sub,,,,Jason Williams,,Jameer Nelson,,,,,,,,,,,,
Anthony Tolliver,C.J. Watson,Chris Hunter,Reggie Williams,Stephen Curry,Dwight Howard,J.J. Redick,Jason Williams,Matt Barnes,Rashard Lewis,1,2:26,ORL,free throw,,,,,,,1,,1,Dwight Howard,,,foul,missed,,,,
Anthony Tolliver,C.J. Watson,Chris Hunter,Reggie Williams,Stephen Curry,Dwight Howard,J.J. Redick,Jason Williams,Matt Barnes,Rashard Lewis,1,2:25,GSW,rebound,,,,,,,,,,,,,,,,,,
Anthony Tolliver,C.J. Watson,Chris Hunter,Reggie Williams,Stephen Curry,Dwight Howard,J.J. Redick,Jason Williams,Matt Barnes,Rashard Lewis,1,2:17,GSW,shot,,,,,,,,,,Reggie Williams,,,,missed,,3pt,22,33
Anthony Tolliver,C.J. Watson,Chris Hunter,Reggie Williams,Stephen Curry,Dwight Howard,J.J. Redick,Jason Williams,Matt Barnes,Rashard Lewis,1,2:16,ORL,rebound,,,,,,,,,,Jason Williams,,,,,,def,,
Anthony Tolliver,C.J. Watson,Chris Hunter,Reggie Williams,Stephen Curry,Dwight Howard,J.J. Redick,Jason Williams,Matt Barnes,Rashard Lewis,1,2:11,ORL,shot,J.J. Redick,,,,,,,,,Matt Barnes,2,,,made,,layup,25,6
Anthony Tolliver,C.J. Watson,Chris Hunter,Reggie Williams,Stephen Curry,Dwight Howard,J.J. Redick,Jason Williams,Matt Barnes,Rashard Lewis,1,1:54,GSW,shot,,,,,,,,,,Reggie Williams,2,,,made,,driving layup,25,6
Anthony Tolliver,C.J. Watson,Chris Hunter,Reggie Williams,Stephen Curry,Dwight Howard,J.J. Redick,Jason Williams,Matt Barnes,Rashard Lewis,1,1:27,GSW,foul,,,,,,,,Dwight Howard,,Chris Hunter,,,,,,shooting,,
Anthony Tolliver,C.J. Watson,Chris Hunter,Reggie Williams,Stephen Curry,Dwight Howard,J.J. Redick,Jason Williams,Matt Barnes,Rashard Lewis,1,1:27,ORL,free throw,,,,,,,1,,2,Dwight Howard,,,foul,made,,,,
Anthony Tolliver,C.J. Watson,Chris Hunter,Reggie Williams,Stephen Curry,Dwight Howard,J.J. Redick,Jason Williams,Matt Barnes,Rashard Lewis,1,1:27,ORL,free throw,,,,,,,2,,2,Dwight Howard,,,foul,made,,,,
Anthony Tolliver,C.J. Watson,Chris Hunter,Reggie Williams,Stephen Curry,Dwight Howard,J.J. Redick,Jason Williams,Matt Barnes,Rashard Lewis,1,1:16,GSW,shot,Stephen Curry,,,,,,,,,Chris Hunter,2,,,made,,layup,25,6
Anthony Tolliver,C.J. Watson,Chris Hunter,Reggie Williams,Stephen Curry,Dwight Howard,J.J. Redick,Jason Williams,Matt Barnes,Rashard Lewis,1,0:55,ORL,shot,,,,,,,,,,Dwight Howard,2,,,made,,jump,25,12
Anthony Tolliver,C.J. Watson,Chris Hunter,Reggie Williams,Stephen Curry,Dwight Howard,J.J. Redick,Jason Williams,Matt Barnes,Rashard Lewis,1,0:49,GSW,shot,,,,,,,,,,Stephen Curry,,,,missed,,jump,40,19
Anthony Tolliver,C.J. Watson,Chris Hunter,Reggie Williams,Stephen Curry,Dwight Howard,J.J. Redick,Jason Williams,Matt Barnes,Rashard Lewis,1,0:48,ORL,rebound,,,,,,,,,,Matt Barnes,,,,,,def,,
Anthony Tolliver,C.J. Watson,Chris Hunter,Reggie Williams,Stephen Curry,Dwight Howard,J.J. Redick,Jason Williams,Matt Barnes,Rashard Lewis,1,0:41,ORL,turnover,,,,,,,,,,Jason Williams,,,out of bounds lost ball turnover,,,,,
Anthony Tolliver,C.J. Watson,Chris Hunter,Reggie Williams,Stephen Curry,Dwight Howard,J.J. Redick,Jason Williams,Matt Barnes,Rashard Lewis,1,0:34,GSW,turnover,,,,,,,,,,Stephen Curry,,,lost ball,,Rashard Lewis,,,
Anthony Tolliver,C.J. Watson,Chris Hunter,Reggie Williams,Stephen Curry,Dwight Howard,J.J. Redick,Jason Williams,Matt Barnes,Rashard Lewis,1,0:24,GSW,foul,,,,,,,,,,Chris Hunter,,,,,,defense 3 second,,
Anthony Tolliver,C.J. Watson,Chris Hunter,Reggie Williams,Stephen Curry,Dwight Howard,J.J. Redick,Jason Williams,Matt Barnes,Rashard Lewis,1,0:24,ORL,free throw,,,,,,,1,,1,J.J. Redick,,,technical,made,,,,
Anthony Morrow,C.J. Watson,Chris Hunter,Reggie Williams,Stephen Curry,Dwight Howard,J.J. Redick,Jason Williams,Matt Barnes,Rashard Lewis,1,0:24,GSW,sub,,,,Anthony Morrow,,Anthony Tolliver,,,,,,,,,,,,
Anthony Morrow,C.J. Watson,Chris Hunter,Reggie Williams,Stephen Curry,Dwight Howard,J.J. Redick,Jason Williams,Matt Barnes,Rashard Lewis,1,0:13,ORL,shot,,,,,,,,,,Rashard Lewis,2,,,made,,layup,25,6
Anthony Morrow,C.J. Watson,Chris Hunter,Reggie Williams,Stephen Curry,Dwight Howard,J.J. Redick,Jason Williams,Matt Barnes,Rashard Lewis,1,0:03,GSW,shot,,,,,,,,,,Stephen Curry,,,,missed,,jump,23,24
Anthony Morrow,C.J. Watson,Chris Hunter,Reggie Williams,Stephen Curry,Dwight Howard,J.J. Redick,Jason Williams,Matt Barnes,Rashard Lewis,1,0:02,ORL,rebound,,,,,,,,,,Dwight Howard,,,,,,def,,
Anthony Morrow,C.J. Watson,Chris Hunter,Reggie Williams,Stephen Curry,Dwight Howard,J.J. Redick,Jason Williams,Matt Barnes,Rashard Lewis,1,0:00,ORL,shot,,,,,,,,,,Dwight Howard,,,,missed,,3pt,30,84
Anthony Morrow,C.J. Watson,Chris Hunter,Reggie Williams,Stephen Curry,Dwight Howard,J.J. Redick,Jason Williams,Matt Barnes,Rashard Lewis,1,0:00,ORL,rebound,,,,,,,,,,,,,,,,,,
Anthony Morrow,C.J. Watson,Reggie Williams,Ronny Turiaf,Stephen Curry,Dwight Howard,J.J. Redick,Jason Williams,Mickael Pietrus,Rashard Lewis,2,11:53,GSW,shot,,,Mickael Pietrus,,,,,,,Stephen Curry,,,,missed,,layup,25,6
Anthony Morrow,C.J. Watson,Reggie Williams,Ronny Turiaf,Stephen Curry,Dwight Howard,J.J. Redick,Jason Williams,Mickael Pietrus,Rashard Lewis,2,11:51,ORL,rebound,,,,,,,,,,Dwight Howard,,,,,,def,,
Anthony Morrow,C.J. Watson,Reggie Williams,Ronny Turiaf,Stephen Curry,Dwight Howard,J.J. Redick,Jason Williams,Mickael Pietrus,Rashard Lewis,2,11:40,ORL,shot,,,Ronny Turiaf,,,,,,,J.J. Redick,,,,missed,,layup,25,6
Anthony Morrow,C.J. Watson,Reggie Williams,Ronny Turiaf,Stephen Curry,Dwight Howard,J.J. Redick,Jason Williams,Mickael Pietrus,Rashard Lewis,2,11:38,GSW,rebound,,,,,,,,,,Anthony Morrow,,,,,,def,,