a1,a2,a3,a4,a5,h1,h2,h3,h4,h5,period,time,team,etype,assist,away,block,entered,home,left,num,opponent,outof,player,points,possession,reason,result,steal,type,x,y
Boris Diaw,Gerald Wallace,Raymond Felton,Stephen Jackson,Theo Ratliff,Marc Gasol,Mike Conley,O.J. Mayo,Rudy Gay,Zach Randolph,1,12:00,OFF,jump ball,,Theo Ratliff,,,Marc Gasol,,,,,,,Gerald Wallace,,,,,,
Boris Diaw,Gerald Wallace,Raymond Felton,Stephen Jackson,Theo Ratliff,Marc Gasol,Mike Conley,O.J. Mayo,Rudy Gay,Zach Randolph,1,11:46,CHA,shot,Stephen Jackson,,,,,,,,,Theo Ratliff,2,,,made,,dunk,25,6
Boris Diaw,Gerald Wallace,Raymond Felton,Stephen Jackson,Theo Ratliff,Marc Gasol,Mike Conley,O.J. Mayo,Rudy Gay,Zach Randolph,1,11:33,MEM,shot,Marc Gasol,,,,,,,,,O.J. Mayo,2,,,made,,reverse layup,25,6
Boris Diaw,Gerald Wallace,Raymond Felton,Stephen Jackson,Theo Ratliff,Marc Gasol,Mike Conley,O.J. Mayo,Rudy Gay,Zach Randolph,1,11:18,CHA,shot,,,,,,,,,,Gerald Wallace,,,,missed,,jump,38,22
Boris Diaw,Gerald Wallace,Raymond Felton,Stephen Jackson,Theo Ratliff,Marc Gasol,Mike Conley,O.J. Mayo,Rudy Gay,Zach Randolph,1,11:16,CHA,rebound,,,,,,,,,,Raymond Felton,,,,,,off,,
Boris Diaw,Gerald Wallace,Raymond Felton,Stephen Jackson,Theo Ratliff,Marc Gasol,Mike Conley,O.J. Mayo,Rudy Gay,Zach Randolph,1,11:04,CHA,shot,,,,,,,,,,Raymond Felton,,,,missed,,3pt,15,29
Boris Diaw,Gerald Wallace,Raymond Felton,Stephen Jackson,Theo Ratliff,Marc Gasol,Mike Conley,O.J. Mayo,Rudy Gay,Zach Randolph,1,11:03,MEM,rebound,,,,,,,,,,Zach Randolph,,,,,,def,,
Boris Diaw,Gerald Wallace,Raymond Felton,Stephen Jackson,Theo Ratliff,Marc Gasol,Mike Conley,O.J. Mayo,Rudy Gay,Zach Randolph,1,10:48,MEM,shot,,,,,,,,,,Marc Gasol,,,,missed,,turnaround jump,30,9
Boris Diaw,Gerald Wallace,Raymond Felton,Stephen Jackson,Theo Ratliff,Marc Gasol,Mike Conley,O.J. Mayo,Rudy Gay,Zach Randolph,1,10:46,CHA,rebound,,,,,,,,,,Stephen Jackson,,,,,,def,,
Boris Diaw,Gerald Wallace,Raymond Felton,Stephen Jackson,Theo Ratliff,Marc Gasol,Mike Conley,O.J. Mayo,Rudy Gay,Zach Randolph,1,10:41,CHA,shot,Raymond Felton,,,,,,,,,Boris Diaw,2,,,made,,layup,25,6
Boris Diaw,Gerald Wallace,Raymond Felton,Stephen Jackson,Theo Ratliff,Marc Gasol,Mike Conley,O.J. Mayo,Rudy Gay,Zach Randolph,1,10:19,MEM,shot,,,,,,,,,,Rudy Gay,,,,missed,,pullup jump,10,20
Boris Diaw,Gerald Wallace,Raymond Felton,Stephen Jackson,Theo Ratliff,Marc Gasol,Mike Conley,O.J. Mayo,Rudy Gay,Zach Randolph,1,10:17,MEM,rebound,,,,,,,,,,Marc Gasol,,,,,,off,,
Boris Diaw,Gerald Wallace,Raymond Felton,Stephen Jackson,Theo Ratliff,Marc Gasol,Mike Conley,O.J. Mayo,Rudy Gay,Zach Randolph,1,10:16,MEM,shot,,,Theo Ratliff,,,,,,,Marc Gasol,,,,missed,,layup,25,6
Boris Diaw,Gerald Wallace,Raymond Felton,Stephen Jackson,Theo Ratliff,Marc Gasol,Mike Conley,O.J. Mayo,Rudy Gay,Zach Randolph,1,10:14,CHA,rebound,,,,,,,,,,Raymond Felton,,,,,,def,,
Boris Diaw,Gerald Wallace,Raymond Felton,Stephen Jackson,Theo Ratliff,Marc Gasol,Mike Conley,O.J. Mayo,Rudy Gay,Zach Randolph,1,9:57,CHA,shot,,,,,,,,,,Theo Ratliff,,,,missed,,jump,35,21
Boris Diaw,Gerald Wallace,Raymond Felton,Stephen Jackson,Theo Ratliff,Marc Gasol,Mike Conley,O.J. Mayo,Rudy Gay,Zach Randolph,1,9:56,MEM,rebound,,,,,,,,,,O.J. Mayo,,,,,,def,,
Boris Diaw,Gerald Wallace,Raymond Felton,Stephen Jackson,Theo Ratliff,Marc Gasol,Mike Conley,O.J. Mayo,Rudy Gay,Zach Randolph,1,9:52,MEM,turnover,,,,,,,,,,O.J. Mayo,,,bad pass,,Raymond Felton,,,
Boris Diaw,Gerald Wallace,Raymond Felton,Stephen Jackson,Theo Ratliff,Marc Gasol,Mike Conley,O.J. Mayo,Rudy Gay,Zach Randolph,1,9:48,CHA,shot,,,,,,,,,,Raymond Felton,2,,,made,,reverse layup,25,6
Boris Diaw,Gerald Wallace,Raymond Felton,Stephen Jackson,Theo Ratliff,Marc Gasol,Mike Conley,O.J. Mayo,Rudy Gay,Zach Randolph,1,9:33,MEM,shot,,,Theo Ratliff,,,,,,,Rudy Gay,,,,missed,,slam dunk,25,6
Boris Diaw,Gerald Wallace,Raymond Felton,Stephen Jackson,Theo Ratliff,Marc Gasol,Mike Conley,O.J. Mayo,Rudy Gay,Zach Randolph,1,9:29,CHA,rebound,,,,,,,,,,Raymond Felton,,,,,,def,,
Boris Diaw,Gerald Wallace,Raymond Felton,Stephen Jackson,Theo Ratliff,Marc Gasol,Mike Conley,O.J. Mayo,Rudy Gay,Zach Randolph,1,9:24,CHA,shot,,,,,,,,,,Stephen Jackson,,,,missed,,3pt,48,8
Boris Diaw,Gerald Wallace,Raymond Felton,Stephen Jackson,Theo Ratliff,Marc Gasol,Mike Conley,O.J. Mayo,Rudy Gay,Zach Randolph,1,9:22,CHA,rebound,,,,,,,,,,Raymond Felton,,,,,,off,,
Boris Diaw,Gerald Wallace,Raymond Felton,Stephen Jackson,Theo Ratliff,Marc Gasol,Mike Conley,O.J. Mayo,Rudy Gay,Zach Randolph,1,9:12,CHA,turnover,,,,,,,,,,Theo Ratliff,,,lost ball,,Zach Randolph,,,
Boris Diaw,Gerald Wallace,Raymond Felton,Stephen Jackson,Theo Ratliff,Marc Gasol,Mike Conley,O.J. Mayo,Rudy Gay,Zach Randolph,1,9:07,MEM,shot,,,,,,,,,,O.J. Mayo,2,,,made,,layup,25,6
Boris Diaw,Gerald Wallace,Raymond Felton,Stephen Jackson,Theo Ratliff,Marc Gasol,Mike Conley,O.J. Mayo,Rudy Gay,Zach Randolph,1,8:48,CHA,shot,,,,,,,,,,Stephen Jackson,,,,missed,,jump,16,24
Boris Diaw,Gerald Wallace,Raymond Felton,Stephen Jackson,Theo Ratliff,Marc Gasol,Mike Conley,O.J. Mayo,Rudy Gay,Zach Randolph,1,8:41,CHA,rebound,,,,,,,,,,Stephen Jackson,,,,,,off,,
Boris Diaw,Gerald Wallace,Raymond Felton,Stephen Jackson,Theo Ratliff,Marc Gasol,Mike Conley,O.J. Mayo,Rudy Gay,Zach Randolph,1,8:41,CHA,shot,,,,,,,,,,Stephen Jackson,2,,,made,,driving layup,25,6
Boris Diaw,Gerald Wallace,Raymond Felton,Stephen Jackson,Theo Ratliff,Marc Gasol,Mike Conley,O.J. Mayo,Rudy Gay,Zach Randolph,1,8:33,MEM,shot,,,,,,,,,,O.J. Mayo,2,,,made,,running bank,20,11
Boris Diaw,Gerald Wallace,Raymond Felton,Stephen Jackson,Theo Ratliff,Marc Gasol,Mike Conley,O.J. Mayo,Rudy Gay,Zach Randolph,1,8:18,CHA,shot,Gerald Wallace,,,,,,,,,Raymond Felton,2,,,made,,layup,25,6
Boris Diaw,Gerald Wallace,Raymond Felton,Stephen Jackson,Theo Ratliff,Marc Gasol,Mike Conley,O.J. Mayo,Rudy Gay,Zach Randolph,1,7:58,MEM,shot,Rudy Gay,,,,,,,,,O.J. Mayo,3,,,made,,3pt,47,5
Boris Diaw,Gerald Wallace,Raymond Felton,Stephen Jackson,Theo Ratliff,Marc Gasol,Mike Conley,O.J. Mayo,Rudy Gay,Zach Randolph,1,7:40,CHA,shot,,,,,,,,,,Gerald Wallace,2,,,made,,driving layup,25,6
Boris Diaw,Gerald Wallace,Raymond Felton,Stephen Jackson,Theo Ratliff,Marc Gasol,Mike Conley,O.J. Mayo,Rudy Gay,Zach Randolph,1,7:15,MEM,shot,,,,,,,,,,Marc Gasol,,,,missed,,jump,40,6
Boris Diaw,Gerald Wallace,Raymond Felton,Stephen Jackson,Theo Ratliff,Marc Gasol,Mike Conley,O.J. Mayo,Rudy Gay,Zach Randolph,1,7:14,CHA,rebound,,,,,,,,,,Gerald Wallace,,,,,,def,,
Boris Diaw,Gerald Wallace,Raymond Felton,Stephen Jackson,Theo Ratliff,Marc Gasol,Mike Conley,O.J. Mayo,Rudy Gay,Zach Randolph,1,6:58,CHA,shot,,,,,,,,,,Gerald Wallace,,,,missed,,driving layup,25,6
Boris Diaw,Gerald Wallace,Raymond Felton,Stephen Jackson,Theo Ratliff,Marc Gasol,Mike Conley,O.J. Mayo,Rudy Gay,Zach Randolph,1,6:56,MEM,rebound,,,,,,,,,,Rudy Gay,,,,,,def,,
Boris Diaw,Gerald Wallace,Raymond Felton,Stephen Jackson,Theo Ratliff,Marc Gasol,Mike Conley,O.J. Mayo,Rudy Gay,Zach Randolph,1,6:52,MEM,turnover,,,,,,,,,,Rudy Gay,,,out of bounds lost ball turnover,,,,,
Boris Diaw,Gerald Wallace,Raymond Felton,Stephen Jackson,Theo Ratliff,Marc Gasol,Mike Conley,O.J. Mayo,Rudy Gay,Zach Randolph,1,6:40,CHA,turnover,,,,,,,,,,Boris Diaw,,,bad pass,,,,,
Boris Diaw,Gerald Wallace,Raymond Felton,Stephen Jackson,Theo Ratliff,Marc Gasol,Mike Conley,O.J. Mayo,Rudy Gay,Zach Randolph,1,6:22,MEM,shot,,,,,,,,,,Zach Randolph,,,,missed,,jump,13,19
Boris Diaw,Gerald Wallace,Raymond Felton,Stephen Jackson,Theo Ratliff,Marc Gasol,Mike Conley,O.J. Mayo,Rudy Gay,Zach Randolph,1,6:19,MEM,rebound,,,,,,,,,,Marc Gasol,,,,,,off,,
Boris Diaw,Gerald Wallace,Raymond Felton,Stephen Jackson,Theo Ratliff,Marc Gasol,Mike Conley,O.J. Mayo,Rudy Gay,Zach Randolph,1,6:19,MEM,shot,,,,,,,,,,Marc Gasol,,,,missed,,tip,25,6
Boris Diaw,Gerald Wallace,Raymond Felton,Stephen Jackson,Theo Ratliff,Marc Gasol,Mike Conley,O.J. Mayo,Rudy Gay,Zach Randolph,1,6:18,CHA,rebound,,,,,,,,,,Stephen Jackson,,,,,,def,,
Boris Diaw,Gerald Wallace,Raymond Felton,Stephen Jackson,Theo Ratliff,Marc Gasol,Mike Conley,O.J. Mayo,Rudy Gay,Zach Randolph,1,6:12,MEM,foul,,,,,,,,Boris Diaw,,Marc Gasol,,,,,,shooting,,
Boris Diaw,Gerald Wallace,Raymond Felton,Stephen Jackson,Theo Ratliff,Marc Gasol,Mike Conley,O.J. Mayo,Rudy Gay,Zach Randolph,1,6:12,CHA,free throw,,,,,,,1,,2,Boris Diaw,,,foul,missed,,,,
Boris Diaw,Gerald Wallace,Raymond Felton,Stephen Jackson,Theo Ratliff,Marc Gasol,Mike Conley,O.J. Mayo,Rudy Gay,Zach Randolph,1,6:12,CHA,rebound,,,,,,,,,,,,,,,,,,
Boris Diaw,Gerald Wallace,Raymond Felton,Stephen Jackson,Theo Ratliff,Marc Gasol,Mike Conley,O.J. Mayo,Rudy Gay,Zach Randolph,1,6:12,CHA,free throw,,,,,,,2,,2,Boris Diaw,,,foul,made,,,,
Boris Diaw,Gerald Wallace,Raymond Felton,Stephen Jackson,Theo Ratliff,Marc Gasol,Mike Conley,O.J. Mayo,Rudy Gay,Zach Randolph,1,6:01,MEM,shot,,,,,,,,,,O.J. Mayo,,,,missed,,3pt,13,30
Boris Diaw,Gerald Wallace,Raymond Felton,Stephen Jackson,Theo Ratliff,Marc Gasol,Mike Conley,O.J. Mayo,Rudy Gay,Zach Randolph,1,6:00,CHA,rebound,,,,,,,,,,Boris Diaw,,,,,,def,,
Boris Diaw,Gerald Wallace,Raymond Felton,Stephen Jackson,Theo Ratliff,Marc Gasol,Mike Conley,O.J. Mayo,Rudy Gay,Zach Randolph,1,5:51,CHA,shot,,,Marc Gasol,,,,,,,Raymond Felton,,,,missed,,layup,25,6
Boris Diaw,Gerald Wallace,Raymond Felton,Stephen Jackson,Theo Ratliff,Marc Gasol,Mike Conley,O.J. Mayo,Rudy Gay,Zach Randolph,1,5:50,MEM,rebound,,,,,,,,,,Mike Conley,,,,,,def,,
Boris Diaw,Gerald Wallace,Raymond Felton,Stephen Jackson,Theo Ratliff,Marc Gasol,Mike Conley,O.J. Mayo,Rudy Gay,Zach Randolph,1,5:36,MEM,shot,,,,,,,,,,Marc Gasol,,,,missed,,layup,25,6
Boris Diaw,Gerald Wallace,Raymond Felton,Stephen Jackson,Theo Ratliff,Marc Gasol,Mike Conley,O.J. Mayo,Rudy Gay,Zach Randolph,1,5:35,CHA,rebound,,,,,,,,,,Stephen Jackson,,,,,,def,,
Boris Diaw,Gerald Wallace,Raymond Felton,Stephen Jackson,Theo Ratliff,Marc Gasol,Mike Conley,O.J. Mayo,Rudy Gay,Zach Randolph,1,5:29,CHA,shot,Raymond Felton,,,,,,,,,Boris Diaw,2,,,made,,layup,25,6
Boris Diaw,Gerald Wallace,Raymond Felton,Stephen Jackson,Theo Ratliff,Marc Gasol,Mike Conley,O.J. Mayo,Rudy Gay,Zach Randolph,1,5:20,MEM,timeout,,,,,,,,,,,,,,,,regular,,
Boris Diaw,Gerald Wallace,Raymond Felton,Stephen Jackson,Theo Ratliff,Marc Gasol,Mike Conley,O.J. Mayo,Rudy Gay,Zach Randolph,1,5:15,MEM,turnover,,,,,,,,,,Zach Randolph,,,bad pass,,Boris Diaw,,,
Boris Diaw,Gerald Wallace,Raymond Felton,Stephen Jackson,Theo Ratliff,Marc Gasol,Mike Conley,O.J. Mayo,Rudy Gay,Zach Randolph,1,4:54,MEM,foul,,,,,,,,Gerald Wallace,,Marc Gasol,,,,,,shooting,,
Boris Diaw,Gerald Wallace,Raymond Felton,Stephen Jackson,Theo Ratliff,Marc Gasol,Mike Conley,O.J. Mayo,Rudy Gay,Zach Randolph,1,4:54,CHA,free throw,,,,,,,1,,2,Gerald Wallace,,,foul,made,,,,
Boris Diaw,Gerald Wallace,Raymond Felton,Stephen Jackson,Theo Ratliff,Marc Gasol,Marcus Williams,O.J. Mayo,Rudy Gay,Zach Randolph,1,4:54,MEM,sub,,,,Marcus Williams,,Mike Conley,,,,,,,,,,,,
Boris Diaw,Gerald Wallace,Raymond Felton,Stephen Jackson,Theo Ratliff,Hamed Haddadi,Marcus Williams,O.J. Mayo,Rudy Gay,Zach Randolph,1,4:54,MEM,sub,,,,Hamed Haddadi,,Marc Gasol,,,,,,,,,,,,
Boris Diaw,Gerald Wallace,Raymond Felton,Stephen Jackson,Theo Ratliff,Hamed Haddadi,Marcus Williams,O.J. Mayo,Rudy Gay,Zach Randolph,1,4:54,CHA,free throw,,,,,,,2,,2,Gerald Wallace,,,foul,made,,,,
Boris Diaw,Gerald Wallace,Raymond Felton,Stephen Jackson,Theo Ratliff,Hamed Haddadi,Marcus Williams,O.J. Mayo,Rudy Gay,Zach Randolph,1,4:43,MEM,shot,Hamed Haddadi,,,,,,,,,Zach Randolph,2,,,made,,layup,25,6
Boris Diaw,Gerald Wallace,Raymond Felton,Stephen Jackson,Theo Ratliff,Hamed Haddadi,Marcus Williams,O.J. Mayo,Rudy Gay,Zach Randolph,1,4:30,CHA,shot,,,,,,,,,,Gerald Wallace,2,,,made,,slam dunk,25,6
Boris Diaw,Gerald Wallace,Raymond Felton,Stephen Jackson,Theo Ratliff,Hamed Haddadi,Marcus Williams,O.J. Mayo,Rudy Gay,Zach Randolph,1,4:13,MEM,shot,,,,,,,,,,Zach Randolph,2,,,made,,finger roll layup,25,6
Boris Diaw,Gerald Wallace,Raymond Felton,Stephen Jackson,Theo Ratliff,Hamed Haddadi,Marcus Williams,O.J. Mayo,Rudy Gay,Zach Randolph,1,3:52,CHA,shot,,,,,,,,,,Stephen Jackson,,,,missed,,running layup,25,6
Boris Diaw,Gerald Wallace,Raymond Felton,Stephen Jackson,Theo Ratliff,Hamed Haddadi,Marcus Williams,O.J. Mayo,Rudy Gay,Zach Randolph,1,3:52,CHA,rebound,,,,,,,,,,,,,,,,,,
Boris Diaw,Gerald Wallace,Raymond Felton,Stephen Jackson,Theo Ratliff,Hamed Haddadi,Marcus Williams,O.J. Mayo,Rudy Gay,Zach Randolph,1,3:52,MEM,foul,,,,,,,,Theo Ratliff,,Zach Randolph,,,,,,loose ball,,
Boris Diaw,Gerald Wallace,Raymond Felton,Stephen Jackson,Theo Ratliff,Hamed Haddadi,Marcus Williams,O.J. Mayo,Rudy Gay,Zach Randolph,1,3:30,MEM,foul,,,,,,,,Raymond Felton,,Hamed Haddadi,,,,,,personal,,
Boris Diaw,Gerald Wallace,Raymond Felton,Stephen Jackson,Theo Ratliff,Hamed Haddadi,Marcus Williams,O.J. Mayo,Rudy Gay,Zach Randolph,1,3:30,CHA,timeout,,,,,,,,,,,,,,,,regular,,
Boris Diaw,Gerald Wallace,Raymond Felton,Stephen Jackson,Theo Ratliff,Hamed Haddadi,Marcus Williams,O.J. Mayo,Rudy Gay,Zach Randolph,1,3:26,MEM,foul,,,,,,,,Stephen Jackson,,Hamed Haddadi,,,,,,personal,,
Boris Diaw,Gerald Wallace,Raymond Felton,Stephen Jackson,Theo Ratliff,Hamed Haddadi,Marcus Williams,O.J. Mayo,Rudy Gay,Zach Randolph,1,3:26,CHA,free throw,,,,,,,1,,2,Stephen Jackson,,,foul,made,,,,
Boris Diaw,Gerald Wallace,Raymond Felton,Stephen Jackson,Theo Ratliff,Hamed Haddadi,Marcus Williams,O.J. Mayo,Rudy Gay,Zach Randolph,1,3:26,CHA,free throw,,,,,,,2,,2,Stephen Jackson,,,foul,made,,,,
Boris Diaw,Gerald Wallace,Raymond Felton,Stephen Jackson,Theo Ratliff,Hamed Haddadi,Marcus Williams,O.J. Mayo,Rudy Gay,Zach Randolph,1,3:06,MEM,shot,,,,,,,,,,Zach Randolph,,,,missed,,pullup jump,17,11
Boris Diaw,Gerald Wallace,Raymond Felton,Stephen Jackson,Theo Ratliff,Hamed Haddadi,Marcus Williams,O.J. Mayo,Rudy Gay,Zach Randolph,1,3:04,CHA,rebound,,,,,,,,,,Stephen Jackson,,,,,,def,,
Boris Diaw,Gerald Wallace,Raymond Felton,Stephen Jackson,Theo Ratliff,Hamed Haddadi,Marcus Williams,O.J. Mayo,Rudy Gay,Zach Randolph,1,2:56,CHA,shot,,,Rudy Gay,,,,,,,Gerald Wallace,,,,missed,,jump,21,11
Boris Diaw,Gerald Wallace,Raymond Felton,Stephen Jackson,Theo Ratliff,Hamed Haddadi,Marcus Williams,O.J. Mayo,Rudy Gay,Zach Randolph,1,2:54,MEM,rebound,,,,,,,,,,Hamed Haddadi,,,,,,def,,
Boris Diaw,Gerald Wallace,Raymond Felton,Stephen Jackson,Theo Ratliff,Hamed Haddadi,Marcus Williams,O.J. Mayo,Rudy Gay,Zach Randolph,1,2:49,MEM,shot,Marcus Williams,,,,,,,,,Rudy Gay,2,,,made,,pullup jump,10,18
Boris Diaw,Gerald Wallace,Raymond Felton,Stephen Jackson,Theo Ratliff,Hamed Haddadi,Marcus Williams,O.J. Mayo,Rudy Gay,Zach Randolph,1,2:27,CHA,shot,,,,,,,,,,Boris Diaw,2,,,made,,jump,25,12
Boris Diaw,Gerald Wallace,Raymond Felton,Stephen Jackson,Theo Ratliff,Hamed Haddadi,Marcus Williams,O.J. Mayo,Rudy Gay,Zach Randolph,1,2:14,MEM,shot,Marcus Williams,,,,,,,,,Zach Randolph,2,,,made,,layup,25,6
Boris Diaw,Gerald Wallace,Raymond Felton,Stephen Jackson,Theo Ratliff,Hamed Haddadi,Marcus Williams,O.J. Mayo,Rudy Gay,Zach Randolph,1,2:14,CHA,foul,,,,,,,,Zach Randolph,,Boris Diaw,,,,,,shooting,,
Boris Diaw,D.J. Augustin,Gerald Wallace,Stephen Jackson,Theo Ratliff,Hamed Haddadi,Marcus Williams,O.J. Mayo,Rudy Gay,Zach Randolph,1,2:14,CHA,sub,,,,D.J. Augustin,,Raymond Felton,,,,,,,,,,,,
Boris Diaw,D.J. Augustin,Gerald Wallace,Stephen Jackson,Theo Ratliff,Hamed Haddadi,Marcus Williams,O.J. Mayo,Rudy Gay,Zach Randolph,1,2:14,MEM,free throw,,,,,,,1,,1,Zach Randolph,,,foul,missed,,,,
Boris Diaw,D.J. Augustin,Gerald Wallace,Stephen Jackson,Theo Ratliff,Hamed Haddadi,Marcus Williams,O.J. Mayo,Rudy Gay,Zach Randolph,1,2:14,CHA,rebound,,,,,,,,,,Boris Diaw,,,,,,def,,
Boris Diaw,D.J. Augustin,Gerald Wallace,Stephen Jackson,Theo Ratliff,Hamed Haddadi,Marcus Williams,O.J. Mayo,Rudy Gay,Zach Randolph,1,2:03,CHA,turnover,,,,,,,,,,Stephen Jackson,,,traveling,,,,,
Boris Diaw,D.J. Augustin,Gerald Wallace,Stephen Jackson,Theo Ratliff,Hamed Haddadi,Marcus Williams,O.J. Mayo,Rudy Gay,Zach Randolph,1,1:51,MEM,shot,,,Theo Ratliff,,,,,,,O.J. Mayo,,,,missed,,layup,25,6
Boris Diaw,D.J. Augustin,Gerald Wallace,Stephen Jackson,Theo Ratliff,Hamed Haddadi,Marcus Williams,O.J. Mayo,Rudy Gay,Zach Randolph,1,1:48,MEM,rebound,,,,,,,,,,Zach Randolph,,,,,,off,,
Boris Diaw,D.J. Augustin,Gerald Wallace,Stephen Jackson,Theo Ratliff,Hamed Haddadi,Marcus Williams,O.J. Mayo,Rudy Gay,Zach Randolph,1,1:48,MEM,shot,,,,,,,,,,Zach Randolph,2,,,made,,layup,25,6
Boris Diaw,D.J. Augustin,Gerald Wallace,Stephen Jackson,Theo Ratliff,Hamed Haddadi,Marcus Williams,O.J. Mayo,Rudy Gay,Zach Randolph,1,1:33,CHA,shot,Boris Diaw,,,,,,,,,Stephen Jackson,2,,,made,,alley oop layup,25,6
Boris Diaw,D.J. Augustin,Gerald Wallace,Stephen Jackson,Theo Ratliff,Hamed Haddadi,Marcus Williams,O.J. Mayo,Rudy Gay,Zach Randolph,1,1:25,MEM,shot,O.J. Mayo,,,,,,,,,Marcus Williams,3,,,made,,3pt,14,29
Boris Diaw,D.J. Augustin,Gerald Wallace,Stephen Jackson,Theo Ratliff,Hamed Haddadi,Marcus Williams,O.J. Mayo,Rudy Gay,Zach Randolph,1,1:05,CHA,turnover,,,,,,,,,,D.J. Augustin,,,bad pass,,O.J. Mayo,,,
Boris Diaw,D.J. Augustin,Gerald Wallace,Stephen Jackson,Theo Ratliff,Hamed Haddadi,Marcus Williams,O.J. Mayo,Rudy Gay,Zach Randolph,1,0:59,MEM,shot,O.J. Mayo,,,,,,,,,Marcus Williams,3,,,made,,3pt,48,13
Boris Diaw,D.J. Augustin,Gerald Wallace,Stephen Jackson,Theo Ratliff,Hamed Haddadi,Marcus Williams,O.J. Mayo,Rudy Gay,Zach Randolph,1,0:42,MEM,foul,,,,,,,,Stephen Jackson,,Hamed Haddadi,,,,,,shooting,,
Boris Diaw,D.J. Augustin,Gerald Wallace,Stephen Jackson,Theo Ratliff,Hamed Haddadi,Marcus Williams,O.J. Mayo,Rudy Gay,Zach Randolph,1,0:42,CHA,free throw,,,,,,,1,,2,Stephen Jackson,,,foul,missed,,,,
Boris Diaw,D.J. Augustin,Gerald Wallace,Stephen Jackson,Theo Ratliff,Hamed Haddadi,Marcus Williams,O.J. Mayo,Rudy Gay,Zach Randolph,1,0:42,CHA,rebound,,,,,,,,,,,,,,,,,,
Boris Diaw,D.J. Augustin,Gerald Wallace,Stephen Jackson,Tyrus Thomas,Hamed Haddadi,Marcus Williams,O.J. Mayo,Rudy Gay,Zach Randolph,1,0:42,CHA,sub,,,,Tyrus Thomas,,Theo Ratliff,,,,,,,,,,,,
Boris Diaw,D.J. Augustin,Gerald Wallace,Stephen Jackson,Tyrus Thomas,Darrell Arthur,Marcus Williams,O.J. Mayo,Rudy Gay,Zach Randolph,1,0:42,MEM,sub,,,,Darrell Arthur,,Hamed Haddadi,,,,,,,,,,,,
Boris Diaw,D.J. Augustin,Gerald Wallace,Stephen Jackson,Tyrus Thomas,Darrell Arthur,Marcus Williams,O.J. Mayo,Rudy Gay,Zach Randolph,1,0:42,CHA,free throw,,,,,,,2,,2,Stephen Jackson,,,foul,made,,,,
Boris Diaw,D.J. Augustin,Gerald Wallace,Stephen Jackson,Tyrus Thomas,Darrell Arthur,Marcus Williams,O.J. Mayo,Rudy Gay,Zach Randolph,1,0:30,MEM,shot,,,,,,,,,,Rudy Gay,2,,,made,,pullup jump,20,18
Boris Diaw,D.J. Augustin,Gerald Wallace,Stephen Jackson,Tyrus Thomas,Darrell Arthur,Marcus Williams,O.J. Mayo,Rudy Gay,Zach Randolph,1,0:23,CHA,shot,,,,,,,,,,D.J. Augustin,,,,missed,,running layup,25,6
Boris Diaw,D.J. Augustin,Gerald Wallace,Stephen Jackson,Tyrus Thomas,Darrell Arthur,Marcus Williams,O.J. Mayo,Rudy Gay,Zach Randolph,1,0:20,CHA,rebound,,,,,,,,,,Gerald Wallace,,,,,,off,,
Boris Diaw,D.J. Augustin,Gerald Wallace,Stephen Jackson,Tyrus Thomas,Darrell Arthur,Marcus Williams,O.J. Mayo,Rudy Gay,Zach Randolph,1,0:02,CHA,shot,,,,,,,,,,Stephen Jackson,,,,missed,,3pt,14,30
Boris Diaw,D.J. Augustin,Gerald Wallace,Stephen Jackson,Tyrus Thomas,Darrell Arthur,Marcus Williams,O.J. Mayo,Rudy Gay,Zach Randolph,1,0:01,MEM,rebound,,,,,,,,,,O.J. Mayo,,,,,,def,,
Boris Diaw,D.J. Augustin,Gerald Wallace,Stephen Jackson,Tyrus Thomas,Darrell Arthur,Marcus Williams,O.J. Mayo,Rudy Gay,Zach Randolph,2,11:47,MEM,shot,,,Tyrus Thomas,,,,,,,Zach Randolph,,,,missed,,layup,25,6
Boris Diaw,D.J. Augustin,Gerald Wallace,Stephen Jackson,Tyrus Thomas,Darrell Arthur,Marcus Williams,O.J. Mayo,Rudy Gay,Zach Randolph,2,11:45,CHA,rebound,,,,,,,,,,Gerald Wallace,,,,,,def,,
Boris Diaw,D.J. Augustin,Gerald Wallace,Stephen Jackson,Tyrus Thomas,Darrell Arthur,Marcus Williams,O.J. Mayo,Rudy Gay,Zach Randolph,2,11:27,CHA,shot,,,,,,,,,,Tyrus Thomas,2,,,made,,turnaround jump,18,9
Boris Diaw,D.J. Augustin,Gerald Wallace,Stephen Jackson,Tyrus Thomas,Darrell Arthur,Marcus Williams,O.J. Mayo,Rudy Gay,Zach Randolph,2,11:18,CHA,foul,,,,,,,,Darrell Arthur,,Tyrus Thomas,,,,,,shooting,,
Boris Diaw,D.J. Augustin,Gerald Wallace,Stephen Jackson,Tyrus Thomas,Darrell Arthur,Marcus Williams,O.J. Mayo,Rudy Gay,Zach Randolph,2,11:18,MEM,free throw,,,,,,,1,,2,Darrell Arthur,,,foul,missed,,,,
Boris Diaw,D.J. Augustin,Gerald Wallace,Stephen Jackson,Tyrus Thomas,Darrell Arthur,Marcus Williams,O.J. Mayo,Rudy Gay,Zach Randolph,2,11:18,MEM,rebound,,,,,,,,,,,,,,,,,,
Boris Diaw,D.J. Augustin,Gerald Wallace,Stephen Jackson,Tyrus Thomas,Darrell Arthur,Marcus Williams,Rudy Gay,Sam Young,Zach Randolph,2,11:18,MEM,sub,,,,Sam Young,,O.J. Mayo,,,,,,,,,,,,
Boris Diaw,D.J. Augustin,Gerald Wallace,Stephen Jackson,Tyrus Thomas,Darrell Arthur,Marcus Williams,Rudy Gay,Sam Young,Zach Randolph,2,11:18,MEM,free throw,,,,,,,2,,2,Darrell Arthur,,,foul,missed,,,,
Boris Diaw,D.J. Augustin,Gerald Wallace,Stephen Jackson,Tyrus Thomas,Darrell Arthur,Marcus Williams,Rudy Gay,Sam Young,Zach Randolph,2,11:17,CHA,rebound,,,,,,,,,,Gerald Wallace,,,,,,def,,
Boris Diaw,D.J. Augustin,Gerald Wallace,Stephen Jackson,Tyrus Thomas,Darrell Arthur,Marcus Williams,Rudy Gay,Sam Young,Zach Randolph,2,11:16,CHA,turnover,,,,,,,,,,Gerald Wallace,,,lost ball,,Darrell Arthur,,,
Boris Diaw,D.J. Augustin,Gerald Wallace,Stephen Jackson,Tyrus Thomas,Darrell Arthur,Marcus Williams,Rudy Gay,Sam Young,Zach Randolph,2,11:07,MEM,shot,,,,,,,,,,Sam Young,,,,missed,,3pt,37,29
Boris Diaw,D.J. Augustin,Gerald Wallace,Stephen Jackson,Tyrus Thomas,Darrell Arthur,Marcus Williams,Rudy Gay,Sam Young,Zach Randolph,2,11:05,CHA,rebound,,,,,,,,,,Boris Diaw,,,,,,def,,
Boris Diaw,D.J. Augustin,Gerald Wallace,Stephen Jackson,Tyrus Thomas,Darrell Arthur,Marcus Williams,Rudy Gay,Sam Young,Zach Randolph,2,11:03,CHA,turnover,,,,,,,,,,D.J. Augustin,,,lost ball,,Zach Randolph,,,
Boris Diaw,D.J. Augustin,Gerald Wallace,Stephen Jackson,Tyrus Thomas,Darrell Arthur,Marcus Williams,Rudy Gay,Sam Young,Zach Randolph,2,10:39,MEM,shot,,,,,,,,,,Rudy Gay,2,,,made,,running jump,30,14
Boris Diaw,D.J. Augustin,Gerald Wallace,Stephen Jackson,Tyrus Thomas,Darrell Arthur,Marcus Williams,Rudy Gay,Sam Young,Zach Randolph,2,10:15,CHA,shot,,,,,,,,,,Stephen Jackson,2,,,made,,layup,25,6
Boris Diaw,D.J. Augustin,Gerald Wallace,Stephen Jackson,Tyrus Thomas,Darrell Arthur,Marcus Williams,Rudy Gay,Sam Young,Zach Randolph,2,10:05,MEM,shot,,,,,,,,,,Sam Young,2,,,made,,layup,25,6
Boris Diaw,D.J. Augustin,Gerald Wallace,Stephen Jackson,Tyrus Thomas,Darrell Arthur,Marcus Williams,Rudy Gay,Sam Young,Zach Randolph,2,9:47,CHA,shot,,,,,,,,,,Tyrus Thomas,2,,,made,,fade away jumper,14,8
Boris Diaw,D.J. Augustin,Gerald Wallace,Stephen Jackson,Tyrus Thomas,Darrell Arthur,Marcus Williams,Rudy Gay,Sam Young,Zach Randolph,2,9:37,MEM,shot,Darrell Arthur,,,,,,,,,Rudy Gay,3,,,made,,3pt,43,24
Boris Diaw,D.J. Augustin,Gerald Wallace,Stephen Jackson,Tyrus Thomas,Darrell Arthur,Marcus Williams,Rudy Gay,Sam Young,Zach Randolph,2,9:21,CHA,shot,,,Darrell Arthur,,,,,,,Stephen Jackson,,,,missed,,layup,25,6
Boris Diaw,D.J. Augustin,Gerald Wallace,Stephen Jackson,Tyrus Thomas,Darrell Arthur,Marcus Williams,Rudy Gay,Sam Young,Zach Randolph,2,9:21,CHA,rebound,,,,,,,,,,,,,,,,,,
Boris Diaw,D.J. Augustin,Gerald Wallace,Stephen Jackson,Tyrus Thomas,Darrell Arthur,Marc Gasol,Marcus Williams,Rudy Gay,Sam Young,2,9:21,MEM,sub,,,,Marc Gasol,,Zach Randolph,,,,,,,,,,,,
D.J. Augustin,Gerald Wallace,Stephen Jackson,Theo Ratliff,Tyrus Thomas,Darrell Arthur,Marc Gasol,Marcus Williams,Rudy Gay,Sam Young,2,9:21,CHA,sub,,,,Theo Ratliff,,Boris Diaw,,,,,,,,,,,,
D.J. Augustin,Stephen Graham,Stephen Jackson,Theo Ratliff,Tyrus Thomas,Darrell Arthur,Marc Gasol,Marcus Williams,Rudy Gay,Sam Young,2,9:21,CHA,sub,,,,Stephen Graham,,Gerald Wallace,,,,,,,,,,,,
D.J. Augustin,Stephen Graham,Stephen Jackson,Theo Ratliff,Tyrus Thomas,Darrell Arthur,Marc Gasol,Marcus Williams,Rudy Gay,Sam Young,2,9:11,CHA,shot,,,,,,,,,,Theo Ratliff,,,,missed,,jump,29,14