a1,a2,a3,a4,a5,h1,h2,h3,h4,h5,period,time,team,etype,assist,away,block,entered,home,left,num,opponent,outof,player,points,possession,reason,result,steal,type,x,y
Al Jefferson,Corey Brewer,Jonny Flynn,Ryan Gomes,Ryan Hollins,Carlos Arroyo,Daequan Cook,Jermaine O'Neal,Michael Beasley,Quentin Richardson,1,12:00,OFF,jump ball,,Ryan Hollins,,,Jermaine O'Neal,,,,,,,Al Jefferson,,,,,,
Al Jefferson,Corey Brewer,Jonny Flynn,Ryan Gomes,Ryan Hollins,Carlos Arroyo,Daequan Cook,Jermaine O'Neal,Michael Beasley,Quentin Richardson,1,11:36,MIN,shot,,,,,,,,,,Al Jefferson,,,,missed,,turnaround hook,41,17
Al Jefferson,Corey Brewer,Jonny Flynn,Ryan Gomes,Ryan Hollins,Carlos Arroyo,Daequan Cook,Jermaine O'Neal,Michael Beasley,Quentin Richardson,1,11:35,MIA,rebound,,,,,,,,,,Michael Beasley,,,,,,def,,
Al Jefferson,Corey Brewer,Jonny Flynn,Ryan Gomes,Ryan Hollins,Carlos Arroyo,Daequan Cook,Jermaine O'Neal,Michael Beasley,Quentin Richardson,1,11:16,MIA,shot,,,,,,,,,,Quentin Richardson,,,,missed,,3pt,33,31
Al Jefferson,Corey Brewer,Jonny Flynn,Ryan Gomes,Ryan Hollins,Carlos Arroyo,Daequan Cook,Jermaine O'Neal,Michael Beasley,Quentin Richardson,1,11:15,MIN,rebound,,,,,,,,,,Ryan Hollins,,,,,,def,,
Al Jefferson,Corey Brewer,Jonny Flynn,Ryan Gomes,Ryan Hollins,Carlos Arroyo,Daequan Cook,Jermaine O'Neal,Michael Beasley,Quentin Richardson,1,11:04,MIN,shot,,,Michael Beasley,,,,,,,Corey Brewer,,,,missed,,layup,25,6
Al Jefferson,Corey Brewer,Jonny Flynn,Ryan Gomes,Ryan Hollins,Carlos Arroyo,Daequan Cook,Jermaine O'Neal,Michael Beasley,Quentin Richardson,1,11:02,MIA,rebound,,,,,,,,,,Michael Beasley,,,,,,def,,
Al Jefferson,Corey Brewer,Jonny Flynn,Ryan Gomes,Ryan Hollins,Carlos Arroyo,Daequan Cook,Jermaine O'Neal,Michael Beasley,Quentin Richardson,1,10:45,MIA,shot,,,,,,,,,,Michael Beasley,,,,missed,,jump,17,23
Al Jefferson,Corey Brewer,Jonny Flynn,Ryan Gomes,Ryan Hollins,Carlos Arroyo,Daequan Cook,Jermaine O'Neal,Michael Beasley,Quentin Richardson,1,10:44,MIN,rebound,,,,,,,,,,,,,,,,,,
Al Jefferson,Corey Brewer,Jonny Flynn,Ryan Gomes,Ryan Hollins,Carlos Arroyo,Daequan Cook,Jermaine O'Neal,Michael Beasley,Quentin Richardson,1,10:24,MIN,shot,,,,,,,,,,Corey Brewer,,,,missed,,3pt,40,26
Al Jefferson,Corey Brewer,Jonny Flynn,Ryan Gomes,Ryan Hollins,Carlos Arroyo,Daequan Cook,Jermaine O'Neal,Michael Beasley,Quentin Richardson,1,10:23,MIA,rebound,,,,,,,,,,Quentin Richardson,,,,,,def,,
Al Jefferson,Corey Brewer,Jonny Flynn,Ryan Gomes,Ryan Hollins,Carlos Arroyo,Daequan Cook,Jermaine O'Neal,Michael Beasley,Quentin Richardson,1,10:13,MIA,shot,,,,,,,,,,Jermaine O'Neal,2,,,made,,jump,36,19
Al Jefferson,Corey Brewer,Jonny Flynn,Ryan Gomes,Ryan Hollins,Carlos Arroyo,Daequan Cook,Jermaine O'Neal,Michael Beasley,Quentin Richardson,1,9:50,MIN,shot,,,,,,,,,,Ryan Hollins,2,,,made,,jump,26,13
Al Jefferson,Corey Brewer,Jonny Flynn,Ryan Gomes,Ryan Hollins,Carlos Arroyo,Daequan Cook,Jermaine O'Neal,Michael Beasley,Quentin Richardson,1,9:40,MIA,turnover,,,,,,,,,,Carlos Arroyo,,,out of bounds lost ball turnover,,,,,
Al Jefferson,Corey Brewer,Jonny Flynn,Ryan Gomes,Ryan Hollins,Carlos Arroyo,Daequan Cook,Jermaine O'Neal,Michael Beasley,Quentin Richardson,1,9:24,MIN,turnover,,,,,,,,,,Jonny Flynn,,,bad pass,,Michael Beasley,,,
Al Jefferson,Corey Brewer,Jonny Flynn,Ryan Gomes,Ryan Hollins,Carlos Arroyo,Daequan Cook,Jermaine O'Neal,Michael Beasley,Quentin Richardson,1,9:14,MIA,turnover,,,,,,,,,,Jermaine O'Neal,,,lost ball,,Ryan Gomes,,,
Al Jefferson,Corey Brewer,Jonny Flynn,Ryan Gomes,Ryan Hollins,Carlos Arroyo,Daequan Cook,Jermaine O'Neal,Michael Beasley,Quentin Richardson,1,9:06,MIA,foul,,,,,,,,Ryan Hollins,,Michael Beasley,,,,,,shooting,,
Al Jefferson,Corey Brewer,Jonny Flynn,Ryan Gomes,Ryan Hollins,Carlos Arroyo,Daequan Cook,Jermaine O'Neal,Michael Beasley,Quentin Richardson,1,9:06,MIN,free throw,,,,,,,1,,2,Ryan Hollins,,,foul,made,,,,
Al Jefferson,Corey Brewer,Jonny Flynn,Ryan Gomes,Ryan Hollins,Carlos Arroyo,Daequan Cook,Jermaine O'Neal,Michael Beasley,Quentin Richardson,1,9:06,MIN,free throw,,,,,,,2,,2,Ryan Hollins,,,foul,made,,,,
Al Jefferson,Corey Brewer,Jonny Flynn,Ryan Gomes,Ryan Hollins,Carlos Arroyo,Daequan Cook,Jermaine O'Neal,Michael Beasley,Quentin Richardson,1,8:57,MIN,foul,,,,,,,,,,Ryan Hollins,,,,,,defense 3 second,,
Al Jefferson,Corey Brewer,Jonny Flynn,Ryan Gomes,Ryan Hollins,Carlos Arroyo,Daequan Cook,Jermaine O'Neal,Michael Beasley,Quentin Richardson,1,8:57,MIA,free throw,,,,,,,1,,1,Michael Beasley,,,technical,made,,,,
Al Jefferson,Corey Brewer,Jonny Flynn,Ryan Gomes,Ryan Hollins,Carlos Arroyo,Daequan Cook,Jermaine O'Neal,Michael Beasley,Quentin Richardson,1,8:45,MIA,shot,,,,,,,,,,Daequan Cook,,,,missed,,3pt,40,26
Al Jefferson,Corey Brewer,Jonny Flynn,Ryan Gomes,Ryan Hollins,Carlos Arroyo,Daequan Cook,Jermaine O'Neal,Michael Beasley,Quentin Richardson,1,8:44,MIN,rebound,,,,,,,,,,Al Jefferson,,,,,,def,,
Al Jefferson,Corey Brewer,Jonny Flynn,Ryan Gomes,Ryan Hollins,Carlos Arroyo,Daequan Cook,Jermaine O'Neal,Michael Beasley,Quentin Richardson,1,8:38,MIN,shot,,,,,,,,,,Jonny Flynn,3,,,made,,3pt,42,30
Al Jefferson,Corey Brewer,Jonny Flynn,Ryan Gomes,Ryan Hollins,Carlos Arroyo,Daequan Cook,Jermaine O'Neal,Michael Beasley,Quentin Richardson,1,8:17,MIA,shot,,,,,,,,,,Jermaine O'Neal,2,,,made,,running hook,26,12
Al Jefferson,Corey Brewer,Jonny Flynn,Ryan Gomes,Ryan Hollins,Carlos Arroyo,Daequan Cook,Jermaine O'Neal,Michael Beasley,Quentin Richardson,1,8:09,MIN,shot,,,,,,,,,,Jonny Flynn,,,,missed,,3pt,18,30
Al Jefferson,Corey Brewer,Jonny Flynn,Ryan Gomes,Ryan Hollins,Carlos Arroyo,Daequan Cook,Jermaine O'Neal,Michael Beasley,Quentin Richardson,1,8:07,MIA,rebound,,,,,,,,,,Michael Beasley,,,,,,def,,
Al Jefferson,Corey Brewer,Jonny Flynn,Ryan Gomes,Ryan Hollins,Carlos Arroyo,Daequan Cook,Jermaine O'Neal,Michael Beasley,Quentin Richardson,1,7:51,MIA,shot,,,,,,,,,,Carlos Arroyo,,,,missed,,3pt,1,12
Al Jefferson,Corey Brewer,Jonny Flynn,Ryan Gomes,Ryan Hollins,Carlos Arroyo,Daequan Cook,Jermaine O'Neal,Michael Beasley,Quentin Richardson,1,7:50,MIN,rebound,,,,,,,,,,Ryan Gomes,,,,,,def,,
Al Jefferson,Corey Brewer,Jonny Flynn,Ryan Gomes,Ryan Hollins,Carlos Arroyo,Daequan Cook,Jermaine O'Neal,Michael Beasley,Quentin Richardson,1,7:32,MIN,shot,Corey Brewer,,,,,,,,,Al Jefferson,2,,,made,,layup,25,6
Al Jefferson,Corey Brewer,Jonny Flynn,Ryan Gomes,Ryan Hollins,Carlos Arroyo,Daequan Cook,Jermaine O'Neal,Michael Beasley,Quentin Richardson,1,7:14,MIA,shot,,,,,,,,,,Michael Beasley,,,,missed,,jump,38,23
Al Jefferson,Corey Brewer,Jonny Flynn,Ryan Gomes,Ryan Hollins,Carlos Arroyo,Daequan Cook,Jermaine O'Neal,Michael Beasley,Quentin Richardson,1,7:13,MIN,rebound,,,,,,,,,,Jonny Flynn,,,,,,def,,
Al Jefferson,Corey Brewer,Jonny Flynn,Ryan Gomes,Ryan Hollins,Carlos Arroyo,Daequan Cook,Jermaine O'Neal,Michael Beasley,Quentin Richardson,1,7:07,MIN,shot,,,,,,,,,,Jonny Flynn,2,,,made,,driving layup,25,6
Al Jefferson,Corey Brewer,Jonny Flynn,Ryan Gomes,Ryan Hollins,Carlos Arroyo,Daequan Cook,Jermaine O'Neal,Michael Beasley,Quentin Richardson,1,7:00,MIA,timeout,,,,,,,,,,,,,,,,regular,,
Al Jefferson,Corey Brewer,Jonny Flynn,Kevin Love,Ryan Gomes,Carlos Arroyo,Daequan Cook,Jermaine O'Neal,Michael Beasley,Quentin Richardson,1,7:00,MIN,sub,,,,Kevin Love,,Ryan Hollins,,,,,,,,,,,,
Al Jefferson,Corey Brewer,Jonny Flynn,Kevin Love,Ryan Gomes,Carlos Arroyo,Daequan Cook,Jermaine O'Neal,Michael Beasley,Quentin Richardson,1,6:47,MIA,shot,,,,,,,,,,Daequan Cook,,,,missed,,jump,36,24
Al Jefferson,Corey Brewer,Jonny Flynn,Kevin Love,Ryan Gomes,Carlos Arroyo,Daequan Cook,Jermaine O'Neal,Michael Beasley,Quentin Richardson,1,6:46,MIN,rebound,,,,,,,,,,Ryan Gomes,,,,,,def,,
Al Jefferson,Corey Brewer,Jonny Flynn,Kevin Love,Ryan Gomes,Carlos Arroyo,Daequan Cook,Jermaine O'Neal,Michael Beasley,Quentin Richardson,1,6:24,MIN,shot,,,,,,,,,,Al Jefferson,,,,missed,,jump,17,23
Al Jefferson,Corey Brewer,Jonny Flynn,Kevin Love,Ryan Gomes,Carlos Arroyo,Daequan Cook,Jermaine O'Neal,Michael Beasley,Quentin Richardson,1,6:22,MIA,rebound,,,,,,,,,,Quentin Richardson,,,,,,def,,
Al Jefferson,Corey Brewer,Jonny Flynn,Kevin Love,Ryan Gomes,Carlos Arroyo,Daequan Cook,Jermaine O'Neal,Michael Beasley,Quentin Richardson,1,6:15,MIA,shot,Carlos Arroyo,,,,,,,,,Daequan Cook,2,,,made,,jump,41,8
Al Jefferson,Corey Brewer,Jonny Flynn,Kevin Love,Ryan Gomes,Carlos Arroyo,Daequan Cook,Jermaine O'Neal,Michael Beasley,Quentin Richardson,1,6:07,MIA,foul,,,,,,,,Kevin Love,,Michael Beasley,,,,,,shooting,,
Al Jefferson,Corey Brewer,Jonny Flynn,Kevin Love,Ryan Gomes,Carlos Arroyo,Daequan Cook,Jermaine O'Neal,Michael Beasley,Quentin Richardson,1,6:07,MIN,free throw,,,,,,,1,,2,Kevin Love,,,foul,made,,,,
Al Jefferson,Corey Brewer,Jonny Flynn,Kevin Love,Ryan Gomes,Carlos Arroyo,Daequan Cook,Jermaine O'Neal,Quentin Richardson,Udonis Haslem,1,6:07,MIA,sub,,,,Udonis Haslem,,Michael Beasley,,,,,,,,,,,,
Al Jefferson,Corey Brewer,Jonny Flynn,Kevin Love,Ryan Gomes,Carlos Arroyo,Daequan Cook,Jermaine O'Neal,Quentin Richardson,Udonis Haslem,1,6:07,MIN,free throw,,,,,,,2,,2,Kevin Love,,,foul,made,,,,
Al Jefferson,Corey Brewer,Jonny Flynn,Kevin Love,Ryan Gomes,Carlos Arroyo,Daequan Cook,Jermaine O'Neal,Quentin Richardson,Udonis Haslem,1,5:52,MIA,shot,Daequan Cook,,,,,,,,,Udonis Haslem,2,,,made,,jump,42,8
Al Jefferson,Corey Brewer,Jonny Flynn,Kevin Love,Ryan Gomes,Carlos Arroyo,Daequan Cook,Jermaine O'Neal,Quentin Richardson,Udonis Haslem,1,5:32,MIN,shot,,,,,,,,,,Kevin Love,,,,missed,,jump,12,7
Al Jefferson,Corey Brewer,Jonny Flynn,Kevin Love,Ryan Gomes,Carlos Arroyo,Daequan Cook,Jermaine O'Neal,Quentin Richardson,Udonis Haslem,1,5:31,MIA,rebound,,,,,,,,,,Quentin Richardson,,,,,,def,,
Al Jefferson,Corey Brewer,Jonny Flynn,Kevin Love,Ryan Gomes,Carlos Arroyo,Daequan Cook,Jermaine O'Neal,Quentin Richardson,Udonis Haslem,1,5:23,MIA,shot,,,,,,,,,,Carlos Arroyo,,,,missed,,jump,33,25
Al Jefferson,Corey Brewer,Jonny Flynn,Kevin Love,Ryan Gomes,Carlos Arroyo,Daequan Cook,Jermaine O'Neal,Quentin Richardson,Udonis Haslem,1,5:22,MIN,rebound,,,,,,,,,,Kevin Love,,,,,,def,,
Al Jefferson,Corey Brewer,Jonny Flynn,Kevin Love,Ryan Gomes,Carlos Arroyo,Daequan Cook,Jermaine O'Neal,Quentin Richardson,Udonis Haslem,1,5:15,MIN,shot,,,,,,,,,,Jonny Flynn,2,,,made,,driving layup,25,6
Al Jefferson,Corey Brewer,Jonny Flynn,Kevin Love,Ryan Gomes,Carlos Arroyo,Daequan Cook,Jermaine O'Neal,Quentin Richardson,Udonis Haslem,1,4:55,MIA,shot,,,,,,,,,,Daequan Cook,,,,missed,,jump,13,21
Al Jefferson,Corey Brewer,Jonny Flynn,Kevin Love,Ryan Gomes,Carlos Arroyo,Daequan Cook,Jermaine O'Neal,Quentin Richardson,Udonis Haslem,1,4:51,MIN,rebound,,,,,,,,,,Al Jefferson,,,,,,def,,
Al Jefferson,Corey Brewer,Jonny Flynn,Kevin Love,Ryan Gomes,Carlos Arroyo,Daequan Cook,Jermaine O'Neal,Quentin Richardson,Udonis Haslem,1,4:45,MIA,foul,,,,,,,,Ryan Gomes,,Carlos Arroyo,,,,,,personal,,
Al Jefferson,Jonny Flynn,Kevin Love,Ryan Gomes,Wayne Ellington,Carlos Arroyo,Daequan Cook,Jermaine O'Neal,Quentin Richardson,Udonis Haslem,1,4:45,MIN,sub,,,,Wayne Ellington,,Corey Brewer,,,,,,,,,,,,
Al Jefferson,Jonny Flynn,Kevin Love,Ryan Gomes,Wayne Ellington,Carlos Arroyo,Daequan Cook,Joel Anthony,Quentin Richardson,Udonis Haslem,1,4:45,MIA,sub,,,,Joel Anthony,,Jermaine O'Neal,,,,,,,,,,,,
Darko Milicic,Jonny Flynn,Kevin Love,Ryan Gomes,Wayne Ellington,Carlos Arroyo,Daequan Cook,Joel Anthony,Quentin Richardson,Udonis Haslem,1,4:45,MIN,sub,,,,Darko Milicic,,Al Jefferson,,,,,,,,,,,,
Darko Milicic,Jonny Flynn,Kevin Love,Ryan Gomes,Wayne Ellington,Carlos Arroyo,Daequan Cook,Joel Anthony,Quentin Richardson,Udonis Haslem,1,4:30,MIN,shot,Wayne Ellington,,,,,,,,,Ryan Gomes,3,,,made,,3pt,49,8
Darko Milicic,Jonny Flynn,Kevin Love,Ryan Gomes,Wayne Ellington,Carlos Arroyo,Daequan Cook,Joel Anthony,Quentin Richardson,Udonis Haslem,1,4:18,MIN,foul,,,,,,,,Carlos Arroyo,,Darko Milicic,,,,,,personal,,
Darko Milicic,Jonny Flynn,Kevin Love,Ryan Gomes,Wayne Ellington,Carlos Arroyo,Daequan Cook,Joel Anthony,Quentin Richardson,Udonis Haslem,1,4:10,MIN,foul,,,,,,,,Carlos Arroyo,,Kevin Love,,,,,,shooting,,
Darko Milicic,Jonny Flynn,Kevin Love,Ryan Gomes,Wayne Ellington,Carlos Arroyo,Daequan Cook,Joel Anthony,Quentin Richardson,Udonis Haslem,1,4:10,MIA,free throw,,,,,,,1,,2,Carlos Arroyo,,,foul,made,,,,
Darko Milicic,Jonny Flynn,Kevin Love,Ryan Gomes,Wayne Ellington,Carlos Arroyo,Daequan Cook,Joel Anthony,Quentin Richardson,Udonis Haslem,1,4:10,MIA,free throw,,,,,,,2,,2,Carlos Arroyo,,,foul,missed,,,,
Darko Milicic,Jonny Flynn,Kevin Love,Ryan Gomes,Wayne Ellington,Carlos Arroyo,Daequan Cook,Joel Anthony,Quentin Richardson,Udonis Haslem,1,4:08,MIN,rebound,,,,,,,,,,Darko Milicic,,,,,,def,,
Darko Milicic,Jonny Flynn,Kevin Love,Ryan Gomes,Wayne Ellington,Carlos Arroyo,Daequan Cook,Joel Anthony,Quentin Richardson,Udonis Haslem,1,3:48,MIN,shot,,,,,,,,,,Jonny Flynn,,,,missed,,running jump,17,15
Darko Milicic,Jonny Flynn,Kevin Love,Ryan Gomes,Wayne Ellington,Carlos Arroyo,Daequan Cook,Joel Anthony,Quentin Richardson,Udonis Haslem,1,3:45,MIA,rebound,,,,,,,,,,Udonis Haslem,,,,,,def,,
Darko Milicic,Jonny Flynn,Kevin Love,Ryan Gomes,Wayne Ellington,Carlos Arroyo,Daequan Cook,Joel Anthony,Quentin Richardson,Udonis Haslem,1,3:36,MIA,shot,,,,,,,,,,Udonis Haslem,,,,missed,,jump,32,22
Darko Milicic,Jonny Flynn,Kevin Love,Ryan Gomes,Wayne Ellington,Carlos Arroyo,Daequan Cook,Joel Anthony,Quentin Richardson,Udonis Haslem,1,3:35,MIN,rebound,,,,,,,,,,Kevin Love,,,,,,def,,
Darko Milicic,Jonny Flynn,Kevin Love,Ryan Gomes,Wayne Ellington,Carlos Arroyo,Daequan Cook,Joel Anthony,Quentin Richardson,Udonis Haslem,1,3:28,MIN,shot,Jonny Flynn,,,,,,,,,Wayne Ellington,2,,,made,,jump,11,8
Darko Milicic,Jonny Flynn,Kevin Love,Ryan Gomes,Wayne Ellington,Carlos Arroyo,Daequan Cook,Joel Anthony,Quentin Richardson,Udonis Haslem,1,3:15,MIA,turnover,,,,,,,,,,Carlos Arroyo,,,bad pass,,,,,
Darko Milicic,Jonny Flynn,Kevin Love,Ryan Gomes,Wayne Ellington,Carlos Arroyo,Daequan Cook,Joel Anthony,Quentin Richardson,Udonis Haslem,1,2:53,MIN,turnover,,,,,,,,,,Ryan Gomes,,,lost ball,,Quentin Richardson,,,
Darko Milicic,Jonny Flynn,Kevin Love,Ryan Gomes,Wayne Ellington,Carlos Arroyo,Daequan Cook,Joel Anthony,Quentin Richardson,Udonis Haslem,1,2:48,MIA,turnover,,,,,,,,,,Quentin Richardson,,,bad pass,,Wayne Ellington,,,
Darko Milicic,Jonny Flynn,Kevin Love,Ryan Gomes,Wayne Ellington,Carlos Arroyo,Daequan Cook,Joel Anthony,Quentin Richardson,Udonis Haslem,1,2:44,MIN,turnover,,,,,,,,,,Wayne Ellington,,,bad pass,,Joel Anthony,,,
Darko Milicic,Jonny Flynn,Kevin Love,Ryan Gomes,Wayne Ellington,Carlos Arroyo,Daequan Cook,Joel Anthony,Quentin Richardson,Udonis Haslem,1,2:40,MIA,shot,Carlos Arroyo,,,,,,,,,Daequan Cook,2,,,made,,layup,25,6
Darko Milicic,Jonny Flynn,Kevin Love,Ryan Gomes,Wayne Ellington,Carlos Arroyo,Daequan Cook,Joel Anthony,Quentin Richardson,Udonis Haslem,1,2:34,MIN,timeout,,,,,,,,,,,,,,,,regular,,
Darko Milicic,Jonny Flynn,Kevin Love,Ryan Gomes,Wayne Ellington,Carlos Arroyo,Daequan Cook,Dorell Wright,Joel Anthony,Udonis Haslem,1,2:34,MIA,sub,,,,Dorell Wright,,Quentin Richardson,,,,,,,,,,,,
Darko Milicic,Jonny Flynn,Kevin Love,Ryan Gomes,Wayne Ellington,Daequan Cook,Dorell Wright,Joel Anthony,Mario Chalmers,Udonis Haslem,1,2:34,MIA,sub,,,,Mario Chalmers,,Carlos Arroyo,,,,,,,,,,,,
Damien Wilkins,Darko Milicic,Jonny Flynn,Kevin Love,Wayne Ellington,Daequan Cook,Dorell Wright,Joel Anthony,Mario Chalmers,Udonis Haslem,1,2:34,MIN,sub,,,,Damien Wilkins,,Ryan Gomes,,,,,,,,,,,,
Damien Wilkins,Darko Milicic,Jonny Flynn,Kevin Love,Wayne Ellington,Daequan Cook,Dorell Wright,Joel Anthony,Mario Chalmers,Udonis Haslem,1,2:22,MIN,turnover,,,,,,,,,,Darko Milicic,,,bad pass,,,,,
Damien Wilkins,Darko Milicic,Jonny Flynn,Kevin Love,Wayne Ellington,Daequan Cook,Dorell Wright,Joel Anthony,Mario Chalmers,Udonis Haslem,1,2:06,MIA,shot,,,Darko Milicic,,,,,,,Joel Anthony,,,,missed,,layup,25,6
Damien Wilkins,Darko Milicic,Jonny Flynn,Kevin Love,Wayne Ellington,Daequan Cook,Dorell Wright,Joel Anthony,Mario Chalmers,Udonis Haslem,1,2:04,MIN,rebound,,,,,,,,,,Wayne Ellington,,,,,,def,,
Damien Wilkins,Darko Milicic,Jonny Flynn,Kevin Love,Wayne Ellington,Daequan Cook,Dorell Wright,Joel Anthony,Mario Chalmers,Udonis Haslem,1,2:01,MIN,shot,,,,,,,,,,Jonny Flynn,,,,missed,,driving layup,25,6
Damien Wilkins,Darko Milicic,Jonny Flynn,Kevin Love,Wayne Ellington,Daequan Cook,Dorell Wright,Joel Anthony,Mario Chalmers,Udonis Haslem,1,2:01,MIN,rebound,,,,,,,,,,,,,,,,,,
Damien Wilkins,Darko Milicic,Jonny Flynn,Kevin Love,Wayne Ellington,Daequan Cook,Dorell Wright,Joel Anthony,Mario Chalmers,Udonis Haslem,1,1:54,MIN,shot,,,,,,,,,,Wayne Ellington,,,,missed,,jump,39,9
Damien Wilkins,Darko Milicic,Jonny Flynn,Kevin Love,Wayne Ellington,Daequan Cook,Dorell Wright,Joel Anthony,Mario Chalmers,Udonis Haslem,1,1:52,MIN,rebound,,,,,,,,,,Kevin Love,,,,,,off,,
Damien Wilkins,Darko Milicic,Jonny Flynn,Kevin Love,Wayne Ellington,Daequan Cook,Dorell Wright,Joel Anthony,Mario Chalmers,Udonis Haslem,1,1:51,MIN,shot,,,Mario Chalmers,,,,,,,Kevin Love,,,,missed,,layup,25,6
Damien Wilkins,Darko Milicic,Jonny Flynn,Kevin Love,Wayne Ellington,Daequan Cook,Dorell Wright,Joel Anthony,Mario Chalmers,Udonis Haslem,1,1:51,MIN,rebound,,,,,,,,,,,,,,,,,,
Damien Wilkins,Darko Milicic,Jonny Flynn,Kevin Love,Wayne Ellington,Daequan Cook,Dorell Wright,Joel Anthony,Mario Chalmers,Udonis Haslem,1,1:51,MIA,foul,,,,,,,,Damien Wilkins,,Mario Chalmers,,,,,,personal,,
Damien Wilkins,Darko Milicic,Jonny Flynn,Kevin Love,Wayne Ellington,Daequan Cook,Dorell Wright,Joel Anthony,Mario Chalmers,Udonis Haslem,1,1:33,MIN,shot,,,,,,,,,,Damien Wilkins,2,,,made,,jump,32,6
Damien Wilkins,Darko Milicic,Jonny Flynn,Kevin Love,Wayne Ellington,Daequan Cook,Dorell Wright,Joel Anthony,Mario Chalmers,Udonis Haslem,1,1:18,MIA,shot,Udonis Haslem,,,,,,,,,Dorell Wright,3,,,made,,3pt,2,16
Damien Wilkins,Darko Milicic,Jonny Flynn,Kevin Love,Wayne Ellington,Daequan Cook,Dorell Wright,Joel Anthony,Mario Chalmers,Udonis Haslem,1,1:10,MIA,foul,,,,,,,,Darko Milicic,,Joel Anthony,,,,,,shooting,,
Damien Wilkins,Darko Milicic,Kevin Love,Ramon Sessions,Wayne Ellington,Daequan Cook,Dorell Wright,Joel Anthony,Mario Chalmers,Udonis Haslem,1,1:10,MIN,sub,,,,Ramon Sessions,,Jonny Flynn,,,,,,,,,,,,
Damien Wilkins,Darko Milicic,Kevin Love,Ramon Sessions,Wayne Ellington,Daequan Cook,Dorell Wright,Joel Anthony,Mario Chalmers,Udonis Haslem,1,1:10,MIN,free throw,,,,,,,1,,2,Darko Milicic,,,foul,missed,,,,
Damien Wilkins,Darko Milicic,Kevin Love,Ramon Sessions,Wayne Ellington,Daequan Cook,Dorell Wright,Joel Anthony,Mario Chalmers,Udonis Haslem,1,1:10,MIN,rebound,,,,,,,,,,,,,,,,,,
Damien Wilkins,Darko Milicic,Kevin Love,Ramon Sessions,Wayne Ellington,Daequan Cook,Dorell Wright,Joel Anthony,Mario Chalmers,Udonis Haslem,1,1:10,MIN,free throw,,,,,,,2,,2,Darko Milicic,,,foul,missed,,,,
Damien Wilkins,Darko Milicic,Kevin Love,Ramon Sessions,Wayne Ellington,Daequan Cook,Dorell Wright,Joel Anthony,Mario Chalmers,Udonis Haslem,1,1:08,MIA,rebound,,,,,,,,,,Dorell Wright,,,,,,def,,
Damien Wilkins,Darko Milicic,Kevin Love,Ramon Sessions,Wayne Ellington,Daequan Cook,Dorell Wright,Joel Anthony,Mario Chalmers,Udonis Haslem,1,0:55,MIA,turnover,,,,,,,,,,Mario Chalmers,,,bad pass,,Kevin Love,,,
Damien Wilkins,Darko Milicic,Kevin Love,Ramon Sessions,Wayne Ellington,Daequan Cook,Dorell Wright,Joel Anthony,Mario Chalmers,Udonis Haslem,1,0:49,MIN,shot,,,Dorell Wright,,,,,,,Ramon Sessions,,,,missed,,layup,25,6
Damien Wilkins,Darko Milicic,Kevin Love,Ramon Sessions,Wayne Ellington,Daequan Cook,Dorell Wright,Joel Anthony,Mario Chalmers,Udonis Haslem,1,0:46,MIA,rebound,,,,,,,,,,Daequan Cook,,,,,,def,,
Damien Wilkins,Darko Milicic,Kevin Love,Ramon Sessions,Wayne Ellington,Daequan Cook,Dorell Wright,Joel Anthony,Mario Chalmers,Udonis Haslem,1,0:36,MIA,shot,,,,,,,,,,Daequan Cook,,,,missed,,3pt,39,27
Damien Wilkins,Darko Milicic,Kevin Love,Ramon Sessions,Wayne Ellington,Daequan Cook,Dorell Wright,Joel Anthony,Mario Chalmers,Udonis Haslem,1,0:36,MIN,rebound,,,,,,,,,,,,,,,,,,
Damien Wilkins,Darko Milicic,Kevin Love,Ramon Sessions,Wayne Ellington,Daequan Cook,Dorell Wright,Joel Anthony,Mario Chalmers,Udonis Haslem,1,0:20,MIN,shot,,,,,,,,,,Damien Wilkins,,,,missed,,jump,18,10
Damien Wilkins,Darko Milicic,Kevin Love,Ramon Sessions,Wayne Ellington,Daequan Cook,Dorell Wright,Joel Anthony,Mario Chalmers,Udonis Haslem,1,0:17,MIN,rebound,,,,,,,,,,Kevin Love,,,,,,off,,
Damien Wilkins,Darko Milicic,Kevin Love,Ramon Sessions,Wayne Ellington,Daequan Cook,Dorell Wright,Joel Anthony,Mario Chalmers,Udonis Haslem,1,0:16,MIN,shot,,,,,,,,,,Kevin Love,2,,,made,,tip,25,6
Damien Wilkins,Darko Milicic,Kevin Love,Ramon Sessions,Wayne Ellington,Daequan Cook,Dorell Wright,Joel Anthony,Mario Chalmers,Udonis Haslem,1,0:05,MIN,foul,,,,,,,,Dorell Wright,,Ramon Sessions,,,,,,personal,,
Damien Wilkins,Darko Milicic,Kevin Love,Ramon Sessions,Wayne Ellington,Daequan Cook,Dorell Wright,Joel Anthony,Mario Chalmers,Udonis Haslem,1,0:00,MIA,shot,,,,,,,,,,Udonis Haslem,,,,missed,,jump,36,18
Damien Wilkins,Darko Milicic,Kevin Love,Ramon Sessions,Wayne Ellington,Daequan Cook,Dorell Wright,Joel Anthony,Mario Chalmers,Udonis Haslem,1,0:00,MIN,rebound,,,,,,,,,,Wayne Ellington,,,,,,def,,
Damien Wilkins,Darko Milicic,Kevin Love,Ramon Sessions,Wayne Ellington,Dorell Wright,James Jones,Jermaine O'Neal,Mario Chalmers,Udonis Haslem,2,11:38,MIA,shot,,,,,,,,,,Dorell Wright,,,,missed,,fade away jumper,31,23
Damien Wilkins,Darko Milicic,Kevin Love,Ramon Sessions,Wayne Ellington,Dorell Wright,James Jones,Jermaine O'Neal,Mario Chalmers,Udonis Haslem,2,11:37,MIN,rebound,,,,,,,,,,,,,,,,,,
Damien Wilkins,Darko Milicic,Kevin Love,Ramon Sessions,Wayne Ellington,Dorell Wright,James Jones,Jermaine O'Neal,Mario Chalmers,Udonis Haslem,2,11:30,MIN,turnover,,,,,,,,,,Wayne Ellington,,,traveling,,,,,
Damien Wilkins,Darko Milicic,Kevin Love,Ramon Sessions,Wayne Ellington,Dorell Wright,James Jones,Jermaine O'Neal,Mario Chalmers,Udonis Haslem,2,11:16,MIA,turnover,,,,,,,,,,Mario Chalmers,,,bad pass,,Damien Wilkins,,,
Damien Wilkins,Darko Milicic,Kevin Love,Ramon Sessions,Wayne Ellington,Dorell Wright,James Jones,Jermaine O'Neal,Mario Chalmers,Udonis Haslem,2,11:04,MIN,shot,Damien Wilkins,,,,,,,,,Wayne Ellington,3,,,made,,3pt,48,17
Damien Wilkins,Darko Milicic,Kevin Love,Ramon Sessions,Wayne Ellington,Dorell Wright,James Jones,Jermaine O'Neal,Mario Chalmers,Udonis Haslem,2,10:47,MIA,turnover,,,,,,,,,,Jermaine O'Neal,,,traveling,,,,,
Damien Wilkins,Darko Milicic,Kevin Love,Ramon Sessions,Wayne Ellington,Dorell Wright,James Jones,Jermaine O'Neal,Mario Chalmers,Udonis Haslem,2,10:36,MIN,shot,,,,,,,,,,Kevin Love,3,,,made,,3pt,34,29
Damien Wilkins,Darko Milicic,Kevin Love,Ramon Sessions,Wayne Ellington,Dorell Wright,James Jones,Jermaine O'Neal,Mario Chalmers,Udonis Haslem,2,10:28,MIA,timeout,,,,,,,,,,,,,,,,regular,,
Damien Wilkins,Darko Milicic,Kevin Love,Ramon Sessions,Wayne Ellington,Dorell Wright,James Jones,Jermaine O'Neal,Mario Chalmers,Udonis Haslem,2,10:19,MIA,shot,,,,,,,,,,Udonis Haslem,,,,missed,,jump,33,23
Damien Wilkins,Darko Milicic,Kevin Love,Ramon Sessions,Wayne Ellington,Dorell Wright,James Jones,Jermaine O'Neal,Mario Chalmers,Udonis Haslem,2,10:18,MIN,rebound,,,,,,,,,,Damien Wilkins,,,,,,def,,
Damien Wilkins,Darko Milicic,Kevin Love,Ramon Sessions,Wayne Ellington,Dorell Wright,James Jones,Jermaine O'Neal,Mario Chalmers,Udonis Haslem,2,10:02,MIN,shot,,,Jermaine O'Neal,,,,,,,Kevin Love,,,,missed,,running hook,19,12
Damien Wilkins,Darko Milicic,Kevin Love,Ramon Sessions,Wayne Ellington,Dorell Wright,James Jones,Jermaine O'Neal,Mario Chalmers,Udonis Haslem,2,10:01,MIN,rebound,,,,,,,,,,,,,,,,,,
Damien Wilkins,Darko Milicic,Kevin Love,Ramon Sessions,Wayne Ellington,Dorell Wright,James Jones,Jermaine O'Neal,Mario Chalmers,Udonis Haslem,2,9:57,MIN,shot,,,,,,,,,,Ramon Sessions,2,,,made,,running jump,17,11
Damien Wilkins,Darko Milicic,Kevin Love,Ramon Sessions,Wayne Ellington,Dorell Wright,James Jones,Jermaine O'Neal,Mario Chalmers,Udonis Haslem,2,9:31,MIA,shot,Jermaine O'Neal,,,,,,,,,James Jones,3,,,made,,3pt,39,28