a1,a2,a3,a4,a5,h1,h2,h3,h4,h5,period,time,team,etype,assist,away,block,entered,home,left,num,opponent,outof,player,points,possession,reason,result,steal,type,x,y
Andrew Bynum,Derek Fisher,Kobe Bryant,Pau Gasol,Ron Artest,Marc Gasol,Mike Conley,O.J. Mayo,Rudy Gay,Zach Randolph,1,12:00,OFF,jump ball,,Andrew Bynum,,,Marc Gasol,,,,,,,Ron Artest,,,,,,
Andrew Bynum,Derek Fisher,Kobe Bryant,Pau Gasol,Ron Artest,Marc Gasol,Mike Conley,O.J. Mayo,Rudy Gay,Zach Randolph,1,11:47,MEM,foul,,,,,,,,Derek Fisher,,Mike Conley,,,,,,shooting,,
Andrew Bynum,Derek Fisher,Kobe Bryant,Pau Gasol,Ron Artest,Marc Gasol,Mike Conley,O.J. Mayo,Rudy Gay,Zach Randolph,1,11:47,LAL,free throw,,,,,,,1,,2,Derek Fisher,,,foul,made,,,,
Andrew Bynum,Derek Fisher,Kobe Bryant,Pau Gasol,Ron Artest,Marc Gasol,Mike Conley,O.J. Mayo,Rudy Gay,Zach Randolph,1,11:47,LAL,free throw,,,,,,,2,,2,Derek Fisher,,,foul,made,,,,
Andrew Bynum,Derek Fisher,Kobe Bryant,Pau Gasol,Ron Artest,Marc Gasol,Mike Conley,O.J. Mayo,Rudy Gay,Zach Randolph,1,11:34,MEM,shot,,,,,,,,,,Rudy Gay,,,,missed,,jump,,
Andrew Bynum,Derek Fisher,Kobe Bryant,Pau Gasol,Ron Artest,Marc Gasol,Mike Conley,O.J. Mayo,Rudy Gay,Zach Randolph,1,11:33,LAL,rebound,,,,,,,,,,Kobe Bryant,,,,,,def,,
Andrew Bynum,Derek Fisher,Kobe Bryant,Pau Gasol,Ron Artest,Marc Gasol,Mike Conley,O.J. Mayo,Rudy Gay,Zach Randolph,1,11:13,LAL,shot,,,,,,,,,,Derek Fisher,,,,missed,,3pt,,
Andrew Bynum,Derek Fisher,Kobe Bryant,Pau Gasol,Ron Artest,Marc Gasol,Mike Conley,O.J. Mayo,Rudy Gay,Zach Randolph,1,11:12,MEM,rebound,,,,,,,,,,O.J. Mayo,,,,,,def,,
Andrew Bynum,Derek Fisher,Kobe Bryant,Pau Gasol,Ron Artest,Marc Gasol,Mike Conley,O.J. Mayo,Rudy Gay,Zach Randolph,1,11:04,MEM,shot,,,,,,,,,,O.J. Mayo,,,,missed,,3pt,,
Andrew Bynum,Derek Fisher,Kobe Bryant,Pau Gasol,Ron Artest,Marc Gasol,Mike Conley,O.J. Mayo,Rudy Gay,Zach Randolph,1,11:02,LAL,rebound,,,,,,,,,,Pau Gasol,,,,,,def,,
Andrew Bynum,Derek Fisher,Kobe Bryant,Pau Gasol,Ron Artest,Marc Gasol,Mike Conley,O.J. Mayo,Rudy Gay,Zach Randolph,1,10:55,MEM,foul,,,,,,,,Andrew Bynum,,Marc Gasol,,,,,,shooting,,
Andrew Bynum,Derek Fisher,Kobe Bryant,Pau Gasol,Ron Artest,Marc Gasol,Mike Conley,O.J. Mayo,Rudy Gay,Zach Randolph,1,10:55,LAL,free throw,,,,,,,1,,2,Andrew Bynum,,,foul,made,,,,
Andrew Bynum,Derek Fisher,Kobe Bryant,Pau Gasol,Ron Artest,Marc Gasol,Mike Conley,O.J. Mayo,Rudy Gay,Zach Randolph,1,10:55,LAL,free throw,,,,,,,2,,2,Andrew Bynum,,,foul,made,,,,
Andrew Bynum,Derek Fisher,Kobe Bryant,Pau Gasol,Ron Artest,Marc Gasol,Mike Conley,O.J. Mayo,Rudy Gay,Zach Randolph,1,10:38,MEM,shot,,,,,,,,,,Zach Randolph,2,,,made,,layup,,
Andrew Bynum,Derek Fisher,Kobe Bryant,Pau Gasol,Ron Artest,Marc Gasol,Mike Conley,O.J. Mayo,Rudy Gay,Zach Randolph,1,10:21,LAL,shot,Derek Fisher,,,,,,,,,Pau Gasol,2,,,made,,turnaround jump,,
Andrew Bynum,Derek Fisher,Kobe Bryant,Pau Gasol,Ron Artest,Marc Gasol,Mike Conley,O.J. Mayo,Rudy Gay,Zach Randolph,1,10:12,MEM,turnover,,,,,,,,,,O.J. Mayo,,,bad pass,,Derek Fisher,,,
Andrew Bynum,Derek Fisher,Kobe Bryant,Pau Gasol,Ron Artest,Marc Gasol,Mike Conley,O.J. Mayo,Rudy Gay,Zach Randolph,1,10:02,LAL,shot,Kobe Bryant,,,,,,,,,Andrew Bynum,2,,,made,,turnaround jump,,
Andrew Bynum,Derek Fisher,Kobe Bryant,Pau Gasol,Ron Artest,Marc Gasol,Mike Conley,O.J. Mayo,Rudy Gay,Zach Randolph,1,9:46,MEM,shot,,,,,,,,,,Rudy Gay,2,,,made,,pullup jump,,
Andrew Bynum,Derek Fisher,Kobe Bryant,Pau Gasol,Ron Artest,Marc Gasol,Mike Conley,O.J. Mayo,Rudy Gay,Zach Randolph,1,9:22,LAL,shot,,,,,,,,,,Pau Gasol,,,,missed,,jump,,
Andrew Bynum,Derek Fisher,Kobe Bryant,Pau Gasol,Ron Artest,Marc Gasol,Mike Conley,O.J. Mayo,Rudy Gay,Zach Randolph,1,9:21,MEM,rebound,,,,,,,,,,Zach Randolph,,,,,,def,,
Andrew Bynum,Derek Fisher,Kobe Bryant,Pau Gasol,Ron Artest,Marc Gasol,Mike Conley,O.J. Mayo,Rudy Gay,Zach Randolph,1,9:09,MEM,shot,,,,,,,,,,Mike Conley,2,,,made,,jump,,
Andrew Bynum,Derek Fisher,Kobe Bryant,Pau Gasol,Ron Artest,Marc Gasol,Mike Conley,O.J. Mayo,Rudy Gay,Zach Randolph,1,8:44,LAL,shot,Pau Gasol,,,,,,,,,Kobe Bryant,3,,,made,,3pt,,
Andrew Bynum,Derek Fisher,Kobe Bryant,Pau Gasol,Ron Artest,Marc Gasol,Mike Conley,O.J. Mayo,Rudy Gay,Zach Randolph,1,8:44,MEM,foul,,,,,,,,Kobe Bryant,,O.J. Mayo,,,,,,shooting,,
Andrew Bynum,Derek Fisher,Kobe Bryant,Pau Gasol,Ron Artest,Marc Gasol,Mike Conley,O.J. Mayo,Rudy Gay,Zach Randolph,1,8:44,LAL,free throw,,,,,,,1,,1,Kobe Bryant,,,foul,made,,,,
Andrew Bynum,Derek Fisher,Kobe Bryant,Pau Gasol,Ron Artest,Marc Gasol,Mike Conley,O.J. Mayo,Rudy Gay,Zach Randolph,1,8:26,MEM,shot,,,,,,,,,,Rudy Gay,,,,missed,,pullup jump,,
Andrew Bynum,Derek Fisher,Kobe Bryant,Pau Gasol,Ron Artest,Marc Gasol,Mike Conley,O.J. Mayo,Rudy Gay,Zach Randolph,1,8:24,LAL,rebound,,,,,,,,,,Pau Gasol,,,,,,def,,
Andrew Bynum,Derek Fisher,Kobe Bryant,Pau Gasol,Ron Artest,Marc Gasol,Mike Conley,O.J. Mayo,Rudy Gay,Zach Randolph,1,8:14,LAL,turnover,,,,,,,,,,Derek Fisher,,,bad pass,,Rudy Gay,,,
Andrew Bynum,Derek Fisher,Kobe Bryant,Pau Gasol,Ron Artest,Marc Gasol,Mike Conley,O.J. Mayo,Rudy Gay,Zach Randolph,1,8:09,MEM,turnover,,,,,,,,,,Mike Conley,,,bad pass,,Pau Gasol,,,
Andrew Bynum,Derek Fisher,Kobe Bryant,Pau Gasol,Ron Artest,Marc Gasol,Mike Conley,O.J. Mayo,Rudy Gay,Zach Randolph,1,8:04,LAL,turnover,,,,,,,,,,Andrew Bynum,,,traveling,,,,,
Andrew Bynum,Derek Fisher,Kobe Bryant,Pau Gasol,Ron Artest,Marc Gasol,Mike Conley,O.J. Mayo,Rudy Gay,Zach Randolph,1,7:44,MEM,shot,,,,,,,,,,Marc Gasol,,,,missed,,running hook,,
Andrew Bynum,Derek Fisher,Kobe Bryant,Pau Gasol,Ron Artest,Marc Gasol,Mike Conley,O.J. Mayo,Rudy Gay,Zach Randolph,1,7:41,LAL,rebound,,,,,,,,,,Kobe Bryant,,,,,,def,,
Andrew Bynum,Derek Fisher,Kobe Bryant,Pau Gasol,Ron Artest,Marc Gasol,Mike Conley,O.J. Mayo,Rudy Gay,Zach Randolph,1,7:21,LAL,shot,,,,,,,,,,Ron Artest,,,,missed,,3pt,,
Andrew Bynum,Derek Fisher,Kobe Bryant,Pau Gasol,Ron Artest,Marc Gasol,Mike Conley,O.J. Mayo,Rudy Gay,Zach Randolph,1,7:20,MEM,rebound,,,,,,,,,,Rudy Gay,,,,,,def,,
Andrew Bynum,Derek Fisher,Kobe Bryant,Pau Gasol,Ron Artest,Marc Gasol,Mike Conley,O.J. Mayo,Rudy Gay,Zach Randolph,1,7:05,MEM,shot,,,,,,,,,,Mike Conley,,,,missed,,3pt,,
Andrew Bynum,Derek Fisher,Kobe Bryant,Pau Gasol,Ron Artest,Marc Gasol,Mike Conley,O.J. Mayo,Rudy Gay,Zach Randolph,1,7:04,LAL,rebound,,,,,,,,,,Pau Gasol,,,,,,def,,
Andrew Bynum,Derek Fisher,Kobe Bryant,Pau Gasol,Ron Artest,Marc Gasol,Mike Conley,O.J. Mayo,Rudy Gay,Zach Randolph,1,6:53,LAL,shot,,,,,,,,,,Pau Gasol,2,,,made,,layup,,
Andrew Bynum,Derek Fisher,Kobe Bryant,Pau Gasol,Ron Artest,Marc Gasol,Mike Conley,O.J. Mayo,Rudy Gay,Zach Randolph,1,6:39,MEM,shot,,,,,,,,,,O.J. Mayo,2,,,made,,pullup jump,,
Andrew Bynum,Derek Fisher,Kobe Bryant,Pau Gasol,Ron Artest,Marc Gasol,Mike Conley,O.J. Mayo,Rudy Gay,Zach Randolph,1,6:25,LAL,shot,,,,,,,,,,Pau Gasol,,,,missed,,alley oop layup,,
Andrew Bynum,Derek Fisher,Kobe Bryant,Pau Gasol,Ron Artest,Marc Gasol,Mike Conley,O.J. Mayo,Rudy Gay,Zach Randolph,1,6:22,MEM,rebound,,,,,,,,,,Zach Randolph,,,,,,def,,
Andrew Bynum,Derek Fisher,Kobe Bryant,Pau Gasol,Ron Artest,Marc Gasol,Mike Conley,O.J. Mayo,Rudy Gay,Zach Randolph,1,6:14,LAL,foul,,,,,,,,Marc Gasol,,Andrew Bynum,,,,,,personal,,
Andrew Bynum,Derek Fisher,Kobe Bryant,Pau Gasol,Ron Artest,Marc Gasol,Mike Conley,O.J. Mayo,Rudy Gay,Zach Randolph,1,6:00,MEM,shot,Rudy Gay,,,,,,,,,O.J. Mayo,2,,,made,,jump,,
Andrew Bynum,Derek Fisher,Kobe Bryant,Pau Gasol,Ron Artest,Marc Gasol,Mike Conley,O.J. Mayo,Rudy Gay,Zach Randolph,1,5:45,LAL,shot,,,,,,,,,,Ron Artest,,,,missed,,3pt,,
Andrew Bynum,Derek Fisher,Kobe Bryant,Pau Gasol,Ron Artest,Marc Gasol,Mike Conley,O.J. Mayo,Rudy Gay,Zach Randolph,1,5:44,MEM,rebound,,,,,,,,,,Zach Randolph,,,,,,def,,
Andrew Bynum,Derek Fisher,Kobe Bryant,Pau Gasol,Ron Artest,Marc Gasol,Mike Conley,O.J. Mayo,Rudy Gay,Zach Randolph,1,5:38,MEM,shot,,,,,,,,,,O.J. Mayo,,,,missed,,3pt,,
Andrew Bynum,Derek Fisher,Kobe Bryant,Pau Gasol,Ron Artest,Marc Gasol,Mike Conley,O.J. Mayo,Rudy Gay,Zach Randolph,1,5:36,LAL,rebound,,,,,,,,,,Kobe Bryant,,,,,,def,,
Andrew Bynum,Derek Fisher,Kobe Bryant,Pau Gasol,Ron Artest,Marc Gasol,Mike Conley,O.J. Mayo,Rudy Gay,Zach Randolph,1,5:29,LAL,shot,,,,,,,,,,Kobe Bryant,,,,missed,,jump,,
Andrew Bynum,Derek Fisher,Kobe Bryant,Pau Gasol,Ron Artest,Marc Gasol,Mike Conley,O.J. Mayo,Rudy Gay,Zach Randolph,1,5:27,MEM,rebound,,,,,,,,,,Zach Randolph,,,,,,def,,
Andrew Bynum,Derek Fisher,Kobe Bryant,Pau Gasol,Ron Artest,Marc Gasol,Mike Conley,O.J. Mayo,Rudy Gay,Zach Randolph,1,5:24,MEM,shot,Mike Conley,,,,,,,,,Marc Gasol,2,,,made,,layup,,
Andrew Bynum,Derek Fisher,Kobe Bryant,Pau Gasol,Ron Artest,Marc Gasol,Mike Conley,O.J. Mayo,Rudy Gay,Zach Randolph,1,5:24,LAL,foul,,,,,,,,Marc Gasol,,Derek Fisher,,,,,,shooting,,
Andrew Bynum,Derek Fisher,Kobe Bryant,Pau Gasol,Ron Artest,Marc Gasol,Mike Conley,O.J. Mayo,Rudy Gay,Zach Randolph,1,5:24,MEM,timeout,,,,,,,,,,,,,,,,regular,,
Andrew Bynum,Derek Fisher,Kobe Bryant,Pau Gasol,Ron Artest,Marc Gasol,Mike Conley,O.J. Mayo,Rudy Gay,Zach Randolph,1,5:24,MEM,free throw,,,,,,,1,,1,Marc Gasol,,,foul,missed,,,,
Andrew Bynum,Derek Fisher,Kobe Bryant,Pau Gasol,Ron Artest,Marc Gasol,Mike Conley,O.J. Mayo,Rudy Gay,Zach Randolph,1,5:21,LAL,rebound,,,,,,,,,,Pau Gasol,,,,,,def,,
Andrew Bynum,Derek Fisher,Kobe Bryant,Pau Gasol,Ron Artest,Marc Gasol,Mike Conley,O.J. Mayo,Rudy Gay,Zach Randolph,1,5:06,LAL,shot,,,,,,,,,,Derek Fisher,,,,missed,,pullup jump,,
Andrew Bynum,Derek Fisher,Kobe Bryant,Pau Gasol,Ron Artest,Marc Gasol,Mike Conley,O.J. Mayo,Rudy Gay,Zach Randolph,1,5:03,LAL,rebound,,,,,,,,,,Andrew Bynum,,,,,,off,,
Andrew Bynum,Derek Fisher,Kobe Bryant,Pau Gasol,Ron Artest,Marc Gasol,Mike Conley,O.J. Mayo,Rudy Gay,Zach Randolph,1,5:01,LAL,shot,,,,,,,,,,Andrew Bynum,2,,,made,,layup,,
Andrew Bynum,Derek Fisher,Kobe Bryant,Pau Gasol,Ron Artest,Marc Gasol,Mike Conley,O.J. Mayo,Rudy Gay,Zach Randolph,1,4:40,MEM,turnover,,,,,,,,,,Zach Randolph,,,lost ball,,Derek Fisher,,,
Andrew Bynum,Derek Fisher,Kobe Bryant,Pau Gasol,Ron Artest,Marc Gasol,Mike Conley,O.J. Mayo,Rudy Gay,Zach Randolph,1,4:20,LAL,shot,,,,,,,,,,Kobe Bryant,,,,missed,,jump,,
Andrew Bynum,Derek Fisher,Kobe Bryant,Pau Gasol,Ron Artest,Marc Gasol,Mike Conley,O.J. Mayo,Rudy Gay,Zach Randolph,1,4:19,MEM,rebound,,,,,,,,,,Marc Gasol,,,,,,def,,
Andrew Bynum,Derek Fisher,Kobe Bryant,Pau Gasol,Ron Artest,Marc Gasol,Mike Conley,O.J. Mayo,Rudy Gay,Zach Randolph,1,4:12,LAL,foul,,,,,,,,Marc Gasol,,Pau Gasol,,,,,,personal,,
Andrew Bynum,Derek Fisher,Kobe Bryant,Lamar Odom,Ron Artest,Marc Gasol,Mike Conley,O.J. Mayo,Rudy Gay,Zach Randolph,1,4:12,LAL,sub,,,,Lamar Odom,,Pau Gasol,,,,,,,,,,,,
Andrew Bynum,Derek Fisher,Kobe Bryant,Lamar Odom,Ron Artest,Marc Gasol,Mike Conley,O.J. Mayo,Rudy Gay,Zach Randolph,1,4:05,MEM,shot,,,,,,,,,,Mike Conley,,,,missed,,running jump,,
Andrew Bynum,Derek Fisher,Kobe Bryant,Lamar Odom,Ron Artest,Marc Gasol,Mike Conley,O.J. Mayo,Rudy Gay,Zach Randolph,1,4:03,LAL,rebound,,,,,,,,,,Andrew Bynum,,,,,,def,,
Andrew Bynum,Derek Fisher,Kobe Bryant,Lamar Odom,Ron Artest,Marc Gasol,Mike Conley,O.J. Mayo,Rudy Gay,Zach Randolph,1,3:47,LAL,shot,,,,,,,,,,Ron Artest,,,,missed,,jump,,
Andrew Bynum,Derek Fisher,Kobe Bryant,Lamar Odom,Ron Artest,Marc Gasol,Mike Conley,O.J. Mayo,Rudy Gay,Zach Randolph,1,3:46,MEM,rebound,,,,,,,,,,Marc Gasol,,,,,,def,,
Andrew Bynum,Derek Fisher,Kobe Bryant,Lamar Odom,Ron Artest,Marc Gasol,Mike Conley,O.J. Mayo,Rudy Gay,Zach Randolph,1,3:34,MEM,turnover,,,,,,,,,,Zach Randolph,,,bad pass,,Kobe Bryant,,,
Andrew Bynum,Derek Fisher,Kobe Bryant,Lamar Odom,Ron Artest,Marc Gasol,Mike Conley,O.J. Mayo,Rudy Gay,Zach Randolph,1,3:30,LAL,shot,,,,,,,,,,Kobe Bryant,2,,,made,,dunk,,
Andrew Bynum,Derek Fisher,Kobe Bryant,Lamar Odom,Ron Artest,Marc Gasol,Mike Conley,O.J. Mayo,Rudy Gay,Zach Randolph,1,3:24,MEM,timeout,,,,,,,,,,,,,,,,short,,
Andrew Bynum,Derek Fisher,Kobe Bryant,Lamar Odom,Ron Artest,Marc Gasol,Mike Conley,O.J. Mayo,Rudy Gay,Zach Randolph,1,3:24,MEM,foul,,,,,,,,,,O.J. Mayo,,,,,,technical,,
Andrew Bynum,Derek Fisher,Kobe Bryant,Lamar Odom,Ron Artest,Marc Gasol,Mike Conley,O.J. Mayo,Rudy Gay,Zach Randolph,1,3:24,LAL,free throw,,,,,,,1,,1,Kobe Bryant,,,technical,made,,,,
Andrew Bynum,Derek Fisher,Kobe Bryant,Lamar Odom,Ron Artest,Marc Gasol,Mike Conley,O.J. Mayo,Rudy Gay,Zach Randolph,1,3:19,MEM,turnover,,,,,,,,,,Rudy Gay,,,bad pass,,Andrew Bynum,,,
Andrew Bynum,Derek Fisher,Kobe Bryant,Lamar Odom,Ron Artest,Marc Gasol,Mike Conley,O.J. Mayo,Rudy Gay,Zach Randolph,1,3:15,LAL,shot,Ron Artest,,,,,,,,,Kobe Bryant,2,,,made,,dunk,,
Andrew Bynum,Derek Fisher,Kobe Bryant,Lamar Odom,Ron Artest,Marc Gasol,Mike Conley,O.J. Mayo,Rudy Gay,Zach Randolph,1,2:52,MEM,turnover,,,,,,,,,,Zach Randolph,,,out of bounds lost ball turnover,,,,,
Andrew Bynum,Derek Fisher,Kobe Bryant,Lamar Odom,Ron Artest,Marc Gasol,Mike Conley,O.J. Mayo,Rudy Gay,Zach Randolph,1,2:52,LAL,timeout,,,,,,,,,,,,,,,,regular,,
Derek Fisher,Jordan Farmar,Kobe Bryant,Lamar Odom,Ron Artest,Marc Gasol,Mike Conley,O.J. Mayo,Rudy Gay,Zach Randolph,1,2:52,LAL,sub,,,,Jordan Farmar,,Andrew Bynum,,,,,,,,,,,,
Jordan Farmar,Kobe Bryant,Lamar Odom,Pau Gasol,Ron Artest,Marc Gasol,Mike Conley,O.J. Mayo,Rudy Gay,Zach Randolph,1,2:52,LAL,sub,,,,Pau Gasol,,Derek Fisher,,,,,,,,,,,,
Jordan Farmar,Kobe Bryant,Lamar Odom,Pau Gasol,Ron Artest,Marc Gasol,Mike Conley,O.J. Mayo,Rudy Gay,Zach Randolph,1,2:38,LAL,shot,,,Marc Gasol,,,,,,,Lamar Odom,,,,missed,,layup,,
Jordan Farmar,Kobe Bryant,Lamar Odom,Pau Gasol,Ron Artest,Marc Gasol,Mike Conley,O.J. Mayo,Rudy Gay,Zach Randolph,1,2:36,LAL,rebound,,,,,,,,,,Pau Gasol,,,,,,off,,
Jordan Farmar,Kobe Bryant,Lamar Odom,Pau Gasol,Ron Artest,Marc Gasol,Mike Conley,O.J. Mayo,Rudy Gay,Zach Randolph,1,2:36,LAL,shot,,,,,,,,,,Pau Gasol,2,,,made,,tip,,
Jordan Farmar,Kobe Bryant,Lamar Odom,Pau Gasol,Ron Artest,Marc Gasol,Mike Conley,O.J. Mayo,Rudy Gay,Zach Randolph,1,2:18,MEM,shot,,,,,,,,,,Mike Conley,,,,missed,,3pt,,
Jordan Farmar,Kobe Bryant,Lamar Odom,Pau Gasol,Ron Artest,Marc Gasol,Mike Conley,O.J. Mayo,Rudy Gay,Zach Randolph,1,2:18,MEM,rebound,,,,,,,,,,,,,,,,,,
Jordan Farmar,Kobe Bryant,Lamar Odom,Pau Gasol,Ron Artest,Marc Gasol,Mike Conley,O.J. Mayo,Rudy Gay,Zach Randolph,1,2:18,LAL,foul,,,,,,,,Zach Randolph,,Lamar Odom,,,,,,loose ball,,
Jordan Farmar,Kobe Bryant,Lamar Odom,Pau Gasol,Ron Artest,Marc Gasol,Marcus Williams,O.J. Mayo,Rudy Gay,Zach Randolph,1,2:18,MEM,sub,,,,Marcus Williams,,Mike Conley,,,,,,,,,,,,
Jordan Farmar,Kobe Bryant,Lamar Odom,Pau Gasol,Ron Artest,Marc Gasol,Marcus Williams,O.J. Mayo,Rudy Gay,Zach Randolph,1,2:09,MEM,shot,,,,,,,,,,Marc Gasol,,,,missed,,layup,,
Jordan Farmar,Kobe Bryant,Lamar Odom,Pau Gasol,Ron Artest,Marc Gasol,Marcus Williams,O.J. Mayo,Rudy Gay,Zach Randolph,1,2:08,MEM,rebound,,,,,,,,,,Marc Gasol,,,,,,off,,
Jordan Farmar,Kobe Bryant,Lamar Odom,Pau Gasol,Ron Artest,Marc Gasol,Marcus Williams,O.J. Mayo,Rudy Gay,Zach Randolph,1,2:08,MEM,shot,,,,,,,,,,Marc Gasol,,,,missed,,tip,,
Jordan Farmar,Kobe Bryant,Lamar Odom,Pau Gasol,Ron Artest,Marc Gasol,Marcus Williams,O.J. Mayo,Rudy Gay,Zach Randolph,1,2:06,LAL,rebound,,,,,,,,,,Kobe Bryant,,,,,,def,,
Jordan Farmar,Kobe Bryant,Lamar Odom,Pau Gasol,Ron Artest,Marc Gasol,Marcus Williams,O.J. Mayo,Rudy Gay,Zach Randolph,1,1:59,LAL,shot,,,,,,,,,,Ron Artest,,,,missed,,3pt,,
Jordan Farmar,Kobe Bryant,Lamar Odom,Pau Gasol,Ron Artest,Marc Gasol,Marcus Williams,O.J. Mayo,Rudy Gay,Zach Randolph,1,1:58,MEM,rebound,,,,,,,,,,Marc Gasol,,,,,,def,,
Jordan Farmar,Kobe Bryant,Lamar Odom,Pau Gasol,Ron Artest,Darrell Arthur,Marc Gasol,Marcus Williams,O.J. Mayo,Rudy Gay,1,1:53,MEM,sub,,,,Darrell Arthur,,Zach Randolph,,,,,,,,,,,,
Jordan Farmar,Kobe Bryant,Lamar Odom,Pau Gasol,Ron Artest,Darrell Arthur,Marc Gasol,Marcus Williams,O.J. Mayo,Rudy Gay,1,1:41,MEM,shot,Marcus Williams,,,,,,,,,O.J. Mayo,2,,,made,,jump,,
Jordan Farmar,Kobe Bryant,Lamar Odom,Pau Gasol,Ron Artest,Darrell Arthur,Marc Gasol,Marcus Williams,O.J. Mayo,Rudy Gay,1,1:19,LAL,shot,,,,,,,,,,Pau Gasol,,,,missed,,turnaround jump,,
Jordan Farmar,Kobe Bryant,Lamar Odom,Pau Gasol,Ron Artest,Darrell Arthur,Marc Gasol,Marcus Williams,O.J. Mayo,Rudy Gay,1,1:17,MEM,rebound,,,,,,,,,,Marc Gasol,,,,,,def,,
Jordan Farmar,Kobe Bryant,Lamar Odom,Pau Gasol,Shannon Brown,Darrell Arthur,Marc Gasol,Marcus Williams,O.J. Mayo,Rudy Gay,1,1:13,LAL,sub,,,,Shannon Brown,,Ron Artest,,,,,,,,,,,,
Jordan Farmar,Kobe Bryant,Lamar Odom,Pau Gasol,Shannon Brown,Darrell Arthur,Marc Gasol,Marcus Williams,O.J. Mayo,Rudy Gay,1,1:08,MEM,shot,Darrell Arthur,,,,,,,,,Marcus Williams,2,,,made,,jump,,
Jordan Farmar,Kobe Bryant,Lamar Odom,Pau Gasol,Shannon Brown,Darrell Arthur,Marc Gasol,Marcus Williams,O.J. Mayo,Rudy Gay,1,0:47,LAL,shot,,,,,,,,,,Jordan Farmar,,,,missed,,3pt,,
Jordan Farmar,Kobe Bryant,Lamar Odom,Pau Gasol,Shannon Brown,Darrell Arthur,Marc Gasol,Marcus Williams,O.J. Mayo,Rudy Gay,1,0:45,LAL,rebound,,,,,,,,,,Pau Gasol,,,,,,off,,
Jordan Farmar,Kobe Bryant,Lamar Odom,Pau Gasol,Shannon Brown,Darrell Arthur,Marc Gasol,Marcus Williams,O.J. Mayo,Rudy Gay,1,0:38,LAL,shot,Kobe Bryant,,,,,,,,,Pau Gasol,2,,,made,,dunk,,
Jordan Farmar,Kobe Bryant,Lamar Odom,Pau Gasol,Shannon Brown,Darrell Arthur,Marc Gasol,Marcus Williams,O.J. Mayo,Rudy Gay,1,0:25,MEM,shot,,,Kobe Bryant,,,,,,,Rudy Gay,,,,missed,,layup,,
Jordan Farmar,Kobe Bryant,Lamar Odom,Pau Gasol,Shannon Brown,Darrell Arthur,Marc Gasol,Marcus Williams,O.J. Mayo,Rudy Gay,1,0:23,LAL,rebound,,,,,,,,,,Kobe Bryant,,,,,,def,,
Jordan Farmar,Kobe Bryant,Lamar Odom,Pau Gasol,Shannon Brown,Darrell Arthur,Marc Gasol,Marcus Williams,O.J. Mayo,Rudy Gay,1,0:21,LAL,shot,Kobe Bryant,,,,,,,,,Jordan Farmar,2,,,made,,layup,,
Jordan Farmar,Kobe Bryant,Lamar Odom,Pau Gasol,Shannon Brown,Darrell Arthur,Marc Gasol,Marcus Williams,O.J. Mayo,Rudy Gay,1,0:03,MEM,shot,,,,,,,,,,O.J. Mayo,,,,missed,,3pt,,
Jordan Farmar,Kobe Bryant,Lamar Odom,Pau Gasol,Shannon Brown,Darrell Arthur,Marc Gasol,Marcus Williams,O.J. Mayo,Rudy Gay,1,0:02,LAL,rebound,,,,,,,,,,Jordan Farmar,,,,,,def,,
Jordan Farmar,Lamar Odom,Pau Gasol,Ron Artest,Shannon Brown,Darrell Arthur,Marc Gasol,Marcus Williams,Rudy Gay,Sam Young,2,11:47,MEM,shot,,,,,,,,,,Rudy Gay,,,,missed,,running jump,,
Jordan Farmar,Lamar Odom,Pau Gasol,Ron Artest,Shannon Brown,Darrell Arthur,Marc Gasol,Marcus Williams,Rudy Gay,Sam Young,2,11:44,LAL,rebound,,,,,,,,,,Lamar Odom,,,,,,def,,
Jordan Farmar,Lamar Odom,Pau Gasol,Ron Artest,Shannon Brown,Darrell Arthur,Marc Gasol,Marcus Williams,Rudy Gay,Sam Young,2,11:29,LAL,shot,,,,,,,,,,Pau Gasol,,,,missed,,turnaround jump,,
Jordan Farmar,Lamar Odom,Pau Gasol,Ron Artest,Shannon Brown,Darrell Arthur,Marc Gasol,Marcus Williams,Rudy Gay,Sam Young,2,11:27,MEM,rebound,,,,,,,,,,Sam Young,,,,,,def,,
Jordan Farmar,Lamar Odom,Pau Gasol,Ron Artest,Shannon Brown,Darrell Arthur,Marc Gasol,Marcus Williams,Rudy Gay,Sam Young,2,11:19,MEM,shot,,,,,,,,,,Darrell Arthur,,,,missed,,jump,,
Jordan Farmar,Lamar Odom,Pau Gasol,Ron Artest,Shannon Brown,Darrell Arthur,Marc Gasol,Marcus Williams,Rudy Gay,Sam Young,2,11:17,LAL,rebound,,,,,,,,,,Pau Gasol,,,,,,def,,
Jordan Farmar,Lamar Odom,Pau Gasol,Ron Artest,Shannon Brown,Darrell Arthur,Marc Gasol,Marcus Williams,Rudy Gay,Sam Young,2,11:06,MEM,foul,,,,,,,,,,Sam Young,,,,,,defense 3 second,,
Jordan Farmar,Lamar Odom,Pau Gasol,Ron Artest,Shannon Brown,Darrell Arthur,Hamed Haddadi,Marcus Williams,Rudy Gay,Sam Young,2,11:06,MEM,sub,,,,Hamed Haddadi,,Marc Gasol,,,,,,,,,,,,
Jordan Farmar,Lamar Odom,Pau Gasol,Ron Artest,Shannon Brown,Darrell Arthur,Hamed Haddadi,Marcus Williams,Rudy Gay,Sam Young,2,11:06,LAL,free throw,,,,,,,1,,1,Pau Gasol,,,technical,made,,,,
Jordan Farmar,Lamar Odom,Pau Gasol,Ron Artest,Shannon Brown,Darrell Arthur,Hamed Haddadi,Marcus Williams,Rudy Gay,Sam Young,2,11:00,LAL,shot,,,,,,,,,,Lamar Odom,,,,missed,,3pt,,
Jordan Farmar,Lamar Odom,Pau Gasol,Ron Artest,Shannon Brown,Darrell Arthur,Hamed Haddadi,Marcus Williams,Rudy Gay,Sam Young,2,10:58,MEM,rebound,,,,,,,,,,Rudy Gay,,,,,,def,,
Jordan Farmar,Lamar Odom,Pau Gasol,Ron Artest,Shannon Brown,Darrell Arthur,Hamed Haddadi,Marcus Williams,Rudy Gay,Sam Young,2,10:50,MEM,shot,,,,,,,,,,Marcus Williams,,,,missed,,pullup jump,,
Jordan Farmar,Lamar Odom,Pau Gasol,Ron Artest,Shannon Brown,Darrell Arthur,Hamed Haddadi,Marcus Williams,Rudy Gay,Sam Young,2,10:47,LAL,rebound,,,,,,,,,,Lamar Odom,,,,,,def,,
Jordan Farmar,Lamar Odom,Pau Gasol,Ron Artest,Shannon Brown,Darrell Arthur,Hamed Haddadi,Marcus Williams,Rudy Gay,Sam Young,2,10:39,LAL,shot,,,,,,,,,,Pau Gasol,2,,,made,,jump,,
Jordan Farmar,Lamar Odom,Pau Gasol,Ron Artest,Shannon Brown,Darrell Arthur,Hamed Haddadi,Marcus Williams,Rudy Gay,Sam Young,2,10:22,MEM,shot,Hamed Haddadi,,,,,,,,,Darrell Arthur,2,,,made,,layup,,
Jordan Farmar,Lamar Odom,Pau Gasol,Ron Artest,Shannon Brown,Darrell Arthur,Hamed Haddadi,Marcus Williams,Rudy Gay,Sam Young,2,10:04,LAL,shot,,,,,,,,,,Jordan Farmar,2,,,made,,pullup jump,,
Jordan Farmar,Lamar Odom,Pau Gasol,Ron Artest,Shannon Brown,Darrell Arthur,Hamed Haddadi,Marcus Williams,Rudy Gay,Sam Young,2,9:53,MEM,shot,,,,,,,,,,Rudy Gay,,,,missed,,driving layup,,
Jordan Farmar,Lamar Odom,Pau Gasol,Ron Artest,Shannon Brown,Darrell Arthur,Hamed Haddadi,Marcus Williams,Rudy Gay,Sam Young,2,9:50,MEM,rebound,,,,,,,,,,Darrell Arthur,,,,,,off,,
Jordan Farmar,Lamar Odom,Pau Gasol,Ron Artest,Shannon Brown,Darrell Arthur,Hamed Haddadi,Marcus Williams,Rudy Gay,Sam Young,2,9:50,MEM,shot,,,,,,,,,,Darrell Arthur,,,,missed,,tip,,
Jordan Farmar,Lamar Odom,Pau Gasol,Ron Artest,Shannon Brown,Darrell Arthur,Hamed Haddadi,Marcus Williams,Rudy Gay,Sam Young,2,9:49,MEM,rebound,,,,,,,,,,Hamed Haddadi,,,,,,off,,
Jordan Farmar,Lamar Odom,Pau Gasol,Ron Artest,Shannon Brown,Darrell Arthur,Hamed Haddadi,Marcus Williams,Rudy Gay,Sam Young,2,9:49,MEM,shot,,,,,,,,,,Hamed Haddadi,2,,,made,,layup,,
Jordan Farmar,Lamar Odom,Pau Gasol,Ron Artest,Shannon Brown,Darrell Arthur,Hamed Haddadi,Marcus Williams,Rudy Gay,Sam Young,2,9:38,LAL,turnover,,,,,,,,,,Pau Gasol,,,lost ball,,Darrell Arthur,,,
Jordan Farmar,Lamar Odom,Pau Gasol,Ron Artest,Shannon Brown,Darrell Arthur,Hamed Haddadi,Marcus Williams,Rudy Gay,Sam Young,2,9:34,MEM,turnover,,,,,,,,,,Marcus Williams,,,bad pass,,,,,
Jordan Farmar,Lamar Odom,Pau Gasol,Ron Artest,Shannon Brown,Darrell Arthur,Hamed Haddadi,Marcus Williams,Rudy Gay,Sam Young,2,9:17,LAL,shot,Pau Gasol,,,,,,,,,Lamar Odom,2,,,made,,layup,,
Jordan Farmar,Lamar Odom,Pau Gasol,Ron Artest,Shannon Brown,Darrell Arthur,Hamed Haddadi,Marcus Williams,Rudy Gay,Sam Young,2,9:01,MEM,shot,,,,,,,,,,Sam Young,,,,missed,,layup,,
Jordan Farmar,Lamar Odom,Pau Gasol,Ron Artest,Shannon Brown,Darrell Arthur,Hamed Haddadi,Marcus Williams,Rudy Gay,Sam Young,2,8:59,LAL,rebound,,,,,,,,,,Lamar Odom,,,,,,def,,
Jordan Farmar,Lamar Odom,Pau Gasol,Ron Artest,Shannon Brown,Darrell Arthur,Hamed Haddadi,Marcus Williams,Rudy Gay,Sam Young,2,8:49,LAL,shot,,,,,,,,,,Shannon Brown,,,,missed,,3pt,,
Jordan Farmar,Lamar Odom,Pau Gasol,Ron Artest,Shannon Brown,Darrell Arthur,Hamed Haddadi,Marcus Williams,Rudy Gay,Sam Young,2,8:48,MEM,rebound,,,,,,,,,,Darrell Arthur,,,,,,def,,
Jordan Farmar,Lamar Odom,Pau Gasol,Ron Artest,Shannon Brown,Darrell Arthur,Hamed Haddadi,Marcus Williams,Rudy Gay,Sam Young,2,8:41,MEM,shot,,,,,,,,,,Rudy Gay,2,,,made,,jump,,
Jordan Farmar,Lamar Odom,Pau Gasol,Ron Artest,Shannon Brown,Darrell Arthur,Hamed Haddadi,Marcus Williams,Rudy Gay,Sam Young,2,8:13,LAL,shot,,,Rudy Gay,,,,,,,Shannon Brown,,,,missed,,dunk,,
Jordan Farmar,Lamar Odom,Pau Gasol,Ron Artest,Shannon Brown,Darrell Arthur,Hamed Haddadi,Marcus Williams,Rudy Gay,Sam Young,2,8:11,MEM,rebound,,,,,,,,,,Darrell Arthur,,,,,,def,,
Jordan Farmar,Lamar Odom,Pau Gasol,Ron Artest,Shannon Brown,Darrell Arthur,Hamed Haddadi,Marcus Williams,Rudy Gay,Sam Young,2,8:02,MEM,shot,Rudy Gay,,,,,,,,,Hamed Haddadi,2,,,made,,layup,,
Jordan Farmar,Lamar Odom,Pau Gasol,Ron Artest,Shannon Brown,Darrell Arthur,Hamed Haddadi,Marcus Williams,Rudy Gay,Sam Young,2,8:02,LAL,foul,,,,,,,,Hamed Haddadi,,Pau Gasol,,,,,,shooting,,