a1,a2,a3,a4,a5,h1,h2,h3,h4,h5,period,time,team,etype,assist,away,block,entered,home,left,num,opponent,outof,player,points,possession,reason,result,steal,type,x,y
Marc Gasol,Mike Conley,O.J. Mayo,Rudy Gay,Zach Randolph,Brook Lopez,Courtney Lee,Devin Harris,Jarvis Hayes,Yi Jianlian,1,12:00,OFF,jump ball,,Marc Gasol,,,Brook Lopez,,,,,,,Rudy Gay,,,,,,
Marc Gasol,Mike Conley,O.J. Mayo,Rudy Gay,Zach Randolph,Brook Lopez,Courtney Lee,Devin Harris,Jarvis Hayes,Yi Jianlian,1,11:41,MEM,shot,Rudy Gay,,,,,,,,,O.J. Mayo,3,,,made,,3pt,2,6
Marc Gasol,Mike Conley,O.J. Mayo,Rudy Gay,Zach Randolph,Brook Lopez,Courtney Lee,Devin Harris,Jarvis Hayes,Yi Jianlian,1,11:18,NJN,shot,,,,,,,,,,Jarvis Hayes,,,,missed,,jump,42,15
Marc Gasol,Mike Conley,O.J. Mayo,Rudy Gay,Zach Randolph,Brook Lopez,Courtney Lee,Devin Harris,Jarvis Hayes,Yi Jianlian,1,11:16,MEM,rebound,,,,,,,,,,O.J. Mayo,,,,,,def,,
Marc Gasol,Mike Conley,O.J. Mayo,Rudy Gay,Zach Randolph,Brook Lopez,Courtney Lee,Devin Harris,Jarvis Hayes,Yi Jianlian,1,11:05,MEM,shot,,,,,,,,,,Marc Gasol,,,,missed,,running hook,22,12
Marc Gasol,Mike Conley,O.J. Mayo,Rudy Gay,Zach Randolph,Brook Lopez,Courtney Lee,Devin Harris,Jarvis Hayes,Yi Jianlian,1,11:03,NJN,rebound,,,,,,,,,,Brook Lopez,,,,,,def,,
Marc Gasol,Mike Conley,O.J. Mayo,Rudy Gay,Zach Randolph,Brook Lopez,Courtney Lee,Devin Harris,Jarvis Hayes,Yi Jianlian,1,10:53,NJN,shot,Devin Harris,,,,,,,,,Jarvis Hayes,2,,,made,,jump,44,6
Marc Gasol,Mike Conley,O.J. Mayo,Rudy Gay,Zach Randolph,Brook Lopez,Courtney Lee,Devin Harris,Jarvis Hayes,Yi Jianlian,1,10:47,NJN,foul,,,,,,,,Rudy Gay,,Jarvis Hayes,,,,,,shooting,,
Marc Gasol,Mike Conley,O.J. Mayo,Rudy Gay,Zach Randolph,Brook Lopez,Courtney Lee,Devin Harris,Jarvis Hayes,Yi Jianlian,1,10:47,MEM,free throw,,,,,,,1,,2,Rudy Gay,,,foul,made,,,,
Marc Gasol,Mike Conley,O.J. Mayo,Rudy Gay,Zach Randolph,Brook Lopez,Courtney Lee,Devin Harris,Jarvis Hayes,Yi Jianlian,1,10:47,MEM,free throw,,,,,,,2,,2,Rudy Gay,,,foul,missed,,,,
Marc Gasol,Mike Conley,O.J. Mayo,Rudy Gay,Zach Randolph,Brook Lopez,Courtney Lee,Devin Harris,Jarvis Hayes,Yi Jianlian,1,10:46,NJN,rebound,,,,,,,,,,Jarvis Hayes,,,,,,def,,
Marc Gasol,Mike Conley,O.J. Mayo,Rudy Gay,Zach Randolph,Brook Lopez,Courtney Lee,Devin Harris,Jarvis Hayes,Yi Jianlian,1,10:29,NJN,turnover,,,,,,,,,,Devin Harris,,,bad pass,,O.J. Mayo,,,
Marc Gasol,Mike Conley,O.J. Mayo,Rudy Gay,Zach Randolph,Brook Lopez,Courtney Lee,Devin Harris,Jarvis Hayes,Yi Jianlian,1,10:22,MEM,turnover,,,,,,,,,,Rudy Gay,,,lost ball,,Jarvis Hayes,,,
Marc Gasol,Mike Conley,O.J. Mayo,Rudy Gay,Zach Randolph,Brook Lopez,Courtney Lee,Devin Harris,Jarvis Hayes,Yi Jianlian,1,10:12,NJN,shot,,,,,,,,,,Yi Jianlian,,,,missed,,jump,42,7
Marc Gasol,Mike Conley,O.J. Mayo,Rudy Gay,Zach Randolph,Brook Lopez,Courtney Lee,Devin Harris,Jarvis Hayes,Yi Jianlian,1,10:10,NJN,rebound,,,,,,,,,,Courtney Lee,,,,,,off,,
Marc Gasol,Mike Conley,O.J. Mayo,Rudy Gay,Zach Randolph,Brook Lopez,Courtney Lee,Devin Harris,Jarvis Hayes,Yi Jianlian,1,10:09,NJN,shot,,,,,,,,,,Courtney Lee,2,,,made,,tip,25,6
Marc Gasol,Mike Conley,O.J. Mayo,Rudy Gay,Zach Randolph,Brook Lopez,Courtney Lee,Devin Harris,Jarvis Hayes,Yi Jianlian,1,9:52,MEM,shot,O.J. Mayo,,,,,,,,,Mike Conley,3,,,made,,3pt,10,26
Marc Gasol,Mike Conley,O.J. Mayo,Rudy Gay,Zach Randolph,Brook Lopez,Courtney Lee,Devin Harris,Jarvis Hayes,Yi Jianlian,1,9:40,NJN,shot,Devin Harris,,,,,,,,,Brook Lopez,2,,,made,,driving layup,25,6
Marc Gasol,Mike Conley,O.J. Mayo,Rudy Gay,Zach Randolph,Brook Lopez,Courtney Lee,Devin Harris,Jarvis Hayes,Yi Jianlian,1,9:33,NJN,foul,,,,,,,,Zach Randolph,,Yi Jianlian,,,,,,personal,,
Marc Gasol,Mike Conley,O.J. Mayo,Rudy Gay,Zach Randolph,Brook Lopez,Courtney Lee,Devin Harris,Jarvis Hayes,Yi Jianlian,1,9:26,MEM,foul,,,,,,,,Courtney Lee,,Marc Gasol,,,,,,offensive,,
Marc Gasol,Mike Conley,O.J. Mayo,Rudy Gay,Zach Randolph,Brook Lopez,Courtney Lee,Devin Harris,Jarvis Hayes,Yi Jianlian,1,9:26,MEM,turnover,,,,,,,,,,Marc Gasol,,,foul,,,,,
Marc Gasol,Mike Conley,O.J. Mayo,Rudy Gay,Zach Randolph,Brook Lopez,Courtney Lee,Devin Harris,Jarvis Hayes,Yi Jianlian,1,9:11,NJN,shot,,,,,,,,,,Courtney Lee,,,,missed,,3pt,48,6
Marc Gasol,Mike Conley,O.J. Mayo,Rudy Gay,Zach Randolph,Brook Lopez,Courtney Lee,Devin Harris,Jarvis Hayes,Yi Jianlian,1,9:09,NJN,rebound,,,,,,,,,,Courtney Lee,,,,,,off,,
Marc Gasol,Mike Conley,O.J. Mayo,Rudy Gay,Zach Randolph,Brook Lopez,Courtney Lee,Devin Harris,Jarvis Hayes,Yi Jianlian,1,9:03,NJN,turnover,,,,,,,,,,Courtney Lee,,,lost ball,,Mike Conley,,,
Marc Gasol,Mike Conley,O.J. Mayo,Rudy Gay,Zach Randolph,Brook Lopez,Courtney Lee,Devin Harris,Jarvis Hayes,Yi Jianlian,1,8:58,MEM,shot,Mike Conley,,,,,,,,,Rudy Gay,2,,,made,,slam dunk,25,6
Marc Gasol,Mike Conley,O.J. Mayo,Rudy Gay,Zach Randolph,Brook Lopez,Courtney Lee,Devin Harris,Jarvis Hayes,Yi Jianlian,1,8:40,NJN,shot,Jarvis Hayes,,,,,,,,,Brook Lopez,2,,,made,,driving layup,25,6
Marc Gasol,Mike Conley,O.J. Mayo,Rudy Gay,Zach Randolph,Brook Lopez,Courtney Lee,Devin Harris,Jarvis Hayes,Yi Jianlian,1,8:34,NJN,foul,,,,,,,,O.J. Mayo,,Yi Jianlian,,,,,,shooting,,
Marc Gasol,Mike Conley,O.J. Mayo,Rudy Gay,Zach Randolph,Brook Lopez,Courtney Lee,Devin Harris,Jarvis Hayes,Kris Humphries,1,8:34,NJN,sub,,,,Kris Humphries,,Yi Jianlian,,,,,,,,,,,,
Marc Gasol,Mike Conley,O.J. Mayo,Rudy Gay,Zach Randolph,Brook Lopez,Courtney Lee,Devin Harris,Jarvis Hayes,Kris Humphries,1,8:34,MEM,free throw,,,,,,,1,,2,O.J. Mayo,,,foul,made,,,,
Marc Gasol,Mike Conley,O.J. Mayo,Rudy Gay,Zach Randolph,Brook Lopez,Courtney Lee,Devin Harris,Jarvis Hayes,Kris Humphries,1,8:34,MEM,free throw,,,,,,,2,,2,O.J. Mayo,,,foul,made,,,,
Marc Gasol,Mike Conley,O.J. Mayo,Rudy Gay,Zach Randolph,Brook Lopez,Courtney Lee,Devin Harris,Jarvis Hayes,Kris Humphries,1,8:22,NJN,turnover,,,,,,,,,,Devin Harris,,,bad pass,,Marc Gasol,,,
Marc Gasol,Mike Conley,O.J. Mayo,Rudy Gay,Zach Randolph,Brook Lopez,Courtney Lee,Devin Harris,Jarvis Hayes,Kris Humphries,1,8:19,MEM,shot,O.J. Mayo,,,,,,,,,Rudy Gay,2,,,made,,alley oop dunk,25,6
Marc Gasol,Mike Conley,O.J. Mayo,Rudy Gay,Zach Randolph,Brook Lopez,Courtney Lee,Devin Harris,Jarvis Hayes,Kris Humphries,1,8:03,NJN,shot,,,,,,,,,,Courtney Lee,2,,,made,,jump,18,23
Marc Gasol,Mike Conley,O.J. Mayo,Rudy Gay,Zach Randolph,Brook Lopez,Courtney Lee,Devin Harris,Jarvis Hayes,Kris Humphries,1,7:43,MEM,shot,,,,,,,,,,Mike Conley,,,,missed,,3pt,32,29
Marc Gasol,Mike Conley,O.J. Mayo,Rudy Gay,Zach Randolph,Brook Lopez,Courtney Lee,Devin Harris,Jarvis Hayes,Kris Humphries,1,7:41,NJN,rebound,,,,,,,,,,Kris Humphries,,,,,,def,,
Marc Gasol,Mike Conley,O.J. Mayo,Rudy Gay,Zach Randolph,Brook Lopez,Courtney Lee,Devin Harris,Jarvis Hayes,Kris Humphries,1,7:33,NJN,shot,Courtney Lee,,,,,,,,,Brook Lopez,2,,,made,,jump,38,17
Marc Gasol,Mike Conley,O.J. Mayo,Rudy Gay,Zach Randolph,Brook Lopez,Courtney Lee,Devin Harris,Jarvis Hayes,Kris Humphries,1,7:13,MEM,turnover,,,,,,,,,,O.J. Mayo,,,lost ball,,Devin Harris,,,
Marc Gasol,Mike Conley,O.J. Mayo,Rudy Gay,Zach Randolph,Brook Lopez,Courtney Lee,Devin Harris,Jarvis Hayes,Kris Humphries,1,7:08,NJN,shot,Devin Harris,,,,,,,,,Courtney Lee,2,,,made,,alley oop layup,25,6
Marc Gasol,Mike Conley,O.J. Mayo,Rudy Gay,Zach Randolph,Brook Lopez,Courtney Lee,Devin Harris,Jarvis Hayes,Kris Humphries,1,6:55,MEM,shot,,,,,,,,,,Zach Randolph,,,,missed,,jump,12,19
Marc Gasol,Mike Conley,O.J. Mayo,Rudy Gay,Zach Randolph,Brook Lopez,Courtney Lee,Devin Harris,Jarvis Hayes,Kris Humphries,1,6:54,NJN,rebound,,,,,,,,,,Devin Harris,,,,,,def,,
Marc Gasol,Mike Conley,O.J. Mayo,Rudy Gay,Zach Randolph,Brook Lopez,Courtney Lee,Devin Harris,Jarvis Hayes,Kris Humphries,1,6:42,NJN,shot,,,,,,,,,,Kris Humphries,2,,,made,,jump bank,39,12
Marc Gasol,Mike Conley,O.J. Mayo,Rudy Gay,Zach Randolph,Brook Lopez,Courtney Lee,Devin Harris,Jarvis Hayes,Kris Humphries,1,6:15,NJN,foul,,,,,,,,Marc Gasol,,Brook Lopez,,,,,,shooting,,
Marc Gasol,Mike Conley,O.J. Mayo,Rudy Gay,Zach Randolph,Brook Lopez,Courtney Lee,Devin Harris,Jarvis Hayes,Kris Humphries,1,6:15,MEM,free throw,,,,,,,1,,2,Marc Gasol,,,foul,made,,,,
Marc Gasol,Mike Conley,O.J. Mayo,Rudy Gay,Zach Randolph,Brook Lopez,Courtney Lee,Devin Harris,Jarvis Hayes,Kris Humphries,1,6:15,MEM,free throw,,,,,,,2,,2,Marc Gasol,,,foul,made,,,,
Marc Gasol,Mike Conley,O.J. Mayo,Rudy Gay,Zach Randolph,Brook Lopez,Courtney Lee,Devin Harris,Jarvis Hayes,Kris Humphries,1,6:03,NJN,shot,Devin Harris,,,,,,,,,Brook Lopez,2,,,made,,layup,25,6
Marc Gasol,Mike Conley,O.J. Mayo,Rudy Gay,Zach Randolph,Brook Lopez,Courtney Lee,Devin Harris,Jarvis Hayes,Kris Humphries,1,5:51,MEM,shot,,,Devin Harris,,,,,,,Mike Conley,,,,missed,,driving layup,25,6
Marc Gasol,Mike Conley,O.J. Mayo,Rudy Gay,Zach Randolph,Brook Lopez,Courtney Lee,Devin Harris,Jarvis Hayes,Kris Humphries,1,5:49,NJN,rebound,,,,,,,,,,Brook Lopez,,,,,,def,,
Marc Gasol,Mike Conley,O.J. Mayo,Rudy Gay,Zach Randolph,Brook Lopez,Courtney Lee,Devin Harris,Jarvis Hayes,Kris Humphries,1,5:45,NJN,shot,,,,,,,,,,Devin Harris,2,,,made,,driving finger roll layup,25,6
Marc Gasol,Mike Conley,O.J. Mayo,Rudy Gay,Zach Randolph,Brook Lopez,Courtney Lee,Devin Harris,Jarvis Hayes,Kris Humphries,1,5:35,MEM,shot,,,Brook Lopez,,,,,,,Mike Conley,,,,missed,,driving layup,25,6
Marc Gasol,Mike Conley,O.J. Mayo,Rudy Gay,Zach Randolph,Brook Lopez,Courtney Lee,Devin Harris,Jarvis Hayes,Kris Humphries,1,5:33,NJN,rebound,,,,,,,,,,Jarvis Hayes,,,,,,def,,
Marc Gasol,Mike Conley,O.J. Mayo,Rudy Gay,Zach Randolph,Brook Lopez,Courtney Lee,Devin Harris,Jarvis Hayes,Kris Humphries,1,5:25,NJN,shot,,,,,,,,,,Jarvis Hayes,,,,missed,,3pt,2,5
Marc Gasol,Mike Conley,O.J. Mayo,Rudy Gay,Zach Randolph,Brook Lopez,Courtney Lee,Devin Harris,Jarvis Hayes,Kris Humphries,1,5:24,MEM,rebound,,,,,,,,,,Zach Randolph,,,,,,def,,
Marc Gasol,Mike Conley,O.J. Mayo,Rudy Gay,Zach Randolph,Brook Lopez,Courtney Lee,Devin Harris,Jarvis Hayes,Kris Humphries,1,5:04,MEM,shot,Zach Randolph,,,,,,,,,Rudy Gay,3,,,made,,3pt,37,28
Marc Gasol,Mike Conley,O.J. Mayo,Rudy Gay,Zach Randolph,Brook Lopez,Courtney Lee,Devin Harris,Jarvis Hayes,Kris Humphries,1,4:47,NJN,shot,Devin Harris,,,,,,,,,Brook Lopez,2,,,made,,turnaround jump,28,13
Marc Gasol,Mike Conley,O.J. Mayo,Rudy Gay,Zach Randolph,Brook Lopez,Courtney Lee,Devin Harris,Jarvis Hayes,Kris Humphries,1,4:34,MEM,shot,,,,,,,,,,Marc Gasol,,,,missed,,hook,18,11
Marc Gasol,Mike Conley,O.J. Mayo,Rudy Gay,Zach Randolph,Brook Lopez,Courtney Lee,Devin Harris,Jarvis Hayes,Kris Humphries,1,4:32,MEM,rebound,,,,,,,,,,Zach Randolph,,,,,,off,,
Marc Gasol,Mike Conley,O.J. Mayo,Rudy Gay,Zach Randolph,Brook Lopez,Courtney Lee,Devin Harris,Jarvis Hayes,Kris Humphries,1,4:31,MEM,shot,,,,,,,,,,Zach Randolph,,,,missed,,tip,25,6
Marc Gasol,Mike Conley,O.J. Mayo,Rudy Gay,Zach Randolph,Brook Lopez,Courtney Lee,Devin Harris,Jarvis Hayes,Kris Humphries,1,4:30,NJN,rebound,,,,,,,,,,Kris Humphries,,,,,,def,,
Marc Gasol,Mike Conley,O.J. Mayo,Rudy Gay,Zach Randolph,Brook Lopez,Courtney Lee,Devin Harris,Jarvis Hayes,Kris Humphries,1,4:25,NJN,shot,,,,,,,,,,Devin Harris,2,,,made,,driving reverse layup,25,6
Marc Gasol,Mike Conley,O.J. Mayo,Rudy Gay,Zach Randolph,Brook Lopez,Courtney Lee,Devin Harris,Jarvis Hayes,Kris Humphries,1,4:09,MEM,shot,,,,,,,,,,Marc Gasol,,,,missed,,jump,13,20
Marc Gasol,Mike Conley,O.J. Mayo,Rudy Gay,Zach Randolph,Brook Lopez,Courtney Lee,Devin Harris,Jarvis Hayes,Kris Humphries,1,4:08,NJN,rebound,,,,,,,,,,Jarvis Hayes,,,,,,def,,
Marc Gasol,Mike Conley,O.J. Mayo,Rudy Gay,Zach Randolph,Brook Lopez,Courtney Lee,Devin Harris,Jarvis Hayes,Kris Humphries,1,4:04,MEM,foul,,,,,,,,Brook Lopez,,Zach Randolph,,,,,,personal,,
Marc Gasol,Mike Conley,O.J. Mayo,Rudy Gay,Zach Randolph,Brook Lopez,Courtney Lee,Devin Harris,Jarvis Hayes,Kris Humphries,1,4:04,NJN,timeout,,,,,,,,,,,,,,,,regular,,
Marc Gasol,Mike Conley,O.J. Mayo,Rudy Gay,Zach Randolph,Brook Lopez,Courtney Lee,Devin Harris,Jarvis Hayes,Kris Humphries,1,3:55,NJN,shot,Devin Harris,,,,,,,,,Brook Lopez,2,,,made,,alley oop dunk,25,6
Marc Gasol,Mike Conley,O.J. Mayo,Rudy Gay,Zach Randolph,Brook Lopez,Courtney Lee,Devin Harris,Jarvis Hayes,Kris Humphries,1,3:32,MEM,shot,,,,,,,,,,Mike Conley,,,,missed,,running jump,26,17
Marc Gasol,Mike Conley,O.J. Mayo,Rudy Gay,Zach Randolph,Brook Lopez,Courtney Lee,Devin Harris,Jarvis Hayes,Kris Humphries,1,3:31,NJN,rebound,,,,,,,,,,,,,,,,,,
Hasheem Thabeet,Mike Conley,O.J. Mayo,Rudy Gay,Zach Randolph,Brook Lopez,Courtney Lee,Devin Harris,Jarvis Hayes,Kris Humphries,1,3:31,MEM,sub,,,,Hasheem Thabeet,,Marc Gasol,,,,,,,,,,,,
Hasheem Thabeet,Mike Conley,Rudy Gay,Sam Young,Zach Randolph,Brook Lopez,Courtney Lee,Devin Harris,Jarvis Hayes,Kris Humphries,1,3:31,MEM,sub,,,,Sam Young,,O.J. Mayo,,,,,,,,,,,,
Hasheem Thabeet,Mike Conley,Rudy Gay,Sam Young,Zach Randolph,Brook Lopez,Courtney Lee,Devin Harris,Jarvis Hayes,Kris Humphries,1,3:21,NJN,turnover,,,,,,,,,,Kris Humphries,,,bad pass,,Mike Conley,,,
Hasheem Thabeet,Mike Conley,Rudy Gay,Sam Young,Zach Randolph,Brook Lopez,Courtney Lee,Devin Harris,Jarvis Hayes,Kris Humphries,1,3:16,MEM,turnover,,,,,,,,,,Mike Conley,,,bad pass,,Kris Humphries,,,
Hasheem Thabeet,Mike Conley,Rudy Gay,Sam Young,Zach Randolph,Brook Lopez,Courtney Lee,Devin Harris,Jarvis Hayes,Kris Humphries,1,3:11,NJN,shot,Devin Harris,,,,,,,,,Courtney Lee,2,,,made,,driving layup,25,6
Hasheem Thabeet,Mike Conley,Rudy Gay,Sam Young,Zach Randolph,Brook Lopez,Courtney Lee,Devin Harris,Jarvis Hayes,Kris Humphries,1,3:08,MEM,turnover,,,,,,,,,,Hasheem Thabeet,,,bad pass,,,,,
Hasheem Thabeet,Mike Conley,Rudy Gay,Sam Young,Zach Randolph,Brook Lopez,Courtney Lee,Devin Harris,Jarvis Hayes,Kris Humphries,1,2:51,NJN,shot,,,,,,,,,,Devin Harris,,,,missed,,3pt,41,24
Hasheem Thabeet,Mike Conley,Rudy Gay,Sam Young,Zach Randolph,Brook Lopez,Courtney Lee,Devin Harris,Jarvis Hayes,Kris Humphries,1,2:50,NJN,rebound,,,,,,,,,,Kris Humphries,,,,,,off,,
Hasheem Thabeet,Mike Conley,Rudy Gay,Sam Young,Zach Randolph,Brook Lopez,Courtney Lee,Devin Harris,Jarvis Hayes,Kris Humphries,1,2:50,MEM,foul,,,,,,,,Kris Humphries,,Zach Randolph,,,,,,personal,,
Hasheem Thabeet,Mike Conley,Rudy Gay,Sam Young,Zach Randolph,Brook Lopez,Courtney Lee,Devin Harris,Jarvis Hayes,Kris Humphries,1,2:50,MEM,timeout,,,,,,,,,,,,,,,,regular,,
Darrell Arthur,Hasheem Thabeet,Mike Conley,Rudy Gay,Sam Young,Brook Lopez,Courtney Lee,Devin Harris,Jarvis Hayes,Kris Humphries,1,2:50,MEM,sub,,,,Darrell Arthur,,Zach Randolph,,,,,,,,,,,,
Darrell Arthur,Hasheem Thabeet,Mike Conley,Rudy Gay,Sam Young,Brook Lopez,Courtney Lee,Devin Harris,Jarvis Hayes,Kris Humphries,1,2:44,MEM,foul,,,,,,,,Brook Lopez,,Hasheem Thabeet,,,,,,personal,,
Darrell Arthur,Hasheem Thabeet,Mike Conley,Rudy Gay,Sam Young,Brook Lopez,Courtney Lee,Devin Harris,Jarvis Hayes,Kris Humphries,1,2:32,MEM,foul,,,,,,,,Brook Lopez,,Hasheem Thabeet,,,,,,shooting,,
Darrell Arthur,Hasheem Thabeet,Mike Conley,Rudy Gay,Sam Young,Brook Lopez,Courtney Lee,Devin Harris,Jarvis Hayes,Kris Humphries,1,2:32,NJN,free throw,,,,,,,1,,2,Brook Lopez,,,foul,made,,,,
Darrell Arthur,Hamed Haddadi,Mike Conley,Rudy Gay,Sam Young,Brook Lopez,Courtney Lee,Devin Harris,Jarvis Hayes,Kris Humphries,1,2:32,MEM,sub,,,,Hamed Haddadi,,Hasheem Thabeet,,,,,,,,,,,,
Darrell Arthur,Hamed Haddadi,Mike Conley,Rudy Gay,Sam Young,Brook Lopez,Courtney Lee,Devin Harris,Kris Humphries,Terrence Williams,1,2:32,NJN,sub,,,,Terrence Williams,,Jarvis Hayes,,,,,,,,,,,,
Darrell Arthur,Hamed Haddadi,Mike Conley,Rudy Gay,Sam Young,Brook Lopez,Courtney Lee,Devin Harris,Kris Humphries,Terrence Williams,1,2:32,NJN,free throw,,,,,,,2,,2,Brook Lopez,,,foul,missed,,,,
Darrell Arthur,Hamed Haddadi,Mike Conley,Rudy Gay,Sam Young,Brook Lopez,Courtney Lee,Devin Harris,Kris Humphries,Terrence Williams,1,2:31,NJN,rebound,,,,,,,,,,Courtney Lee,,,,,,off,,
Darrell Arthur,Hamed Haddadi,Mike Conley,Rudy Gay,Sam Young,Brook Lopez,Courtney Lee,Devin Harris,Kris Humphries,Terrence Williams,1,2:23,NJN,shot,,,,,,,,,,Kris Humphries,,,,missed,,driving layup,25,6
Darrell Arthur,Hamed Haddadi,Mike Conley,Rudy Gay,Sam Young,Brook Lopez,Courtney Lee,Devin Harris,Kris Humphries,Terrence Williams,1,2:22,NJN,rebound,,,,,,,,,,Brook Lopez,,,,,,off,,
Darrell Arthur,Hamed Haddadi,Mike Conley,Rudy Gay,Sam Young,Brook Lopez,Courtney Lee,Devin Harris,Kris Humphries,Terrence Williams,1,2:19,NJN,shot,,,Darrell Arthur,,,,,,,Brook Lopez,,,,missed,,layup,25,6
Darrell Arthur,Hamed Haddadi,Mike Conley,Rudy Gay,Sam Young,Brook Lopez,Courtney Lee,Devin Harris,Kris Humphries,Terrence Williams,1,2:18,NJN,rebound,,,,,,,,,,,,,,,,,,
Darrell Arthur,Hamed Haddadi,Mike Conley,Rudy Gay,Sam Young,Brook Lopez,Courtney Lee,Devin Harris,Kris Humphries,Terrence Williams,1,2:09,NJN,shot,,,,,,,,,,Devin Harris,,,,missed,,3pt,18,30
Darrell Arthur,Hamed Haddadi,Mike Conley,Rudy Gay,Sam Young,Brook Lopez,Courtney Lee,Devin Harris,Kris Humphries,Terrence Williams,1,2:08,NJN,rebound,,,,,,,,,,Kris Humphries,,,,,,off,,
Darrell Arthur,Hamed Haddadi,Mike Conley,Rudy Gay,Sam Young,Brook Lopez,Courtney Lee,Devin Harris,Kris Humphries,Terrence Williams,1,1:56,NJN,turnover,,,,,,,,,,Devin Harris,,,bad pass,,,,,
Darrell Arthur,Hamed Haddadi,Mike Conley,Rudy Gay,Sam Young,Brook Lopez,Courtney Lee,Devin Harris,Kris Humphries,Terrence Williams,1,1:41,MEM,shot,,,,,,,,,,Darrell Arthur,,,,missed,,jump,26,16
Darrell Arthur,Hamed Haddadi,Mike Conley,Rudy Gay,Sam Young,Brook Lopez,Courtney Lee,Devin Harris,Kris Humphries,Terrence Williams,1,1:40,MEM,rebound,,,,,,,,,,Hamed Haddadi,,,,,,off,,
Darrell Arthur,Hamed Haddadi,Mike Conley,Rudy Gay,Sam Young,Brook Lopez,Courtney Lee,Devin Harris,Kris Humphries,Terrence Williams,1,1:39,MEM,foul,,,,,,,,Kris Humphries,,Darrell Arthur,,,,,,offensive,,
Darrell Arthur,Hamed Haddadi,Mike Conley,Rudy Gay,Sam Young,Brook Lopez,Courtney Lee,Devin Harris,Kris Humphries,Terrence Williams,1,1:39,MEM,turnover,,,,,,,,,,Darrell Arthur,,,foul,,,,,
Darrell Arthur,Hamed Haddadi,Mike Conley,Rudy Gay,Sam Young,Brook Lopez,Courtney Lee,Devin Harris,Kris Humphries,Terrence Williams,1,1:28,MEM,foul,,,,,,,,Brook Lopez,,Hamed Haddadi,,,,,,shooting,,
Darrell Arthur,Hamed Haddadi,Mike Conley,Rudy Gay,Sam Young,Brook Lopez,Courtney Lee,Keyon Dooling,Kris Humphries,Terrence Williams,1,1:28,NJN,sub,,,,Keyon Dooling,,Devin Harris,,,,,,,,,,,,
Darrell Arthur,Hamed Haddadi,Marcus Williams,Rudy Gay,Sam Young,Brook Lopez,Courtney Lee,Keyon Dooling,Kris Humphries,Terrence Williams,1,1:28,MEM,sub,,,,Marcus Williams,,Mike Conley,,,,,,,,,,,,
Darrell Arthur,Hamed Haddadi,Marcus Williams,Rudy Gay,Sam Young,Brook Lopez,Courtney Lee,Keyon Dooling,Kris Humphries,Terrence Williams,1,1:28,NJN,free throw,,,,,,,1,,2,Brook Lopez,,,foul,made,,,,
Darrell Arthur,Hamed Haddadi,Marcus Williams,Rudy Gay,Sam Young,Brook Lopez,Courtney Lee,Keyon Dooling,Kris Humphries,Terrence Williams,1,1:28,NJN,free throw,,,,,,,2,,2,Brook Lopez,,,foul,made,,,,
Darrell Arthur,Hamed Haddadi,Marcus Williams,Rudy Gay,Sam Young,Brook Lopez,Courtney Lee,Keyon Dooling,Kris Humphries,Terrence Williams,1,1:14,MEM,turnover,,,,,,,,,,Rudy Gay,,,step out of bounds turnover,,,,,
Darrell Arthur,Hamed Haddadi,Marcus Williams,Rudy Gay,Sam Young,Brook Lopez,Courtney Lee,Keyon Dooling,Kris Humphries,Terrence Williams,1,0:52,NJN,shot,Terrence Williams,,,,,,,,,Brook Lopez,2,,,made,,driving layup,25,6
Darrell Arthur,Hamed Haddadi,Marcus Williams,Rudy Gay,Sam Young,Brook Lopez,Courtney Lee,Keyon Dooling,Kris Humphries,Terrence Williams,1,0:41,MEM,shot,,,,,,,,,,Rudy Gay,2,,,made,,jump,11,20
Darrell Arthur,Hamed Haddadi,Marcus Williams,Rudy Gay,Sam Young,Brook Lopez,Courtney Lee,Keyon Dooling,Kris Humphries,Terrence Williams,1,0:32,NJN,shot,,,,,,,,,,Keyon Dooling,3,,,made,,3pt,17,29
Darrell Arthur,Hamed Haddadi,Marcus Williams,Rudy Gay,Sam Young,Brook Lopez,Courtney Lee,Keyon Dooling,Kris Humphries,Terrence Williams,1,0:32,MEM,foul,,,,,,,,Keyon Dooling,,Marcus Williams,,,,,,shooting,,
Darrell Arthur,Hamed Haddadi,Marcus Williams,Rudy Gay,Sam Young,Courtney Lee,Josh Boone,Keyon Dooling,Kris Humphries,Terrence Williams,1,0:32,NJN,sub,,,,Josh Boone,,Brook Lopez,,,,,,,,,,,,
Darrell Arthur,Hamed Haddadi,Marcus Williams,Rudy Gay,Sam Young,Courtney Lee,Josh Boone,Keyon Dooling,Kris Humphries,Terrence Williams,1,0:32,NJN,free throw,,,,,,,1,,1,Keyon Dooling,,,foul,missed,,,,
Darrell Arthur,Hamed Haddadi,Marcus Williams,Rudy Gay,Sam Young,Courtney Lee,Josh Boone,Keyon Dooling,Kris Humphries,Terrence Williams,1,0:31,NJN,rebound,,,,,,,,,,Keyon Dooling,,,,,,off,,
Darrell Arthur,Hamed Haddadi,Marcus Williams,Rudy Gay,Sam Young,Courtney Lee,Josh Boone,Keyon Dooling,Kris Humphries,Terrence Williams,1,0:07,NJN,shot,,,,,,,,,,Courtney Lee,,,,missed,,jump,36,25
Darrell Arthur,Hamed Haddadi,Marcus Williams,Rudy Gay,Sam Young,Courtney Lee,Josh Boone,Keyon Dooling,Kris Humphries,Terrence Williams,1,0:06,NJN,rebound,,,,,,,,,,,,,,,,,,
Darrell Arthur,Hamed Haddadi,Marcus Williams,Rudy Gay,Sam Young,Courtney Lee,Josh Boone,Keyon Dooling,Kris Humphries,Terrence Williams,1,0:06,NJN,turnover,,,,,,,,,,,,,shot clock turnover,,,,,
Darrell Arthur,Hamed Haddadi,Marcus Williams,Rudy Gay,Sam Young,Courtney Lee,Josh Boone,Keyon Dooling,Kris Humphries,Terrence Williams,1,0:00,MEM,shot,,,,,,,,,,Marcus Williams,,,,missed,,jump,40,10
Darrell Arthur,Hamed Haddadi,Marcus Williams,Rudy Gay,Sam Young,Courtney Lee,Josh Boone,Keyon Dooling,Kris Humphries,Terrence Williams,1,0:00,MEM,rebound,,,,,,,,,,,,,,,,,,
Hamed Haddadi,Marc Gasol,Marcus Williams,O.J. Mayo,Rudy Gay,Courtney Lee,Josh Boone,Keyon Dooling,Kris Humphries,Terrence Williams,2,11:38,NJN,shot,,,,,,,,,,Josh Boone,,,,missed,,jump,21,17
Hamed Haddadi,Marc Gasol,Marcus Williams,O.J. Mayo,Rudy Gay,Courtney Lee,Josh Boone,Keyon Dooling,Kris Humphries,Terrence Williams,2,11:37,MEM,rebound,,,,,,,,,,Rudy Gay,,,,,,def,,
Hamed Haddadi,Marc Gasol,Marcus Williams,O.J. Mayo,Rudy Gay,Courtney Lee,Josh Boone,Keyon Dooling,Kris Humphries,Terrence Williams,2,11:24,MEM,shot,,,,,,,,,,Marcus Williams,,,,missed,,3pt,36,27
Hamed Haddadi,Marc Gasol,Marcus Williams,O.J. Mayo,Rudy Gay,Courtney Lee,Josh Boone,Keyon Dooling,Kris Humphries,Terrence Williams,2,11:23,NJN,rebound,,,,,,,,,,Courtney Lee,,,,,,def,,
Hamed Haddadi,Marc Gasol,Marcus Williams,O.J. Mayo,Rudy Gay,Courtney Lee,Josh Boone,Keyon Dooling,Kris Humphries,Terrence Williams,2,11:14,NJN,shot,,,Hamed Haddadi,,,,,,,Courtney Lee,,,,missed,,driving layup,25,6
Hamed Haddadi,Marc Gasol,Marcus Williams,O.J. Mayo,Rudy Gay,Courtney Lee,Josh Boone,Keyon Dooling,Kris Humphries,Terrence Williams,2,11:12,NJN,rebound,,,,,,,,,,Josh Boone,,,,,,off,,
Hamed Haddadi,Marc Gasol,Marcus Williams,O.J. Mayo,Rudy Gay,Courtney Lee,Josh Boone,Keyon Dooling,Kris Humphries,Terrence Williams,2,11:11,NJN,shot,,,,,,,,,,Josh Boone,2,,,made,,putback layup,25,6
Hamed Haddadi,Marc Gasol,Marcus Williams,O.J. Mayo,Rudy Gay,Courtney Lee,Josh Boone,Keyon Dooling,Kris Humphries,Terrence Williams,2,10:54,MEM,shot,Hamed Haddadi,,,,,,,,,Rudy Gay,2,,,made,,dunk,25,6
Hamed Haddadi,Marc Gasol,Marcus Williams,O.J. Mayo,Rudy Gay,Courtney Lee,Josh Boone,Keyon Dooling,Kris Humphries,Terrence Williams,2,10:38,NJN,shot,,,,,,,,,,Kris Humphries,,,,missed,,jump,29,23
Hamed Haddadi,Marc Gasol,Marcus Williams,O.J. Mayo,Rudy Gay,Courtney Lee,Josh Boone,Keyon Dooling,Kris Humphries,Terrence Williams,2,10:37,MEM,rebound,,,,,,,,,,O.J. Mayo,,,,,,def,,
Hamed Haddadi,Marc Gasol,Marcus Williams,O.J. Mayo,Rudy Gay,Courtney Lee,Josh Boone,Keyon Dooling,Kris Humphries,Terrence Williams,2,10:28,MEM,shot,,,,,,,,,,O.J. Mayo,2,,,made,,jump,41,8
Hamed Haddadi,Marc Gasol,Marcus Williams,O.J. Mayo,Rudy Gay,Courtney Lee,Josh Boone,Keyon Dooling,Kris Humphries,Terrence Williams,2,10:08,NJN,shot,,,,,,,,,,Courtney Lee,,,,missed,,3pt,2,5
Hamed Haddadi,Marc Gasol,Marcus Williams,O.J. Mayo,Rudy Gay,Courtney Lee,Josh Boone,Keyon Dooling,Kris Humphries,Terrence Williams,2,10:07,MEM,rebound,,,,,,,,,,Rudy Gay,,,,,,def,,
Hamed Haddadi,Marc Gasol,Marcus Williams,O.J. Mayo,Rudy Gay,Courtney Lee,Josh Boone,Keyon Dooling,Kris Humphries,Terrence Williams,2,9:57,MEM,shot,,,,,,,,,,Rudy Gay,2,,,made,,driving finger roll layup,25,6