a1,a2,a3,a4,a5,h1,h2,h3,h4,h5,period,time,team,etype,assist,away,block,entered,home,left,num,opponent,outof,player,points,possession,reason,result,steal,type,x,y
Boris Diaw,Gerald Wallace,Nazr Mohammed,Raymond Felton,Stephen Jackson,Andrew Bogut,Brandon Jennings,Carlos Delfino,Charlie Bell,Luc Richard Mbah a Moute,1,12:00,OFF,jump ball,,Nazr Mohammed,,,Andrew Bogut,,,,,,,Brandon Jennings,,,,,,
Boris Diaw,Gerald Wallace,Nazr Mohammed,Raymond Felton,Stephen Jackson,Andrew Bogut,Brandon Jennings,Carlos Delfino,Charlie Bell,Luc Richard Mbah a Moute,1,11:38,MIL,turnover,,,,,,,,,,Andrew Bogut,,,out of bounds lost ball turnover,,,,,
Boris Diaw,Gerald Wallace,Nazr Mohammed,Raymond Felton,Stephen Jackson,Andrew Bogut,Brandon Jennings,Carlos Delfino,Charlie Bell,Luc Richard Mbah a Moute,1,11:24,CHA,shot,,,,,,,,,,Stephen Jackson,2,,,made,,jump,42,20
Boris Diaw,Gerald Wallace,Nazr Mohammed,Raymond Felton,Stephen Jackson,Andrew Bogut,Brandon Jennings,Carlos Delfino,Charlie Bell,Luc Richard Mbah a Moute,1,11:02,MIL,shot,,,,,,,,,,Luc Richard Mbah a Moute,,,,missed,,a moute hook,27,9
Boris Diaw,Gerald Wallace,Nazr Mohammed,Raymond Felton,Stephen Jackson,Andrew Bogut,Brandon Jennings,Carlos Delfino,Charlie Bell,Luc Richard Mbah a Moute,1,11:01,CHA,rebound,,,,,,,,,,Nazr Mohammed,,,,,,def,,
Boris Diaw,Gerald Wallace,Nazr Mohammed,Raymond Felton,Stephen Jackson,Andrew Bogut,Brandon Jennings,Carlos Delfino,Charlie Bell,Luc Richard Mbah a Moute,1,10:45,CHA,shot,,,,,,,,,,Stephen Jackson,2,,,made,,jump,37,17
Boris Diaw,Gerald Wallace,Nazr Mohammed,Raymond Felton,Stephen Jackson,Andrew Bogut,Brandon Jennings,Carlos Delfino,Charlie Bell,Luc Richard Mbah a Moute,1,10:20,MIL,shot,Charlie Bell,,,,,,,,,Brandon Jennings,3,,,made,,3pt,14,31
Boris Diaw,Gerald Wallace,Nazr Mohammed,Raymond Felton,Stephen Jackson,Andrew Bogut,Brandon Jennings,Carlos Delfino,Charlie Bell,Luc Richard Mbah a Moute,1,9:58,CHA,shot,,,Andrew Bogut,,,,,,,Stephen Jackson,,,,missed,,layup,25,6
Boris Diaw,Gerald Wallace,Nazr Mohammed,Raymond Felton,Stephen Jackson,Andrew Bogut,Brandon Jennings,Carlos Delfino,Charlie Bell,Luc Richard Mbah a Moute,1,9:56,MIL,rebound,,,,,,,,,,Charlie Bell,,,,,,def,,
Boris Diaw,Gerald Wallace,Nazr Mohammed,Raymond Felton,Stephen Jackson,Andrew Bogut,Brandon Jennings,Carlos Delfino,Charlie Bell,Luc Richard Mbah a Moute,1,9:44,MIL,shot,Carlos Delfino,,,,,,,,,Luc Richard Mbah a Moute,2,,,made,,a moute layup,25,6
Boris Diaw,Gerald Wallace,Nazr Mohammed,Raymond Felton,Stephen Jackson,Andrew Bogut,Brandon Jennings,Carlos Delfino,Charlie Bell,Luc Richard Mbah a Moute,1,9:20,CHA,shot,,,,,,,,,,Nazr Mohammed,,,,missed,,jump,31,17
Boris Diaw,Gerald Wallace,Nazr Mohammed,Raymond Felton,Stephen Jackson,Andrew Bogut,Brandon Jennings,Carlos Delfino,Charlie Bell,Luc Richard Mbah a Moute,1,9:19,MIL,rebound,,,,,,,,,,Andrew Bogut,,,,,,def,,
Boris Diaw,Gerald Wallace,Nazr Mohammed,Raymond Felton,Stephen Jackson,Andrew Bogut,Brandon Jennings,Carlos Delfino,Charlie Bell,Luc Richard Mbah a Moute,1,9:13,MIL,shot,,,,,,,,,,Carlos Delfino,,,,missed,,jump,44,10
Boris Diaw,Gerald Wallace,Nazr Mohammed,Raymond Felton,Stephen Jackson,Andrew Bogut,Brandon Jennings,Carlos Delfino,Charlie Bell,Luc Richard Mbah a Moute,1,9:12,CHA,rebound,,,,,,,,,,Boris Diaw,,,,,,def,,
Boris Diaw,Gerald Wallace,Nazr Mohammed,Raymond Felton,Stephen Jackson,Andrew Bogut,Brandon Jennings,Carlos Delfino,Charlie Bell,Luc Richard Mbah a Moute,1,8:56,CHA,shot,,,,,,,,,,Gerald Wallace,,,,missed,,jump,33,11
Boris Diaw,Gerald Wallace,Nazr Mohammed,Raymond Felton,Stephen Jackson,Andrew Bogut,Brandon Jennings,Carlos Delfino,Charlie Bell,Luc Richard Mbah a Moute,1,8:55,MIL,rebound,,,,,,,,,,Carlos Delfino,,,,,,def,,
Boris Diaw,Gerald Wallace,Nazr Mohammed,Raymond Felton,Stephen Jackson,Andrew Bogut,Brandon Jennings,Carlos Delfino,Charlie Bell,Luc Richard Mbah a Moute,1,8:46,MIL,turnover,,,,,,,,,,Luc Richard Mbah a Moute,,,out of bounds lost ball turnover,,,,,
Boris Diaw,Gerald Wallace,Nazr Mohammed,Raymond Felton,Stephen Jackson,Andrew Bogut,Brandon Jennings,Carlos Delfino,Charlie Bell,Luc Richard Mbah a Moute,1,8:23,CHA,shot,,,,,,,,,,Nazr Mohammed,,,,missed,,jump,17,18
Boris Diaw,Gerald Wallace,Nazr Mohammed,Raymond Felton,Stephen Jackson,Andrew Bogut,Brandon Jennings,Carlos Delfino,Charlie Bell,Luc Richard Mbah a Moute,1,8:22,MIL,rebound,,,,,,,,,,Andrew Bogut,,,,,,def,,
Boris Diaw,Gerald Wallace,Nazr Mohammed,Raymond Felton,Stephen Jackson,Andrew Bogut,Brandon Jennings,Carlos Delfino,Charlie Bell,Luc Richard Mbah a Moute,1,8:08,MIL,shot,Charlie Bell,,,,,,,,,Andrew Bogut,2,,,made,,hook,19,5
Boris Diaw,Gerald Wallace,Nazr Mohammed,Raymond Felton,Stephen Jackson,Andrew Bogut,Brandon Jennings,Carlos Delfino,Charlie Bell,Luc Richard Mbah a Moute,1,7:53,CHA,shot,,,,,,,,,,Raymond Felton,2,,,made,,jump,19,22
Boris Diaw,Gerald Wallace,Nazr Mohammed,Raymond Felton,Stephen Jackson,Andrew Bogut,Brandon Jennings,Carlos Delfino,Charlie Bell,Luc Richard Mbah a Moute,1,7:42,CHA,foul,,,,,,,,Brandon Jennings,,Nazr Mohammed,,,,,,flagrant type 1,,
Boris Diaw,Gerald Wallace,Nazr Mohammed,Raymond Felton,Stephen Jackson,Andrew Bogut,Brandon Jennings,Carlos Delfino,Charlie Bell,Luc Richard Mbah a Moute,1,7:42,MIL,free throw,,,,,,,2,,2,Brandon Jennings,,,flagrant,made,,,,
Boris Diaw,Gerald Wallace,Nazr Mohammed,Raymond Felton,Stephen Jackson,Andrew Bogut,Brandon Jennings,Carlos Delfino,Charlie Bell,Luc Richard Mbah a Moute,1,7:42,MIL,free throw,,,,,,,1,,1,Brandon Jennings,,,flagrant,made,,,,
Boris Diaw,Gerald Wallace,Nazr Mohammed,Raymond Felton,Stephen Jackson,Andrew Bogut,Brandon Jennings,Carlos Delfino,Charlie Bell,Luc Richard Mbah a Moute,1,7:32,MIL,shot,,,,,,,,,,Carlos Delfino,,,,missed,,3pt,15,31
Boris Diaw,Gerald Wallace,Nazr Mohammed,Raymond Felton,Stephen Jackson,Andrew Bogut,Brandon Jennings,Carlos Delfino,Charlie Bell,Luc Richard Mbah a Moute,1,7:31,CHA,rebound,,,,,,,,,,Boris Diaw,,,,,,def,,
Boris Diaw,Gerald Wallace,Nazr Mohammed,Raymond Felton,Stephen Jackson,Andrew Bogut,Brandon Jennings,Carlos Delfino,Charlie Bell,Luc Richard Mbah a Moute,1,7:24,CHA,turnover,,,,,,,,,,Raymond Felton,,,lost ball,,Brandon Jennings,,,
Boris Diaw,Gerald Wallace,Nazr Mohammed,Raymond Felton,Stephen Jackson,Andrew Bogut,Brandon Jennings,Carlos Delfino,Charlie Bell,Luc Richard Mbah a Moute,1,7:12,MIL,shot,,,,,,,,,,Brandon Jennings,,,,missed,,3pt,48,18
Boris Diaw,Gerald Wallace,Nazr Mohammed,Raymond Felton,Stephen Jackson,Andrew Bogut,Brandon Jennings,Carlos Delfino,Charlie Bell,Luc Richard Mbah a Moute,1,7:10,MIL,rebound,,,,,,,,,,Luc Richard Mbah a Moute,,,,,,off,,
Boris Diaw,Gerald Wallace,Nazr Mohammed,Raymond Felton,Stephen Jackson,Andrew Bogut,Brandon Jennings,Carlos Delfino,Charlie Bell,Luc Richard Mbah a Moute,1,7:10,MIL,shot,,,,,,,,,,Luc Richard Mbah a Moute,2,,,made,,a moute layup,25,6
Boris Diaw,Gerald Wallace,Nazr Mohammed,Raymond Felton,Stephen Jackson,Andrew Bogut,Brandon Jennings,Carlos Delfino,Charlie Bell,Luc Richard Mbah a Moute,1,6:53,CHA,shot,Gerald Wallace,,,,,,,,,Stephen Jackson,2,,,made,,jump,12,11
Boris Diaw,Gerald Wallace,Nazr Mohammed,Raymond Felton,Stephen Jackson,Andrew Bogut,Brandon Jennings,Carlos Delfino,Charlie Bell,Luc Richard Mbah a Moute,1,6:31,MIL,shot,,,,,,,,,,Andrew Bogut,,,,missed,,hook,32,9
Boris Diaw,Gerald Wallace,Nazr Mohammed,Raymond Felton,Stephen Jackson,Andrew Bogut,Brandon Jennings,Carlos Delfino,Charlie Bell,Luc Richard Mbah a Moute,1,6:30,CHA,rebound,,,,,,,,,,Nazr Mohammed,,,,,,def,,
Boris Diaw,Gerald Wallace,Nazr Mohammed,Raymond Felton,Stephen Jackson,Andrew Bogut,Brandon Jennings,Carlos Delfino,Charlie Bell,Luc Richard Mbah a Moute,1,6:24,CHA,shot,Raymond Felton,,,,,,,,,Boris Diaw,2,,,made,,layup,25,6
Boris Diaw,Gerald Wallace,Nazr Mohammed,Raymond Felton,Stephen Jackson,Andrew Bogut,Brandon Jennings,Carlos Delfino,Charlie Bell,Luc Richard Mbah a Moute,1,6:17,MIL,timeout,,,,,,,,,,,,,,,,regular,,
Boris Diaw,Gerald Wallace,Nazr Mohammed,Raymond Felton,Stephen Jackson,Andrew Bogut,Brandon Jennings,Carlos Delfino,John Salmons,Luc Richard Mbah a Moute,1,6:17,MIL,sub,,,,John Salmons,,Charlie Bell,,,,,,,,,,,,
Boris Diaw,Gerald Wallace,Nazr Mohammed,Raymond Felton,Stephen Jackson,Andrew Bogut,Brandon Jennings,Carlos Delfino,John Salmons,Luc Richard Mbah a Moute,1,6:08,MIL,shot,Luc Richard Mbah a Moute,,,,,,,,,Andrew Bogut,2,,,made,,hook,35,5
Boris Diaw,Gerald Wallace,Nazr Mohammed,Raymond Felton,Stephen Jackson,Andrew Bogut,Brandon Jennings,Carlos Delfino,John Salmons,Luc Richard Mbah a Moute,1,5:50,CHA,shot,,,,,,,,,,Stephen Jackson,,,,missed,,jump,10,8
Boris Diaw,Gerald Wallace,Nazr Mohammed,Raymond Felton,Stephen Jackson,Andrew Bogut,Brandon Jennings,Carlos Delfino,John Salmons,Luc Richard Mbah a Moute,1,5:49,MIL,rebound,,,,,,,,,,Andrew Bogut,,,,,,def,,
Boris Diaw,Gerald Wallace,Nazr Mohammed,Raymond Felton,Stephen Jackson,Andrew Bogut,Brandon Jennings,Carlos Delfino,John Salmons,Luc Richard Mbah a Moute,1,5:32,CHA,foul,,,,,,,,Andrew Bogut,,Nazr Mohammed,,,,,,shooting,,
Boris Diaw,Gerald Wallace,Raymond Felton,Stephen Jackson,Theo Ratliff,Andrew Bogut,Brandon Jennings,Carlos Delfino,John Salmons,Luc Richard Mbah a Moute,1,5:32,CHA,sub,,,,Theo Ratliff,,Nazr Mohammed,,,,,,,,,,,,
Boris Diaw,Gerald Wallace,Raymond Felton,Stephen Jackson,Theo Ratliff,Andrew Bogut,Brandon Jennings,Carlos Delfino,John Salmons,Luc Richard Mbah a Moute,1,5:32,MIL,free throw,,,,,,,1,,2,Andrew Bogut,,,foul,missed,,,,
Boris Diaw,Gerald Wallace,Raymond Felton,Stephen Jackson,Theo Ratliff,Andrew Bogut,Brandon Jennings,Carlos Delfino,John Salmons,Luc Richard Mbah a Moute,1,5:32,MIL,rebound,,,,,,,,,,,,,,,,,,
Boris Diaw,Gerald Wallace,Raymond Felton,Stephen Jackson,Theo Ratliff,Andrew Bogut,Brandon Jennings,Carlos Delfino,John Salmons,Luc Richard Mbah a Moute,1,5:32,MIL,free throw,,,,,,,2,,2,Andrew Bogut,,,foul,missed,,,,
Boris Diaw,Gerald Wallace,Raymond Felton,Stephen Jackson,Theo Ratliff,Andrew Bogut,Brandon Jennings,Carlos Delfino,John Salmons,Luc Richard Mbah a Moute,1,5:31,CHA,rebound,,,,,,,,,,Boris Diaw,,,,,,def,,
Boris Diaw,Gerald Wallace,Raymond Felton,Stephen Jackson,Theo Ratliff,Andrew Bogut,Brandon Jennings,Carlos Delfino,John Salmons,Luc Richard Mbah a Moute,1,5:10,CHA,shot,,,,,,,,,,Boris Diaw,,,,missed,,3pt,5,23
Boris Diaw,Gerald Wallace,Raymond Felton,Stephen Jackson,Theo Ratliff,Andrew Bogut,Brandon Jennings,Carlos Delfino,John Salmons,Luc Richard Mbah a Moute,1,5:09,MIL,rebound,,,,,,,,,,Luc Richard Mbah a Moute,,,,,,def,,
Boris Diaw,Gerald Wallace,Raymond Felton,Stephen Jackson,Theo Ratliff,Andrew Bogut,Brandon Jennings,Carlos Delfino,John Salmons,Luc Richard Mbah a Moute,1,5:04,MIL,shot,,,,,,,,,,Brandon Jennings,,,,missed,,jump,43,6
Boris Diaw,Gerald Wallace,Raymond Felton,Stephen Jackson,Theo Ratliff,Andrew Bogut,Brandon Jennings,Carlos Delfino,John Salmons,Luc Richard Mbah a Moute,1,5:03,CHA,rebound,,,,,,,,,,Raymond Felton,,,,,,def,,
Boris Diaw,Gerald Wallace,Raymond Felton,Stephen Jackson,Theo Ratliff,Andrew Bogut,Brandon Jennings,Carlos Delfino,John Salmons,Luc Richard Mbah a Moute,1,4:57,CHA,foul,,,,,,,,Andrew Bogut,,Boris Diaw,,,,,,offensive,,
Boris Diaw,Gerald Wallace,Raymond Felton,Stephen Jackson,Theo Ratliff,Andrew Bogut,Brandon Jennings,Carlos Delfino,John Salmons,Luc Richard Mbah a Moute,1,4:57,CHA,turnover,,,,,,,,,,Boris Diaw,,,foul,,,,,
Boris Diaw,Gerald Wallace,Raymond Felton,Stephen Jackson,Theo Ratliff,Andrew Bogut,Brandon Jennings,Carlos Delfino,Ersan Ilyasova,John Salmons,1,4:57,MIL,sub,,,,Ersan Ilyasova,,Luc Richard Mbah a Moute,,,,,,,,,,,,
Boris Diaw,Gerald Wallace,Raymond Felton,Stephen Jackson,Theo Ratliff,Andrew Bogut,Brandon Jennings,Carlos Delfino,Ersan Ilyasova,John Salmons,1,4:46,CHA,foul,,,,,,,,Andrew Bogut,,Theo Ratliff,,,,,,personal,,
Boris Diaw,Gerald Wallace,Raymond Felton,Stephen Jackson,Theo Ratliff,Andrew Bogut,Brandon Jennings,Carlos Delfino,Ersan Ilyasova,John Salmons,1,4:39,MIL,shot,,,,,,,,,,Brandon Jennings,2,,,made,,floating jump,33,10
Boris Diaw,Gerald Wallace,Raymond Felton,Stephen Jackson,Theo Ratliff,Andrew Bogut,Brandon Jennings,Carlos Delfino,Ersan Ilyasova,John Salmons,1,4:30,MIL,foul,,,,,,,,Boris Diaw,,Ersan Ilyasova,,,,,,personal,,
Boris Diaw,Gerald Wallace,Raymond Felton,Stephen Jackson,Theo Ratliff,Andrew Bogut,Brandon Jennings,Carlos Delfino,Ersan Ilyasova,John Salmons,1,4:17,CHA,shot,,,,,,,,,,Raymond Felton,,,,missed,,jump,10,6
Boris Diaw,Gerald Wallace,Raymond Felton,Stephen Jackson,Theo Ratliff,Andrew Bogut,Brandon Jennings,Carlos Delfino,Ersan Ilyasova,John Salmons,1,4:16,CHA,rebound,,,,,,,,,,,,,,,,,,
Boris Diaw,Gerald Wallace,Raymond Felton,Stephen Jackson,Theo Ratliff,Andrew Bogut,Brandon Jennings,Carlos Delfino,Ersan Ilyasova,John Salmons,1,4:14,CHA,timeout,,,,,,,,,,,,,,,,regular,,
Boris Diaw,Gerald Wallace,Raymond Felton,Stephen Jackson,Theo Ratliff,Andrew Bogut,Brandon Jennings,Carlos Delfino,Ersan Ilyasova,John Salmons,1,4:14,CHA,turnover,,,,,,,,,,,,,,,,,,
Boris Diaw,Gerald Wallace,Raymond Felton,Stephen Jackson,Theo Ratliff,Andrew Bogut,Brandon Jennings,Carlos Delfino,Ersan Ilyasova,John Salmons,1,3:58,MIL,shot,,,,,,,,,,John Salmons,,,,missed,,jump,33,18
Boris Diaw,Gerald Wallace,Raymond Felton,Stephen Jackson,Theo Ratliff,Andrew Bogut,Brandon Jennings,Carlos Delfino,Ersan Ilyasova,John Salmons,1,3:57,CHA,rebound,,,,,,,,,,Boris Diaw,,,,,,def,,
Boris Diaw,Gerald Wallace,Raymond Felton,Stephen Jackson,Theo Ratliff,Andrew Bogut,Brandon Jennings,Carlos Delfino,Ersan Ilyasova,John Salmons,1,3:45,CHA,shot,Raymond Felton,,,,,,,,,Gerald Wallace,2,,,made,,jump,42,6
Boris Diaw,Gerald Wallace,Raymond Felton,Stephen Jackson,Theo Ratliff,Andrew Bogut,Brandon Jennings,Carlos Delfino,Ersan Ilyasova,John Salmons,1,3:33,MIL,shot,,,,,,,,,,Brandon Jennings,2,,,made,,floating jump,32,17
Boris Diaw,Gerald Wallace,Raymond Felton,Stephen Jackson,Theo Ratliff,Andrew Bogut,Brandon Jennings,Carlos Delfino,Ersan Ilyasova,John Salmons,1,3:33,CHA,foul,,,,,,,,Brandon Jennings,,Raymond Felton,,,,,,shooting,,
Boris Diaw,Gerald Wallace,Raymond Felton,Stephen Jackson,Theo Ratliff,Andrew Bogut,Brandon Jennings,Ersan Ilyasova,Jerry Stackhouse,John Salmons,1,3:33,MIL,sub,,,,Jerry Stackhouse,,Carlos Delfino,,,,,,,,,,,,
Boris Diaw,Gerald Wallace,Raymond Felton,Stephen Jackson,Theo Ratliff,Andrew Bogut,Brandon Jennings,Ersan Ilyasova,Jerry Stackhouse,John Salmons,1,3:33,MIL,free throw,,,,,,,1,,1,Brandon Jennings,,,foul,made,,,,
Boris Diaw,Gerald Wallace,Raymond Felton,Stephen Jackson,Theo Ratliff,Andrew Bogut,Brandon Jennings,Ersan Ilyasova,Jerry Stackhouse,John Salmons,1,3:25,CHA,shot,,,Andrew Bogut,,,,,,,Raymond Felton,,,,missed,,layup,25,6
Boris Diaw,Gerald Wallace,Raymond Felton,Stephen Jackson,Theo Ratliff,Andrew Bogut,Brandon Jennings,Ersan Ilyasova,Jerry Stackhouse,John Salmons,1,3:23,MIL,rebound,,,,,,,,,,Andrew Bogut,,,,,,def,,
Boris Diaw,Gerald Wallace,Raymond Felton,Stephen Jackson,Theo Ratliff,Andrew Bogut,Brandon Jennings,Ersan Ilyasova,Jerry Stackhouse,John Salmons,1,3:18,MIL,shot,Brandon Jennings,,,,,,,,,John Salmons,3,,,made,,3pt,11,27
Boris Diaw,Gerald Wallace,Raymond Felton,Stephen Jackson,Theo Ratliff,Andrew Bogut,Brandon Jennings,Ersan Ilyasova,Jerry Stackhouse,John Salmons,1,3:02,MIL,foul,,,,,,,,Stephen Jackson,,John Salmons,,,,,,personal,,
Boris Diaw,Gerald Wallace,Raymond Felton,Stephen Jackson,Theo Ratliff,Brandon Jennings,Ersan Ilyasova,Jerry Stackhouse,John Salmons,Kurt Thomas,1,3:02,MIL,sub,,,,Kurt Thomas,,Andrew Bogut,,,,,,,,,,,,
Boris Diaw,Gerald Wallace,Raymond Felton,Stephen Jackson,Tyrus Thomas,Brandon Jennings,Ersan Ilyasova,Jerry Stackhouse,John Salmons,Kurt Thomas,1,3:02,CHA,sub,,,,Tyrus Thomas,,Theo Ratliff,,,,,,,,,,,,
Boris Diaw,Gerald Wallace,Raymond Felton,Stephen Jackson,Tyrus Thomas,Brandon Jennings,Ersan Ilyasova,Jerry Stackhouse,John Salmons,Kurt Thomas,1,2:50,CHA,shot,,,Kurt Thomas,,,,,,,Stephen Jackson,,,,missed,,layup,25,6
Boris Diaw,Gerald Wallace,Raymond Felton,Stephen Jackson,Tyrus Thomas,Brandon Jennings,Ersan Ilyasova,Jerry Stackhouse,John Salmons,Kurt Thomas,1,2:48,CHA,rebound,,,,,,,,,,Stephen Jackson,,,,,,off,,
Boris Diaw,Gerald Wallace,Raymond Felton,Stephen Jackson,Tyrus Thomas,Brandon Jennings,Ersan Ilyasova,Jerry Stackhouse,John Salmons,Kurt Thomas,1,2:46,CHA,shot,,,,,,,,,,Stephen Jackson,,,,missed,,layup,25,6
Boris Diaw,Gerald Wallace,Raymond Felton,Stephen Jackson,Tyrus Thomas,Brandon Jennings,Ersan Ilyasova,Jerry Stackhouse,John Salmons,Kurt Thomas,1,2:45,MIL,rebound,,,,,,,,,,Kurt Thomas,,,,,,def,,
Boris Diaw,Gerald Wallace,Raymond Felton,Stephen Jackson,Tyrus Thomas,Brandon Jennings,Ersan Ilyasova,Jerry Stackhouse,John Salmons,Kurt Thomas,1,2:28,MIL,shot,,,,,,,,,,Jerry Stackhouse,,,,missed,,layup,25,6
Boris Diaw,Gerald Wallace,Raymond Felton,Stephen Jackson,Tyrus Thomas,Brandon Jennings,Ersan Ilyasova,Jerry Stackhouse,John Salmons,Kurt Thomas,1,2:27,MIL,rebound,,,,,,,,,,Ersan Ilyasova,,,,,,off,,
Boris Diaw,Gerald Wallace,Raymond Felton,Stephen Jackson,Tyrus Thomas,Brandon Jennings,Ersan Ilyasova,Jerry Stackhouse,John Salmons,Kurt Thomas,1,2:27,MIL,shot,,,,,,,,,,Ersan Ilyasova,,,,missed,,tip,25,6
Boris Diaw,Gerald Wallace,Raymond Felton,Stephen Jackson,Tyrus Thomas,Brandon Jennings,Ersan Ilyasova,Jerry Stackhouse,John Salmons,Kurt Thomas,1,2:26,CHA,rebound,,,,,,,,,,Boris Diaw,,,,,,def,,
Boris Diaw,Gerald Wallace,Raymond Felton,Stephen Jackson,Tyrus Thomas,Brandon Jennings,Ersan Ilyasova,Jerry Stackhouse,John Salmons,Kurt Thomas,1,2:14,CHA,shot,,,,,,,,,,Stephen Jackson,,,,missed,,jump,27,11
Boris Diaw,Gerald Wallace,Raymond Felton,Stephen Jackson,Tyrus Thomas,Brandon Jennings,Ersan Ilyasova,Jerry Stackhouse,John Salmons,Kurt Thomas,1,2:13,MIL,rebound,,,,,,,,,,Brandon Jennings,,,,,,def,,
Boris Diaw,Gerald Wallace,Raymond Felton,Stephen Jackson,Tyrus Thomas,Brandon Jennings,Ersan Ilyasova,Jerry Stackhouse,John Salmons,Kurt Thomas,1,2:03,MIL,turnover,,,,,,,,,,Brandon Jennings,,,lost ball,,Tyrus Thomas,,,
Boris Diaw,Gerald Wallace,Raymond Felton,Stephen Jackson,Tyrus Thomas,Brandon Jennings,Ersan Ilyasova,Jerry Stackhouse,John Salmons,Kurt Thomas,1,2:01,MIL,foul,,,,,,,,Tyrus Thomas,,Kurt Thomas,,,,,,shooting,,
Boris Diaw,Gerald Wallace,Raymond Felton,Stephen Jackson,Tyrus Thomas,Brandon Jennings,Ersan Ilyasova,Jerry Stackhouse,John Salmons,Kurt Thomas,1,2:01,CHA,free throw,,,,,,,1,,2,Tyrus Thomas,,,foul,made,,,,
Boris Diaw,D.J. Augustin,Gerald Wallace,Stephen Jackson,Tyrus Thomas,Brandon Jennings,Ersan Ilyasova,Jerry Stackhouse,John Salmons,Kurt Thomas,1,2:01,CHA,sub,,,,D.J. Augustin,,Raymond Felton,,,,,,,,,,,,
Boris Diaw,D.J. Augustin,Gerald Wallace,Stephen Jackson,Tyrus Thomas,Brandon Jennings,Ersan Ilyasova,Jerry Stackhouse,John Salmons,Kurt Thomas,1,2:01,CHA,free throw,,,,,,,2,,2,Tyrus Thomas,,,foul,made,,,,
Boris Diaw,D.J. Augustin,Gerald Wallace,Stephen Jackson,Tyrus Thomas,Brandon Jennings,Ersan Ilyasova,Jerry Stackhouse,John Salmons,Kurt Thomas,1,1:43,MIL,shot,John Salmons,,,,,,,,,Jerry Stackhouse,3,,,made,,3pt,16,31
Boris Diaw,D.J. Augustin,Gerald Wallace,Stephen Jackson,Tyrus Thomas,Brandon Jennings,Ersan Ilyasova,Jerry Stackhouse,John Salmons,Kurt Thomas,1,1:21,CHA,shot,,,,,,,,,,Stephen Jackson,,,,missed,,layup,25,6
Boris Diaw,D.J. Augustin,Gerald Wallace,Stephen Jackson,Tyrus Thomas,Brandon Jennings,Ersan Ilyasova,Jerry Stackhouse,John Salmons,Kurt Thomas,1,1:20,MIL,rebound,,,,,,,,,,Brandon Jennings,,,,,,def,,
Boris Diaw,D.J. Augustin,Gerald Wallace,Stephen Jackson,Tyrus Thomas,Brandon Jennings,Ersan Ilyasova,Jerry Stackhouse,John Salmons,Kurt Thomas,1,1:15,MIL,shot,,,,,,,,,,Jerry Stackhouse,,,,missed,,3pt,9,26
Boris Diaw,D.J. Augustin,Gerald Wallace,Stephen Jackson,Tyrus Thomas,Brandon Jennings,Ersan Ilyasova,Jerry Stackhouse,John Salmons,Kurt Thomas,1,1:14,CHA,rebound,,,,,,,,,,Tyrus Thomas,,,,,,def,,
Boris Diaw,D.J. Augustin,Gerald Wallace,Stephen Jackson,Tyrus Thomas,Brandon Jennings,Ersan Ilyasova,Jerry Stackhouse,John Salmons,Kurt Thomas,1,1:06,CHA,shot,,,,,,,,,,D.J. Augustin,,,,missed,,layup,25,6
Boris Diaw,D.J. Augustin,Gerald Wallace,Stephen Jackson,Tyrus Thomas,Brandon Jennings,Ersan Ilyasova,Jerry Stackhouse,John Salmons,Kurt Thomas,1,1:05,MIL,rebound,,,,,,,,,,Jerry Stackhouse,,,,,,def,,
Boris Diaw,D.J. Augustin,Gerald Wallace,Stephen Jackson,Tyrus Thomas,Brandon Jennings,Ersan Ilyasova,Jerry Stackhouse,John Salmons,Kurt Thomas,1,0:49,MIL,shot,,,Gerald Wallace,,,,,,,Brandon Jennings,,,,missed,,layup,25,6
Boris Diaw,D.J. Augustin,Gerald Wallace,Stephen Jackson,Tyrus Thomas,Brandon Jennings,Ersan Ilyasova,Jerry Stackhouse,John Salmons,Kurt Thomas,1,0:48,CHA,rebound,,,,,,,,,,Tyrus Thomas,,,,,,def,,
Boris Diaw,D.J. Augustin,Gerald Wallace,Stephen Jackson,Tyrus Thomas,Brandon Jennings,Ersan Ilyasova,Jerry Stackhouse,John Salmons,Kurt Thomas,1,0:40,MIL,foul,,,,,,,,Gerald Wallace,,Kurt Thomas,,,,,,personal,,
Boris Diaw,D.J. Augustin,Gerald Wallace,Stephen Jackson,Tyrus Thomas,Ersan Ilyasova,Jerry Stackhouse,John Salmons,Kurt Thomas,Luke Ridnour,1,0:40,MIL,sub,,,,Luke Ridnour,,Brandon Jennings,,,,,,,,,,,,
Boris Diaw,D.J. Augustin,Gerald Wallace,Stephen Jackson,Tyrus Thomas,Ersan Ilyasova,Jerry Stackhouse,John Salmons,Kurt Thomas,Luke Ridnour,1,0:34,MIL,foul,,,,,,,,Boris Diaw,,Ersan Ilyasova,,,,,,personal,,
Boris Diaw,D.J. Augustin,Gerald Wallace,Stephen Jackson,Tyrus Thomas,Ersan Ilyasova,Jerry Stackhouse,John Salmons,Kurt Thomas,Luke Ridnour,1,0:34,CHA,free throw,,,,,,,1,,2,Boris Diaw,,,foul,missed,,,,
Boris Diaw,D.J. Augustin,Gerald Wallace,Stephen Jackson,Tyrus Thomas,Ersan Ilyasova,Jerry Stackhouse,John Salmons,Kurt Thomas,Luke Ridnour,1,0:34,CHA,rebound,,,,,,,,,,,,,,,,,,
Boris Diaw,D.J. Augustin,Gerald Wallace,Stephen Jackson,Tyrus Thomas,Jerry Stackhouse,John Salmons,Kurt Thomas,Luc Richard Mbah a Moute,Luke Ridnour,1,0:34,MIL,sub,,,,Luc Richard Mbah a Moute,,Ersan Ilyasova,,,,,,,,,,,,
Boris Diaw,D.J. Augustin,Gerald Wallace,Stephen Jackson,Tyrus Thomas,Jerry Stackhouse,John Salmons,Kurt Thomas,Luc Richard Mbah a Moute,Luke Ridnour,1,0:34,CHA,free throw,,,,,,,2,,2,Boris Diaw,,,foul,missed,,,,
Boris Diaw,D.J. Augustin,Gerald Wallace,Stephen Jackson,Tyrus Thomas,Jerry Stackhouse,John Salmons,Kurt Thomas,Luc Richard Mbah a Moute,Luke Ridnour,1,0:33,MIL,rebound,,,,,,,,,,Kurt Thomas,,,,,,def,,
Boris Diaw,D.J. Augustin,Gerald Wallace,Stephen Jackson,Tyrus Thomas,Jerry Stackhouse,John Salmons,Kurt Thomas,Luc Richard Mbah a Moute,Luke Ridnour,1,0:20,MIL,turnover,,,,,,,,,,John Salmons,,,bad pass,,D.J. Augustin,,,
Boris Diaw,D.J. Augustin,Gerald Wallace,Stephen Jackson,Tyrus Thomas,Jerry Stackhouse,John Salmons,Kurt Thomas,Luc Richard Mbah a Moute,Luke Ridnour,1,0:18,MIL,foul,,,,,,,,D.J. Augustin,,Luke Ridnour,,,,,,shooting,,
Boris Diaw,D.J. Augustin,Gerald Wallace,Stephen Jackson,Tyrus Thomas,Jerry Stackhouse,John Salmons,Kurt Thomas,Luc Richard Mbah a Moute,Luke Ridnour,1,0:18,CHA,free throw,,,,,,,1,,2,D.J. Augustin,,,foul,made,,,,
Boris Diaw,D.J. Augustin,Gerald Wallace,Stephen Graham,Tyrus Thomas,Jerry Stackhouse,John Salmons,Kurt Thomas,Luc Richard Mbah a Moute,Luke Ridnour,1,0:18,CHA,sub,,,,Stephen Graham,,Stephen Jackson,,,,,,,,,,,,
Boris Diaw,D.J. Augustin,Gerald Wallace,Stephen Graham,Tyrus Thomas,Jerry Stackhouse,John Salmons,Kurt Thomas,Luc Richard Mbah a Moute,Luke Ridnour,1,0:18,CHA,free throw,,,,,,,2,,2,D.J. Augustin,,,foul,made,,,,
Boris Diaw,D.J. Augustin,Gerald Wallace,Stephen Graham,Tyrus Thomas,Jerry Stackhouse,John Salmons,Kurt Thomas,Luc Richard Mbah a Moute,Luke Ridnour,1,0:00,MIL,shot,,,,,,,,,,John Salmons,,,,missed,,3pt,48,3
Boris Diaw,D.J. Augustin,Gerald Wallace,Stephen Graham,Tyrus Thomas,Jerry Stackhouse,John Salmons,Kurt Thomas,Luc Richard Mbah a Moute,Luke Ridnour,1,0:00,MIL,rebound,,,,,,,,,,,,,,,,,,
Boris Diaw,D.J. Augustin,Gerald Wallace,Stephen Graham,Tyrus Thomas,Andrew Bogut,Jerry Stackhouse,John Salmons,Luc Richard Mbah a Moute,Luke Ridnour,2,11:49,CHA,violation,,,,,,,,,,Tyrus Thomas,,,,,,kicked ball,,