a1,a2,a3,a4,a5,h1,h2,h3,h4,h5,period,time,team,etype,assist,away,block,entered,home,left,num,opponent,outof,player,points,possession,reason,result,steal,type,x,y
Carlos Arroyo,Daequan Cook,Jermaine O'Neal,Michael Beasley,Quentin Richardson,Marc Gasol,Mike Conley,O.J. Mayo,Rudy Gay,Zach Randolph,1,12:00,OFF,jump ball,,Jermaine O'Neal,,,Marc Gasol,,,,,,,Zach Randolph,,,,,,
Carlos Arroyo,Daequan Cook,Jermaine O'Neal,Michael Beasley,Quentin Richardson,Marc Gasol,Mike Conley,O.J. Mayo,Rudy Gay,Zach Randolph,1,11:49,MIA,foul,,,,,,,,Zach Randolph,,Michael Beasley,,,,,,personal,,
Carlos Arroyo,Daequan Cook,Jermaine O'Neal,Michael Beasley,Quentin Richardson,Marc Gasol,Mike Conley,O.J. Mayo,Rudy Gay,Zach Randolph,1,11:41,MEM,shot,,,Daequan Cook,,,,,,,O.J. Mayo,,,,missed,,jump,42,8
Carlos Arroyo,Daequan Cook,Jermaine O'Neal,Michael Beasley,Quentin Richardson,Marc Gasol,Mike Conley,O.J. Mayo,Rudy Gay,Zach Randolph,1,11:39,MIA,rebound,,,,,,,,,,Daequan Cook,,,,,,def,,
Carlos Arroyo,Daequan Cook,Jermaine O'Neal,Michael Beasley,Quentin Richardson,Marc Gasol,Mike Conley,O.J. Mayo,Rudy Gay,Zach Randolph,1,11:33,MIA,shot,,,,,,,,,,Carlos Arroyo,,,,missed,,jump,39,21
Carlos Arroyo,Daequan Cook,Jermaine O'Neal,Michael Beasley,Quentin Richardson,Marc Gasol,Mike Conley,O.J. Mayo,Rudy Gay,Zach Randolph,1,11:31,MEM,rebound,,,,,,,,,,,,,,,,,,
Carlos Arroyo,Daequan Cook,Jermaine O'Neal,Michael Beasley,Quentin Richardson,Marc Gasol,Mike Conley,O.J. Mayo,Rudy Gay,Zach Randolph,1,11:15,MEM,shot,,,,,,,,,,Rudy Gay,2,,,made,,step back jump,8,7
Carlos Arroyo,Daequan Cook,Jermaine O'Neal,Michael Beasley,Quentin Richardson,Marc Gasol,Mike Conley,O.J. Mayo,Rudy Gay,Zach Randolph,1,10:58,MIA,shot,Jermaine O'Neal,,,,,,,,,Michael Beasley,2,,,made,,jump,28,18
Carlos Arroyo,Daequan Cook,Jermaine O'Neal,Michael Beasley,Quentin Richardson,Marc Gasol,Mike Conley,O.J. Mayo,Rudy Gay,Zach Randolph,1,10:40,MEM,turnover,,,,,,,,,,Zach Randolph,,,bad pass,,Quentin Richardson,,,
Carlos Arroyo,Daequan Cook,Jermaine O'Neal,Michael Beasley,Quentin Richardson,Marc Gasol,Mike Conley,O.J. Mayo,Rudy Gay,Zach Randolph,1,10:34,MEM,foul,,,,,,,,Daequan Cook,,O.J. Mayo,,,,,,personal,,
Carlos Arroyo,Daequan Cook,Jermaine O'Neal,Michael Beasley,Quentin Richardson,Marc Gasol,Mike Conley,O.J. Mayo,Rudy Gay,Zach Randolph,1,10:25,MIA,shot,,,,,,,,,,Jermaine O'Neal,2,,,made,,driving layup,25,6
Carlos Arroyo,Daequan Cook,Jermaine O'Neal,Michael Beasley,Quentin Richardson,Marc Gasol,Mike Conley,O.J. Mayo,Rudy Gay,Zach Randolph,1,10:12,MEM,shot,,,,,,,,,,Zach Randolph,,,,missed,,jump,33,24
Carlos Arroyo,Daequan Cook,Jermaine O'Neal,Michael Beasley,Quentin Richardson,Marc Gasol,Mike Conley,O.J. Mayo,Rudy Gay,Zach Randolph,1,10:10,MIA,rebound,,,,,,,,,,Quentin Richardson,,,,,,def,,
Carlos Arroyo,Daequan Cook,Jermaine O'Neal,Michael Beasley,Quentin Richardson,Marc Gasol,Mike Conley,O.J. Mayo,Rudy Gay,Zach Randolph,1,9:57,MIA,turnover,,,,,,,,,,Jermaine O'Neal,,,3 second violation,,,,,
Carlos Arroyo,Daequan Cook,Jermaine O'Neal,Michael Beasley,Quentin Richardson,Marc Gasol,Mike Conley,O.J. Mayo,Rudy Gay,Zach Randolph,1,9:47,MEM,shot,,,,,,,,,,Rudy Gay,,,,missed,,pullup jump,19,22
Carlos Arroyo,Daequan Cook,Jermaine O'Neal,Michael Beasley,Quentin Richardson,Marc Gasol,Mike Conley,O.J. Mayo,Rudy Gay,Zach Randolph,1,9:46,MIA,rebound,,,,,,,,,,,,,,,,,,
Carlos Arroyo,Daequan Cook,Jermaine O'Neal,Michael Beasley,Quentin Richardson,Marc Gasol,Mike Conley,O.J. Mayo,Rudy Gay,Zach Randolph,1,9:30,MIA,shot,,,,,,,,,,Jermaine O'Neal,2,,,made,,running jump,35,9
Carlos Arroyo,Daequan Cook,Jermaine O'Neal,Michael Beasley,Quentin Richardson,Marc Gasol,Mike Conley,O.J. Mayo,Rudy Gay,Zach Randolph,1,9:30,MEM,foul,,,,,,,,Jermaine O'Neal,,Marc Gasol,,,,,,shooting,,
Carlos Arroyo,Daequan Cook,Jermaine O'Neal,Michael Beasley,Quentin Richardson,Marc Gasol,Mike Conley,O.J. Mayo,Rudy Gay,Zach Randolph,1,9:30,MIA,free throw,,,,,,,1,,1,Jermaine O'Neal,,,foul,made,,,,
Carlos Arroyo,Daequan Cook,Jermaine O'Neal,Michael Beasley,Quentin Richardson,Marc Gasol,Mike Conley,O.J. Mayo,Rudy Gay,Zach Randolph,1,9:09,MEM,shot,,,,,,,,,,Marc Gasol,,,,missed,,fade away jumper,19,16
Carlos Arroyo,Daequan Cook,Jermaine O'Neal,Michael Beasley,Quentin Richardson,Marc Gasol,Mike Conley,O.J. Mayo,Rudy Gay,Zach Randolph,1,9:07,MIA,rebound,,,,,,,,,,Michael Beasley,,,,,,def,,
Carlos Arroyo,Daequan Cook,Jermaine O'Neal,Michael Beasley,Quentin Richardson,Marc Gasol,Mike Conley,O.J. Mayo,Rudy Gay,Zach Randolph,1,8:58,MIA,shot,Carlos Arroyo,,,,,,,,,Daequan Cook,3,,,made,,3pt,2,5
Carlos Arroyo,Daequan Cook,Jermaine O'Neal,Michael Beasley,Quentin Richardson,Marc Gasol,Mike Conley,O.J. Mayo,Rudy Gay,Zach Randolph,1,8:52,MEM,timeout,,,,,,,,,,,,,,,,regular,,
Carlos Arroyo,Daequan Cook,Jermaine O'Neal,Michael Beasley,Quentin Richardson,Marc Gasol,Mike Conley,O.J. Mayo,Rudy Gay,Zach Randolph,1,8:38,MEM,shot,,,,,,,,,,Zach Randolph,,,,missed,,jump,31,17
Carlos Arroyo,Daequan Cook,Jermaine O'Neal,Michael Beasley,Quentin Richardson,Marc Gasol,Mike Conley,O.J. Mayo,Rudy Gay,Zach Randolph,1,8:37,MIA,rebound,,,,,,,,,,Jermaine O'Neal,,,,,,def,,
Carlos Arroyo,Daequan Cook,Jermaine O'Neal,Michael Beasley,Quentin Richardson,Marc Gasol,Mike Conley,O.J. Mayo,Rudy Gay,Zach Randolph,1,8:19,MIA,shot,,,,,,,,,,Jermaine O'Neal,,,,missed,,jump,38,13
Carlos Arroyo,Daequan Cook,Jermaine O'Neal,Michael Beasley,Quentin Richardson,Marc Gasol,Mike Conley,O.J. Mayo,Rudy Gay,Zach Randolph,1,8:18,MEM,rebound,,,,,,,,,,Rudy Gay,,,,,,def,,
Carlos Arroyo,Daequan Cook,Jermaine O'Neal,Michael Beasley,Quentin Richardson,Marc Gasol,Mike Conley,O.J. Mayo,Rudy Gay,Zach Randolph,1,8:07,MIA,foul,,,,,,,,Marc Gasol,,Jermaine O'Neal,,,,,,shooting,,
Carlos Arroyo,Daequan Cook,Jermaine O'Neal,Michael Beasley,Quentin Richardson,Marc Gasol,Mike Conley,O.J. Mayo,Rudy Gay,Zach Randolph,1,8:07,MEM,free throw,,,,,,,1,,2,Marc Gasol,,,foul,made,,,,
Carlos Arroyo,Daequan Cook,Jermaine O'Neal,Michael Beasley,Quentin Richardson,Marc Gasol,Mike Conley,O.J. Mayo,Rudy Gay,Zach Randolph,1,8:07,MEM,free throw,,,,,,,2,,2,Marc Gasol,,,foul,made,,,,
Carlos Arroyo,Daequan Cook,Jermaine O'Neal,Michael Beasley,Quentin Richardson,Marc Gasol,Mike Conley,O.J. Mayo,Rudy Gay,Zach Randolph,1,7:56,MIA,shot,,,,,,,,,,Michael Beasley,,,,missed,,jump,36,22
Carlos Arroyo,Daequan Cook,Jermaine O'Neal,Michael Beasley,Quentin Richardson,Marc Gasol,Mike Conley,O.J. Mayo,Rudy Gay,Zach Randolph,1,7:56,MIA,rebound,,,,,,,,,,Michael Beasley,,,,,,off,,
Carlos Arroyo,Daequan Cook,Jermaine O'Neal,Michael Beasley,Quentin Richardson,Marc Gasol,Mike Conley,O.J. Mayo,Rudy Gay,Zach Randolph,1,7:54,MIA,shot,,,,,,,,,,Michael Beasley,,,,missed,,jump bank,30,12
Carlos Arroyo,Daequan Cook,Jermaine O'Neal,Michael Beasley,Quentin Richardson,Marc Gasol,Mike Conley,O.J. Mayo,Rudy Gay,Zach Randolph,1,7:50,MEM,rebound,,,,,,,,,,Zach Randolph,,,,,,def,,
Carlos Arroyo,Daequan Cook,Jermaine O'Neal,Michael Beasley,Quentin Richardson,Marc Gasol,Mike Conley,O.J. Mayo,Rudy Gay,Zach Randolph,1,7:40,MIA,foul,,,,,,,,Marc Gasol,,Jermaine O'Neal,,,,,,shooting,,
Carlos Arroyo,Daequan Cook,Joel Anthony,Michael Beasley,Quentin Richardson,Marc Gasol,Mike Conley,O.J. Mayo,Rudy Gay,Zach Randolph,1,7:40,MIA,sub,,,,Joel Anthony,,Jermaine O'Neal,,,,,,,,,,,,
Carlos Arroyo,Daequan Cook,Joel Anthony,Michael Beasley,Quentin Richardson,Marc Gasol,Mike Conley,O.J. Mayo,Rudy Gay,Zach Randolph,1,7:40,MEM,free throw,,,,,,,1,,2,Marc Gasol,,,foul,made,,,,
Carlos Arroyo,Daequan Cook,Joel Anthony,Michael Beasley,Quentin Richardson,Marc Gasol,Mike Conley,O.J. Mayo,Rudy Gay,Zach Randolph,1,7:40,MEM,free throw,,,,,,,2,,2,Marc Gasol,,,foul,made,,,,
Carlos Arroyo,Daequan Cook,Joel Anthony,Michael Beasley,Quentin Richardson,Marc Gasol,Mike Conley,O.J. Mayo,Rudy Gay,Zach Randolph,1,7:23,MIA,shot,,,,,,,,,,Daequan Cook,,,,missed,,jump,44,13
Carlos Arroyo,Daequan Cook,Joel Anthony,Michael Beasley,Quentin Richardson,Marc Gasol,Mike Conley,O.J. Mayo,Rudy Gay,Zach Randolph,1,7:22,MEM,rebound,,,,,,,,,,Mike Conley,,,,,,def,,
Carlos Arroyo,Daequan Cook,Joel Anthony,Michael Beasley,Quentin Richardson,Marc Gasol,Mike Conley,O.J. Mayo,Rudy Gay,Zach Randolph,1,7:10,MEM,shot,,,,,,,,,,Marc Gasol,,,,missed,,running hook,22,13
Carlos Arroyo,Daequan Cook,Joel Anthony,Michael Beasley,Quentin Richardson,Marc Gasol,Mike Conley,O.J. Mayo,Rudy Gay,Zach Randolph,1,7:07,MIA,rebound,,,,,,,,,,Joel Anthony,,,,,,def,,
Carlos Arroyo,Daequan Cook,Joel Anthony,Michael Beasley,Quentin Richardson,Marc Gasol,Mike Conley,O.J. Mayo,Rudy Gay,Zach Randolph,1,6:55,MIA,shot,Carlos Arroyo,,,,,,,,,Michael Beasley,2,,,made,,jump,24,28
Carlos Arroyo,Daequan Cook,Joel Anthony,Michael Beasley,Quentin Richardson,Marc Gasol,Mike Conley,O.J. Mayo,Rudy Gay,Zach Randolph,1,6:34,MEM,shot,,,,,,,,,,Zach Randolph,,,,missed,,driving jump,18,12
Carlos Arroyo,Daequan Cook,Joel Anthony,Michael Beasley,Quentin Richardson,Marc Gasol,Mike Conley,O.J. Mayo,Rudy Gay,Zach Randolph,1,6:32,MIA,rebound,,,,,,,,,,Quentin Richardson,,,,,,def,,
Carlos Arroyo,Daequan Cook,Joel Anthony,Michael Beasley,Quentin Richardson,Marc Gasol,Mike Conley,O.J. Mayo,Rudy Gay,Zach Randolph,1,6:24,MIA,shot,,,,,,,,,,Quentin Richardson,,,,missed,,3pt,10,27
Carlos Arroyo,Daequan Cook,Joel Anthony,Michael Beasley,Quentin Richardson,Marc Gasol,Mike Conley,O.J. Mayo,Rudy Gay,Zach Randolph,1,6:21,MEM,rebound,,,,,,,,,,Zach Randolph,,,,,,def,,
Carlos Arroyo,Daequan Cook,Joel Anthony,Michael Beasley,Quentin Richardson,Marc Gasol,Mike Conley,O.J. Mayo,Rudy Gay,Zach Randolph,1,6:13,MEM,turnover,,,,,,,,,,Mike Conley,,,bad pass,,Michael Beasley,,,
Carlos Arroyo,Daequan Cook,Joel Anthony,Michael Beasley,Quentin Richardson,Marc Gasol,Mike Conley,O.J. Mayo,Rudy Gay,Zach Randolph,1,6:05,MIA,shot,,,,,,,,,,Daequan Cook,,,,missed,,step back jump,44,9
Carlos Arroyo,Daequan Cook,Joel Anthony,Michael Beasley,Quentin Richardson,Marc Gasol,Mike Conley,O.J. Mayo,Rudy Gay,Zach Randolph,1,6:01,MEM,rebound,,,,,,,,,,Zach Randolph,,,,,,def,,
Carlos Arroyo,Daequan Cook,Joel Anthony,Michael Beasley,Quentin Richardson,Marc Gasol,Mike Conley,O.J. Mayo,Rudy Gay,Zach Randolph,1,5:58,MEM,foul,,,,,,,,Quentin Richardson,,O.J. Mayo,,,,,,offensive,,
Carlos Arroyo,Daequan Cook,Joel Anthony,Michael Beasley,Quentin Richardson,Marc Gasol,Mike Conley,O.J. Mayo,Rudy Gay,Zach Randolph,1,5:58,MEM,turnover,,,,,,,,,,O.J. Mayo,,,foul,,,,,
Carlos Arroyo,Daequan Cook,Joel Anthony,Michael Beasley,Quentin Richardson,Marc Gasol,Mike Conley,O.J. Mayo,Rudy Gay,Zach Randolph,1,5:40,MIA,turnover,,,,,,,,,,Michael Beasley,,,lost ball,,Marc Gasol,,,
Carlos Arroyo,Daequan Cook,Joel Anthony,Michael Beasley,Quentin Richardson,Marc Gasol,Mike Conley,O.J. Mayo,Rudy Gay,Zach Randolph,1,5:38,MIA,foul,,,,,,,,Mike Conley,,Daequan Cook,,,,,,shooting,,
Carlos Arroyo,Daequan Cook,Joel Anthony,Michael Beasley,Quentin Richardson,Marc Gasol,Mike Conley,O.J. Mayo,Rudy Gay,Zach Randolph,1,5:38,MEM,free throw,,,,,,,1,,2,Mike Conley,,,foul,missed,,,,
Carlos Arroyo,Daequan Cook,Joel Anthony,Michael Beasley,Quentin Richardson,Marc Gasol,Mike Conley,O.J. Mayo,Rudy Gay,Zach Randolph,1,5:38,MEM,rebound,,,,,,,,,,,,,,,,,,
Carlos Arroyo,Daequan Cook,Joel Anthony,Michael Beasley,Quentin Richardson,Marc Gasol,Mike Conley,O.J. Mayo,Rudy Gay,Zach Randolph,1,5:38,MEM,free throw,,,,,,,2,,2,Mike Conley,,,foul,made,,,,
Carlos Arroyo,Daequan Cook,Joel Anthony,Michael Beasley,Quentin Richardson,Marc Gasol,Mike Conley,O.J. Mayo,Rudy Gay,Zach Randolph,1,5:17,MIA,shot,,,,,,,,,,Carlos Arroyo,2,,,made,,pullup jump,13,11
Carlos Arroyo,Daequan Cook,Joel Anthony,Michael Beasley,Quentin Richardson,Marc Gasol,Mike Conley,O.J. Mayo,Rudy Gay,Zach Randolph,1,5:00,MEM,shot,,,,,,,,,,O.J. Mayo,,,,missed,,3pt,35,28
Carlos Arroyo,Daequan Cook,Joel Anthony,Michael Beasley,Quentin Richardson,Marc Gasol,Mike Conley,O.J. Mayo,Rudy Gay,Zach Randolph,1,4:59,MIA,rebound,,,,,,,,,,Michael Beasley,,,,,,def,,
Carlos Arroyo,Daequan Cook,Joel Anthony,Michael Beasley,Quentin Richardson,Marc Gasol,Mike Conley,O.J. Mayo,Rudy Gay,Zach Randolph,1,4:44,MEM,foul,,,,,,,,Joel Anthony,,Rudy Gay,,,,,,shooting,,
Carlos Arroyo,Daequan Cook,Joel Anthony,Michael Beasley,Quentin Richardson,Marc Gasol,Mike Conley,O.J. Mayo,Rudy Gay,Zach Randolph,1,4:44,MIA,free throw,,,,,,,1,,2,Joel Anthony,,,foul,made,,,,
Carlos Arroyo,Daequan Cook,Joel Anthony,Michael Beasley,Quentin Richardson,Marc Gasol,Mike Conley,Ronnie Brewer,Rudy Gay,Zach Randolph,1,4:44,MEM,sub,,,,Ronnie Brewer,,O.J. Mayo,,,,,,,,,,,,
Carlos Arroyo,Daequan Cook,Joel Anthony,Michael Beasley,Quentin Richardson,Marc Gasol,Marcus Williams,Ronnie Brewer,Rudy Gay,Zach Randolph,1,4:44,MEM,sub,,,,Marcus Williams,,Mike Conley,,,,,,,,,,,,
Carlos Arroyo,Daequan Cook,Joel Anthony,Michael Beasley,Quentin Richardson,Marc Gasol,Marcus Williams,Ronnie Brewer,Rudy Gay,Zach Randolph,1,4:44,MIA,free throw,,,,,,,2,,2,Joel Anthony,,,foul,missed,,,,
Carlos Arroyo,Daequan Cook,Joel Anthony,Michael Beasley,Quentin Richardson,Marc Gasol,Marcus Williams,Ronnie Brewer,Rudy Gay,Zach Randolph,1,4:43,MEM,rebound,,,,,,,,,,Zach Randolph,,,,,,def,,
Carlos Arroyo,Daequan Cook,Joel Anthony,Michael Beasley,Quentin Richardson,Marc Gasol,Marcus Williams,Ronnie Brewer,Rudy Gay,Zach Randolph,1,4:27,MEM,shot,,,,,,,,,,Rudy Gay,,,,missed,,jump,5,12
Carlos Arroyo,Daequan Cook,Joel Anthony,Michael Beasley,Quentin Richardson,Marc Gasol,Marcus Williams,Ronnie Brewer,Rudy Gay,Zach Randolph,1,4:27,MIA,rebound,,,,,,,,,,,,,,,,,,
Carlos Arroyo,Daequan Cook,Joel Anthony,Michael Beasley,Quentin Richardson,Marc Gasol,Marcus Williams,Ronnie Brewer,Rudy Gay,Zach Randolph,1,4:27,MEM,foul,,,,,,,,Michael Beasley,,Zach Randolph,,,,,,loose ball,,
Carlos Arroyo,Daequan Cook,Joel Anthony,Michael Beasley,Quentin Richardson,Marc Gasol,Marcus Williams,Ronnie Brewer,Rudy Gay,Zach Randolph,1,4:15,MIA,shot,Carlos Arroyo,,,,,,,,,Michael Beasley,2,,,made,,layup,25,6
Carlos Arroyo,Daequan Cook,Joel Anthony,Michael Beasley,Quentin Richardson,Marc Gasol,Marcus Williams,Ronnie Brewer,Rudy Gay,Zach Randolph,1,4:06,MEM,shot,,,Daequan Cook,,,,,,,Ronnie Brewer,,,,missed,,layup,25,6
Carlos Arroyo,Daequan Cook,Joel Anthony,Michael Beasley,Quentin Richardson,Marc Gasol,Marcus Williams,Ronnie Brewer,Rudy Gay,Zach Randolph,1,4:03,MEM,rebound,,,,,,,,,,Ronnie Brewer,,,,,,off,,
Carlos Arroyo,Daequan Cook,Joel Anthony,Michael Beasley,Quentin Richardson,Marc Gasol,Marcus Williams,Ronnie Brewer,Rudy Gay,Zach Randolph,1,3:57,MEM,turnover,,,,,,,,,,Zach Randolph,,,3 second violation,,,,,
Carlos Arroyo,Daequan Cook,Joel Anthony,Michael Beasley,Quentin Richardson,Marc Gasol,Marcus Williams,Ronnie Brewer,Rudy Gay,Zach Randolph,1,3:43,MIA,shot,,,,,,,,,,Michael Beasley,2,,,made,,pullup jump,6,14
Carlos Arroyo,Daequan Cook,Joel Anthony,Michael Beasley,Quentin Richardson,Marc Gasol,Marcus Williams,Ronnie Brewer,Rudy Gay,Zach Randolph,1,3:26,MEM,shot,Zach Randolph,,,,,,,,,Ronnie Brewer,2,,,made,,layup,25,6
Carlos Arroyo,Daequan Cook,Joel Anthony,Michael Beasley,Quentin Richardson,Marc Gasol,Marcus Williams,Ronnie Brewer,Rudy Gay,Zach Randolph,1,3:08,MIA,shot,,,,,,,,,,Michael Beasley,,,,missed,,jump bank,30,9
Carlos Arroyo,Daequan Cook,Joel Anthony,Michael Beasley,Quentin Richardson,Marc Gasol,Marcus Williams,Ronnie Brewer,Rudy Gay,Zach Randolph,1,3:06,MIA,rebound,,,,,,,,,,Carlos Arroyo,,,,,,off,,
Carlos Arroyo,Daequan Cook,Joel Anthony,Michael Beasley,Quentin Richardson,Marc Gasol,Marcus Williams,Ronnie Brewer,Rudy Gay,Zach Randolph,1,3:01,MIA,shot,,,,,,,,,,Carlos Arroyo,,,,missed,,running layup,25,6
Carlos Arroyo,Daequan Cook,Joel Anthony,Michael Beasley,Quentin Richardson,Marc Gasol,Marcus Williams,Ronnie Brewer,Rudy Gay,Zach Randolph,1,3:00,MEM,rebound,,,,,,,,,,Zach Randolph,,,,,,def,,
Carlos Arroyo,Daequan Cook,Joel Anthony,Michael Beasley,Quentin Richardson,Marc Gasol,Marcus Williams,Ronnie Brewer,Rudy Gay,Zach Randolph,1,2:55,MEM,shot,Marcus Williams,,,,,,,,,Rudy Gay,2,,,made,,layup,25,6
Carlos Arroyo,Daequan Cook,Joel Anthony,Michael Beasley,Quentin Richardson,Marc Gasol,Marcus Williams,Ronnie Brewer,Rudy Gay,Zach Randolph,1,2:45,MIA,timeout,,,,,,,,,,,,,,,,regular,,
Carlos Arroyo,Daequan Cook,Joel Anthony,Michael Beasley,Quentin Richardson,Darrell Arthur,Marc Gasol,Marcus Williams,Ronnie Brewer,Rudy Gay,1,2:45,MEM,sub,,,,Darrell Arthur,,Zach Randolph,,,,,,,,,,,,
Carlos Arroyo,Daequan Cook,Dorell Wright,Joel Anthony,Michael Beasley,Darrell Arthur,Marc Gasol,Marcus Williams,Ronnie Brewer,Rudy Gay,1,2:45,MIA,sub,,,,Dorell Wright,,Quentin Richardson,,,,,,,,,,,,
Daequan Cook,Dorell Wright,Joel Anthony,Mario Chalmers,Michael Beasley,Darrell Arthur,Marc Gasol,Marcus Williams,Ronnie Brewer,Rudy Gay,1,2:45,MIA,sub,,,,Mario Chalmers,,Carlos Arroyo,,,,,,,,,,,,
Daequan Cook,Dorell Wright,Joel Anthony,Mario Chalmers,Michael Beasley,Darrell Arthur,Marc Gasol,Marcus Williams,Ronnie Brewer,Rudy Gay,1,2:36,MIA,shot,,,,,,,,,,Michael Beasley,2,,,made,,pullup bank,29,12
Daequan Cook,Dorell Wright,Joel Anthony,Mario Chalmers,Michael Beasley,Darrell Arthur,Marc Gasol,Marcus Williams,Ronnie Brewer,Rudy Gay,1,2:22,MEM,shot,,,,,,,,,,Ronnie Brewer,,,,missed,,jump,8,19
Daequan Cook,Dorell Wright,Joel Anthony,Mario Chalmers,Michael Beasley,Darrell Arthur,Marc Gasol,Marcus Williams,Ronnie Brewer,Rudy Gay,1,2:20,MIA,rebound,,,,,,,,,,Dorell Wright,,,,,,def,,
Daequan Cook,Dorell Wright,Joel Anthony,Mario Chalmers,Michael Beasley,Darrell Arthur,Marc Gasol,Marcus Williams,Ronnie Brewer,Rudy Gay,1,1:56,MIA,turnover,,,,,,,,,,Dorell Wright,,,bad pass,,Ronnie Brewer,,,
Daequan Cook,Dorell Wright,Joel Anthony,Mario Chalmers,Michael Beasley,Darrell Arthur,Marc Gasol,Marcus Williams,Ronnie Brewer,Rudy Gay,1,1:50,MEM,shot,,,,,,,,,,Marcus Williams,,,,missed,,floating jump,24,11
Daequan Cook,Dorell Wright,Joel Anthony,Mario Chalmers,Michael Beasley,Darrell Arthur,Marc Gasol,Marcus Williams,Ronnie Brewer,Rudy Gay,1,1:47,MIA,rebound,,,,,,,,,,Michael Beasley,,,,,,def,,
Daequan Cook,Dorell Wright,Joel Anthony,Mario Chalmers,Michael Beasley,Darrell Arthur,Marc Gasol,Marcus Williams,Ronnie Brewer,Rudy Gay,1,1:33,MIA,turnover,,,,,,,,,,Mario Chalmers,,,bad pass,,Marcus Williams,,,
Daequan Cook,Dorell Wright,Joel Anthony,Mario Chalmers,Michael Beasley,Darrell Arthur,Marc Gasol,Marcus Williams,Ronnie Brewer,Rudy Gay,1,1:26,MEM,shot,Marcus Williams,,,,,,,,,Rudy Gay,3,,,made,,3pt,10,26
Daequan Cook,Dorell Wright,Joel Anthony,Mario Chalmers,Michael Beasley,Darrell Arthur,Marc Gasol,Marcus Williams,Ronnie Brewer,Rudy Gay,1,1:06,MIA,shot,,,,,,,,,,Michael Beasley,,,,missed,,pullup jump,31,18
Daequan Cook,Dorell Wright,Joel Anthony,Mario Chalmers,Michael Beasley,Darrell Arthur,Marc Gasol,Marcus Williams,Ronnie Brewer,Rudy Gay,1,1:03,MEM,rebound,,,,,,,,,,Rudy Gay,,,,,,def,,
Daequan Cook,Dorell Wright,Joel Anthony,Mario Chalmers,Michael Beasley,Darrell Arthur,Marc Gasol,Marcus Williams,Ronnie Brewer,Rudy Gay,1,0:56,MEM,shot,,,Daequan Cook,,,,,,,Marcus Williams,,,,missed,,pullup jump,18,19
Daequan Cook,Dorell Wright,Joel Anthony,Mario Chalmers,Michael Beasley,Darrell Arthur,Marc Gasol,Marcus Williams,Ronnie Brewer,Rudy Gay,1,0:53,MIA,rebound,,,,,,,,,,Joel Anthony,,,,,,def,,
Daequan Cook,Dorell Wright,Joel Anthony,Mario Chalmers,Michael Beasley,Darrell Arthur,Marc Gasol,Marcus Williams,Ronnie Brewer,Rudy Gay,1,0:35,MIA,shot,,,,,,,,,,Daequan Cook,,,,missed,,3pt,12,29
Daequan Cook,Dorell Wright,Joel Anthony,Mario Chalmers,Michael Beasley,Darrell Arthur,Marc Gasol,Marcus Williams,Ronnie Brewer,Rudy Gay,1,0:33,MEM,rebound,,,,,,,,,,Darrell Arthur,,,,,,def,,
Daequan Cook,Dorell Wright,Joel Anthony,Mario Chalmers,Michael Beasley,Darrell Arthur,Marc Gasol,Marcus Williams,Ronnie Brewer,Rudy Gay,1,0:16,MEM,shot,,,,,,,,,,Rudy Gay,,,,missed,,pullup jump,33,21
Daequan Cook,Dorell Wright,Joel Anthony,Mario Chalmers,Michael Beasley,Darrell Arthur,Marc Gasol,Marcus Williams,Ronnie Brewer,Rudy Gay,1,0:15,MIA,rebound,,,,,,,,,,Daequan Cook,,,,,,def,,
Daequan Cook,Dorell Wright,Joel Anthony,Mario Chalmers,Michael Beasley,Darrell Arthur,Marc Gasol,Marcus Williams,Ronnie Brewer,Rudy Gay,1,0:00,MIA,shot,,,,,,,,,,Michael Beasley,,,,missed,,jump,45,9
Daequan Cook,Dorell Wright,Joel Anthony,Mario Chalmers,Michael Beasley,Darrell Arthur,Marc Gasol,Marcus Williams,Ronnie Brewer,Rudy Gay,1,0:00,MEM,rebound,,,,,,,,,,Rudy Gay,,,,,,def,,
Dorell Wright,James Jones,Jermaine O'Neal,Mario Chalmers,Udonis Haslem,Darrell Arthur,Marcus Williams,O.J. Mayo,Ronnie Brewer,Zach Randolph,2,11:48,MIA,turnover,,,,,,,,,,Mario Chalmers,,,traveling,,,,,
Dorell Wright,James Jones,Jermaine O'Neal,Mario Chalmers,Udonis Haslem,Darrell Arthur,Marcus Williams,O.J. Mayo,Ronnie Brewer,Zach Randolph,2,11:31,MEM,shot,,,,,,,,,,O.J. Mayo,,,,missed,,jump,11,6
Dorell Wright,James Jones,Jermaine O'Neal,Mario Chalmers,Udonis Haslem,Darrell Arthur,Marcus Williams,O.J. Mayo,Ronnie Brewer,Zach Randolph,2,11:30,MIA,rebound,,,,,,,,,,Jermaine O'Neal,,,,,,def,,
Dorell Wright,James Jones,Jermaine O'Neal,Mario Chalmers,Udonis Haslem,Darrell Arthur,Marcus Williams,O.J. Mayo,Ronnie Brewer,Zach Randolph,2,11:15,MIA,shot,,,,,,,,,,Udonis Haslem,,,,missed,,jump,30,23
Dorell Wright,James Jones,Jermaine O'Neal,Mario Chalmers,Udonis Haslem,Darrell Arthur,Marcus Williams,O.J. Mayo,Ronnie Brewer,Zach Randolph,2,11:14,MEM,rebound,,,,,,,,,,O.J. Mayo,,,,,,def,,
Dorell Wright,James Jones,Jermaine O'Neal,Mario Chalmers,Udonis Haslem,Darrell Arthur,Marcus Williams,O.J. Mayo,Ronnie Brewer,Zach Randolph,2,10:57,MIA,foul,,,,,,,,Marcus Williams,,Mario Chalmers,,,,,,shooting,,
Dorell Wright,James Jones,Jermaine O'Neal,Mario Chalmers,Udonis Haslem,Darrell Arthur,Marcus Williams,O.J. Mayo,Ronnie Brewer,Zach Randolph,2,10:57,MEM,free throw,,,,,,,1,,2,Marcus Williams,,,foul,missed,,,,
Dorell Wright,James Jones,Jermaine O'Neal,Mario Chalmers,Udonis Haslem,Darrell Arthur,Marcus Williams,O.J. Mayo,Ronnie Brewer,Zach Randolph,2,10:57,MEM,rebound,,,,,,,,,,,,,,,,,,
Dorell Wright,James Jones,Jermaine O'Neal,Mario Chalmers,Udonis Haslem,Darrell Arthur,Marcus Williams,O.J. Mayo,Ronnie Brewer,Zach Randolph,2,10:57,MEM,free throw,,,,,,,2,,2,Marcus Williams,,,foul,made,,,,
Dorell Wright,James Jones,Jermaine O'Neal,Mario Chalmers,Udonis Haslem,Darrell Arthur,Marcus Williams,O.J. Mayo,Ronnie Brewer,Zach Randolph,2,10:42,MIA,shot,Dorell Wright,,,,,,,,,Jermaine O'Neal,2,,,made,,jump,25,13
Dorell Wright,James Jones,Jermaine O'Neal,Mario Chalmers,Udonis Haslem,Darrell Arthur,Marcus Williams,O.J. Mayo,Ronnie Brewer,Zach Randolph,2,10:23,MEM,shot,,,,,,,,,,Zach Randolph,,,,missed,,running jump,26,13
Dorell Wright,James Jones,Jermaine O'Neal,Mario Chalmers,Udonis Haslem,Darrell Arthur,Marcus Williams,O.J. Mayo,Ronnie Brewer,Zach Randolph,2,10:21,MIA,rebound,,,,,,,,,,James Jones,,,,,,def,,
Dorell Wright,James Jones,Jermaine O'Neal,Mario Chalmers,Udonis Haslem,Darrell Arthur,Marcus Williams,O.J. Mayo,Ronnie Brewer,Zach Randolph,2,10:07,MEM,foul,,,,,,,,Jermaine O'Neal,,Darrell Arthur,,,,,,shooting,,
Dorell Wright,James Jones,Jermaine O'Neal,Mario Chalmers,Udonis Haslem,Darrell Arthur,Marcus Williams,O.J. Mayo,Ronnie Brewer,Zach Randolph,2,10:07,MIA,free throw,,,,,,,1,,2,Jermaine O'Neal,,,foul,made,,,,
Dorell Wright,James Jones,Jermaine O'Neal,Mario Chalmers,Udonis Haslem,Darrell Arthur,Mike Conley,O.J. Mayo,Ronnie Brewer,Zach Randolph,2,10:07,MEM,sub,,,,Mike Conley,,Marcus Williams,,,,,,,,,,,,
Dorell Wright,James Jones,Jermaine O'Neal,Mario Chalmers,Udonis Haslem,Darrell Arthur,Mike Conley,O.J. Mayo,Ronnie Brewer,Zach Randolph,2,10:07,MIA,free throw,,,,,,,2,,2,Jermaine O'Neal,,,foul,made,,,,
Dorell Wright,James Jones,Jermaine O'Neal,Mario Chalmers,Udonis Haslem,Darrell Arthur,Mike Conley,O.J. Mayo,Ronnie Brewer,Zach Randolph,2,9:54,MEM,shot,,,,,,,,,,Zach Randolph,,,,missed,,layup,25,6
Dorell Wright,James Jones,Jermaine O'Neal,Mario Chalmers,Udonis Haslem,Darrell Arthur,Mike Conley,O.J. Mayo,Ronnie Brewer,Zach Randolph,2,9:52,MIA,rebound,,,,,,,,,,Jermaine O'Neal,,,,,,def,,
Dorell Wright,James Jones,Jermaine O'Neal,Mario Chalmers,Udonis Haslem,Darrell Arthur,Mike Conley,O.J. Mayo,Ronnie Brewer,Zach Randolph,2,9:44,MEM,foul,,,,,,,,Jermaine O'Neal,,Zach Randolph,,,,,,personal,,