a1,a2,a3,a4,a5,h1,h2,h3,h4,h5,period,time,team,etype,assist,away,block,entered,home,left,num,opponent,outof,player,points,possession,reason,result,steal,type,x,y
Andris Biedrins,Anthony Morrow,Anthony Tolliver,Corey Maggette,Stephen Curry,Andrew Bynum,Derek Fisher,Pau Gasol,Ron Artest,Shannon Brown,1,12:00,OFF,jump ball,,Andris Biedrins,,,Andrew Bynum,,,,,,,Derek Fisher,,,,,,
Andris Biedrins,Anthony Morrow,Anthony Tolliver,Corey Maggette,Stephen Curry,Andrew Bynum,Derek Fisher,Pau Gasol,Ron Artest,Shannon Brown,1,11:49,LAL,shot,Ron Artest,,,,,,,,,Andrew Bynum,2,,,made,,hook,24,12
Andris Biedrins,Anthony Morrow,Anthony Tolliver,Corey Maggette,Stephen Curry,Andrew Bynum,Derek Fisher,Pau Gasol,Ron Artest,Shannon Brown,1,11:28,LAL,foul,,,,,,,,Anthony Morrow,,Pau Gasol,,,,,,shooting,,
Andris Biedrins,Anthony Morrow,Anthony Tolliver,Corey Maggette,Stephen Curry,Andrew Bynum,Derek Fisher,Pau Gasol,Ron Artest,Shannon Brown,1,11:28,GSW,free throw,,,,,,,1,,2,Anthony Morrow,,,foul,made,,,,
Andris Biedrins,Anthony Morrow,Anthony Tolliver,Corey Maggette,Stephen Curry,Andrew Bynum,Derek Fisher,Pau Gasol,Ron Artest,Shannon Brown,1,11:28,GSW,free throw,,,,,,,2,,2,Anthony Morrow,,,foul,made,,,,
Andris Biedrins,Anthony Morrow,Anthony Tolliver,Corey Maggette,Stephen Curry,Andrew Bynum,Derek Fisher,Pau Gasol,Ron Artest,Shannon Brown,1,11:04,LAL,shot,,,,,,,,,,Ron Artest,,,,missed,,3pt,6,24
Andris Biedrins,Anthony Morrow,Anthony Tolliver,Corey Maggette,Stephen Curry,Andrew Bynum,Derek Fisher,Pau Gasol,Ron Artest,Shannon Brown,1,11:04,LAL,rebound,,,,,,,,,,,,,,,,,,
Andris Biedrins,Anthony Morrow,Anthony Tolliver,Corey Maggette,Stephen Curry,Andrew Bynum,Derek Fisher,Pau Gasol,Ron Artest,Shannon Brown,1,10:59,LAL,shot,Ron Artest,,,,,,,,,Shannon Brown,2,,,made,,jump,13,20
Andris Biedrins,Anthony Morrow,Anthony Tolliver,Corey Maggette,Stephen Curry,Andrew Bynum,Derek Fisher,Pau Gasol,Ron Artest,Shannon Brown,1,10:40,GSW,shot,,,,,,,,,,Anthony Morrow,,,,missed,,3pt,13,29
Andris Biedrins,Anthony Morrow,Anthony Tolliver,Corey Maggette,Stephen Curry,Andrew Bynum,Derek Fisher,Pau Gasol,Ron Artest,Shannon Brown,1,10:39,LAL,rebound,,,,,,,,,,Derek Fisher,,,,,,def,,
Andris Biedrins,Anthony Morrow,Anthony Tolliver,Corey Maggette,Stephen Curry,Andrew Bynum,Derek Fisher,Pau Gasol,Ron Artest,Shannon Brown,1,10:33,LAL,shot,,,,,,,,,,Derek Fisher,,,,missed,,jump,33,11
Andris Biedrins,Anthony Morrow,Anthony Tolliver,Corey Maggette,Stephen Curry,Andrew Bynum,Derek Fisher,Pau Gasol,Ron Artest,Shannon Brown,1,10:31,GSW,rebound,,,,,,,,,,Stephen Curry,,,,,,def,,
Andris Biedrins,Anthony Morrow,Anthony Tolliver,Corey Maggette,Stephen Curry,Andrew Bynum,Derek Fisher,Pau Gasol,Ron Artest,Shannon Brown,1,10:23,GSW,shot,Stephen Curry,,,,,,,,,Anthony Tolliver,2,,,made,,layup,25,6
Andris Biedrins,Anthony Morrow,Anthony Tolliver,Corey Maggette,Stephen Curry,Andrew Bynum,Derek Fisher,Pau Gasol,Ron Artest,Shannon Brown,1,10:10,LAL,shot,,,,,,,,,,Pau Gasol,,,,missed,,jump,24,21
Andris Biedrins,Anthony Morrow,Anthony Tolliver,Corey Maggette,Stephen Curry,Andrew Bynum,Derek Fisher,Pau Gasol,Ron Artest,Shannon Brown,1,10:08,GSW,rebound,,,,,,,,,,Andris Biedrins,,,,,,def,,
Andris Biedrins,Anthony Morrow,Anthony Tolliver,Corey Maggette,Stephen Curry,Andrew Bynum,Derek Fisher,Pau Gasol,Ron Artest,Shannon Brown,1,10:02,GSW,shot,,,,,,,,,,Stephen Curry,,,,missed,,jump,15,25
Andris Biedrins,Anthony Morrow,Anthony Tolliver,Corey Maggette,Stephen Curry,Andrew Bynum,Derek Fisher,Pau Gasol,Ron Artest,Shannon Brown,1,9:59,LAL,rebound,,,,,,,,,,Pau Gasol,,,,,,def,,
Andris Biedrins,Anthony Morrow,Anthony Tolliver,Corey Maggette,Stephen Curry,Andrew Bynum,Derek Fisher,Pau Gasol,Ron Artest,Shannon Brown,1,9:50,GSW,foul,,,,,,,,Derek Fisher,,Stephen Curry,,,,,,shooting,,
Andris Biedrins,Anthony Morrow,Anthony Tolliver,Corey Maggette,Stephen Curry,Andrew Bynum,Derek Fisher,Pau Gasol,Ron Artest,Shannon Brown,1,9:50,LAL,free throw,,,,,,,1,,2,Derek Fisher,,,foul,made,,,,
Andris Biedrins,Anthony Morrow,Anthony Tolliver,Corey Maggette,Stephen Curry,Andrew Bynum,Derek Fisher,Pau Gasol,Ron Artest,Shannon Brown,1,9:50,LAL,free throw,,,,,,,2,,2,Derek Fisher,,,foul,made,,,,
Andris Biedrins,Anthony Morrow,Anthony Tolliver,Corey Maggette,Stephen Curry,Andrew Bynum,Derek Fisher,Pau Gasol,Ron Artest,Shannon Brown,1,9:37,GSW,turnover,,,,,,,,,,Corey Maggette,,,bad pass,,Andrew Bynum,,,
Andris Biedrins,Anthony Morrow,Anthony Tolliver,Corey Maggette,Stephen Curry,Andrew Bynum,Derek Fisher,Pau Gasol,Ron Artest,Shannon Brown,1,9:30,LAL,shot,,,,,,,,,,Ron Artest,,,,missed,,3pt,42,27
Andris Biedrins,Anthony Morrow,Anthony Tolliver,Corey Maggette,Stephen Curry,Andrew Bynum,Derek Fisher,Pau Gasol,Ron Artest,Shannon Brown,1,9:28,LAL,rebound,,,,,,,,,,Pau Gasol,,,,,,off,,
Andris Biedrins,Anthony Morrow,Anthony Tolliver,Corey Maggette,Stephen Curry,Andrew Bynum,Derek Fisher,Pau Gasol,Ron Artest,Shannon Brown,1,9:27,LAL,shot,,,,,,,,,,Pau Gasol,,,,missed,,layup,25,6
Andris Biedrins,Anthony Morrow,Anthony Tolliver,Corey Maggette,Stephen Curry,Andrew Bynum,Derek Fisher,Pau Gasol,Ron Artest,Shannon Brown,1,9:26,LAL,rebound,,,,,,,,,,Andrew Bynum,,,,,,off,,
Andris Biedrins,Anthony Morrow,Anthony Tolliver,Corey Maggette,Stephen Curry,Andrew Bynum,Derek Fisher,Pau Gasol,Ron Artest,Shannon Brown,1,9:26,LAL,shot,,,,,,,,,,Andrew Bynum,2,,,made,,slam dunk,25,6
Andris Biedrins,Anthony Morrow,Anthony Tolliver,Corey Maggette,Stephen Curry,Andrew Bynum,Derek Fisher,Pau Gasol,Ron Artest,Shannon Brown,1,9:26,GSW,foul,,,,,,,,Andrew Bynum,,Anthony Tolliver,,,,,,shooting,,
Andris Biedrins,Anthony Morrow,Anthony Tolliver,Corey Maggette,Stephen Curry,Andrew Bynum,Derek Fisher,Pau Gasol,Ron Artest,Shannon Brown,1,9:26,LAL,free throw,,,,,,,1,,1,Andrew Bynum,,,foul,made,,,,
Andris Biedrins,Anthony Morrow,Anthony Tolliver,Corey Maggette,Stephen Curry,Andrew Bynum,Derek Fisher,Pau Gasol,Ron Artest,Shannon Brown,1,9:12,GSW,shot,Stephen Curry,,,,,,,,,Anthony Tolliver,2,,,made,,jump,35,24
Andris Biedrins,Anthony Morrow,Anthony Tolliver,Corey Maggette,Stephen Curry,Andrew Bynum,Derek Fisher,Pau Gasol,Ron Artest,Shannon Brown,1,8:58,LAL,shot,Pau Gasol,,,,,,,,,Derek Fisher,2,,,made,,jump,28,25
Andris Biedrins,Anthony Morrow,Anthony Tolliver,Corey Maggette,Stephen Curry,Andrew Bynum,Derek Fisher,Pau Gasol,Ron Artest,Shannon Brown,1,8:51,LAL,foul,,,,,,,,Corey Maggette,,Shannon Brown,,,,,,shooting,,
Andris Biedrins,Anthony Morrow,Anthony Tolliver,Corey Maggette,Stephen Curry,Andrew Bynum,Derek Fisher,Pau Gasol,Ron Artest,Shannon Brown,1,8:51,GSW,free throw,,,,,,,1,,2,Corey Maggette,,,foul,made,,,,
Andris Biedrins,Anthony Morrow,Anthony Tolliver,Corey Maggette,Stephen Curry,Andrew Bynum,Derek Fisher,Pau Gasol,Ron Artest,Shannon Brown,1,8:51,GSW,free throw,,,,,,,2,,2,Corey Maggette,,,foul,made,,,,
Andris Biedrins,Anthony Morrow,Anthony Tolliver,Corey Maggette,Stephen Curry,Andrew Bynum,Derek Fisher,Pau Gasol,Ron Artest,Shannon Brown,1,8:26,LAL,shot,,,,,,,,,,Shannon Brown,,,,missed,,3pt,33,32
Andris Biedrins,Anthony Morrow,Anthony Tolliver,Corey Maggette,Stephen Curry,Andrew Bynum,Derek Fisher,Pau Gasol,Ron Artest,Shannon Brown,1,8:25,LAL,rebound,,,,,,,,,,Ron Artest,,,,,,off,,
Andris Biedrins,Anthony Morrow,Anthony Tolliver,Corey Maggette,Stephen Curry,Andrew Bynum,Derek Fisher,Pau Gasol,Ron Artest,Shannon Brown,1,8:17,GSW,foul,,,,,,,,Andrew Bynum,,Andris Biedrins,,,,,,shooting,,
Andris Biedrins,Anthony Morrow,Anthony Tolliver,Corey Maggette,Stephen Curry,Andrew Bynum,Derek Fisher,Pau Gasol,Ron Artest,Shannon Brown,1,8:17,LAL,free throw,,,,,,,1,,2,Andrew Bynum,,,foul,made,,,,
Andris Biedrins,Anthony Morrow,Anthony Tolliver,Corey Maggette,Stephen Curry,Andrew Bynum,Derek Fisher,Pau Gasol,Ron Artest,Shannon Brown,1,8:17,LAL,free throw,,,,,,,2,,2,Andrew Bynum,,,foul,missed,,,,
Andris Biedrins,Anthony Morrow,Anthony Tolliver,Corey Maggette,Stephen Curry,Andrew Bynum,Derek Fisher,Pau Gasol,Ron Artest,Shannon Brown,1,8:16,GSW,rebound,,,,,,,,,,Andris Biedrins,,,,,,def,,
Andris Biedrins,Anthony Morrow,Anthony Tolliver,Corey Maggette,Stephen Curry,Andrew Bynum,Derek Fisher,Pau Gasol,Ron Artest,Shannon Brown,1,8:09,GSW,shot,,,,,,,,,,Corey Maggette,,,,missed,,jump,15,25
Andris Biedrins,Anthony Morrow,Anthony Tolliver,Corey Maggette,Stephen Curry,Andrew Bynum,Derek Fisher,Pau Gasol,Ron Artest,Shannon Brown,1,8:08,GSW,rebound,,,,,,,,,,,,,,,,,,
Andris Biedrins,Anthony Morrow,Anthony Tolliver,Corey Maggette,Stephen Curry,Andrew Bynum,Derek Fisher,Pau Gasol,Ron Artest,Shannon Brown,1,8:01,GSW,shot,Andris Biedrins,,,,,,,,,Anthony Tolliver,2,,,made,,jump,36,22
Andris Biedrins,Anthony Morrow,Anthony Tolliver,Corey Maggette,Stephen Curry,Andrew Bynum,Derek Fisher,Pau Gasol,Ron Artest,Shannon Brown,1,7:50,GSW,foul,,,,,,,,Pau Gasol,,Anthony Tolliver,,,,,,personal,,
Andris Biedrins,Anthony Morrow,Anthony Tolliver,Corey Maggette,Stephen Curry,Andrew Bynum,Derek Fisher,Pau Gasol,Ron Artest,Shannon Brown,1,7:43,LAL,shot,,,Anthony Tolliver,,,,,,,Pau Gasol,,,,missed,,layup,25,6
Andris Biedrins,Anthony Morrow,Anthony Tolliver,Corey Maggette,Stephen Curry,Andrew Bynum,Derek Fisher,Pau Gasol,Ron Artest,Shannon Brown,1,7:42,GSW,rebound,,,,,,,,,,Corey Maggette,,,,,,def,,
Andris Biedrins,Anthony Morrow,Anthony Tolliver,Corey Maggette,Stephen Curry,Andrew Bynum,Derek Fisher,Pau Gasol,Ron Artest,Shannon Brown,1,7:33,GSW,shot,Corey Maggette,,,,,,,,,Anthony Tolliver,3,,,made,,3pt,48,13
Andris Biedrins,Anthony Morrow,Anthony Tolliver,Corey Maggette,Stephen Curry,Andrew Bynum,Derek Fisher,Pau Gasol,Ron Artest,Shannon Brown,1,7:21,LAL,shot,Ron Artest,,,,,,,,,Andrew Bynum,2,,,made,,turnaround jump,27,11
Andris Biedrins,Anthony Morrow,Anthony Tolliver,Corey Maggette,Stephen Curry,Andrew Bynum,Derek Fisher,Pau Gasol,Ron Artest,Shannon Brown,1,7:13,LAL,foul,,,,,,,,Corey Maggette,,Andrew Bynum,,,,,,shooting,,
Andris Biedrins,Anthony Morrow,Anthony Tolliver,Corey Maggette,Stephen Curry,Andrew Bynum,Derek Fisher,Pau Gasol,Ron Artest,Shannon Brown,1,7:13,GSW,free throw,,,,,,,1,,2,Corey Maggette,,,foul,made,,,,
Anthony Morrow,Anthony Tolliver,Corey Maggette,Ronny Turiaf,Stephen Curry,Andrew Bynum,Derek Fisher,Pau Gasol,Ron Artest,Shannon Brown,1,7:13,GSW,sub,,,,Ronny Turiaf,,Andris Biedrins,,,,,,,,,,,,
Anthony Morrow,Anthony Tolliver,Corey Maggette,Ronny Turiaf,Stephen Curry,Andrew Bynum,Derek Fisher,Pau Gasol,Ron Artest,Shannon Brown,1,7:13,GSW,free throw,,,,,,,2,,2,Corey Maggette,,,foul,made,,,,
Anthony Morrow,Anthony Tolliver,Corey Maggette,Ronny Turiaf,Stephen Curry,Andrew Bynum,Derek Fisher,Pau Gasol,Ron Artest,Shannon Brown,1,7:04,LAL,shot,Ron Artest,,,,,,,,,Andrew Bynum,2,,,made,,alley oop dunk,25,6
Anthony Morrow,Anthony Tolliver,Corey Maggette,Ronny Turiaf,Stephen Curry,Andrew Bynum,Derek Fisher,Pau Gasol,Ron Artest,Shannon Brown,1,6:54,GSW,shot,,,,,,,,,,Corey Maggette,2,,,made,,layup,25,6
Anthony Morrow,Anthony Tolliver,Corey Maggette,Ronny Turiaf,Stephen Curry,Andrew Bynum,Derek Fisher,Pau Gasol,Ron Artest,Shannon Brown,1,6:32,LAL,shot,,,,,,,,,,Pau Gasol,,,,missed,,running hook,24,13
Anthony Morrow,Anthony Tolliver,Corey Maggette,Ronny Turiaf,Stephen Curry,Andrew Bynum,Derek Fisher,Pau Gasol,Ron Artest,Shannon Brown,1,6:31,GSW,rebound,,,,,,,,,,Ronny Turiaf,,,,,,def,,
Anthony Morrow,Anthony Tolliver,Corey Maggette,Ronny Turiaf,Stephen Curry,Andrew Bynum,Derek Fisher,Pau Gasol,Ron Artest,Shannon Brown,1,6:21,GSW,shot,Corey Maggette,,,,,,,,,Anthony Morrow,3,,,made,,3pt,1,10
Anthony Morrow,Anthony Tolliver,Corey Maggette,Ronny Turiaf,Stephen Curry,Andrew Bynum,Derek Fisher,Pau Gasol,Ron Artest,Shannon Brown,1,6:06,LAL,shot,,,,,,,,,,Ron Artest,,,,missed,,3pt,41,27
Anthony Morrow,Anthony Tolliver,Corey Maggette,Ronny Turiaf,Stephen Curry,Andrew Bynum,Derek Fisher,Pau Gasol,Ron Artest,Shannon Brown,1,6:05,GSW,rebound,,,,,,,,,,Stephen Curry,,,,,,def,,
Anthony Morrow,Anthony Tolliver,Corey Maggette,Ronny Turiaf,Stephen Curry,Andrew Bynum,Derek Fisher,Pau Gasol,Ron Artest,Shannon Brown,1,5:54,GSW,turnover,,,,,,,,,,Anthony Morrow,,,lost ball,,Shannon Brown,,,
Anthony Morrow,Anthony Tolliver,Corey Maggette,Ronny Turiaf,Stephen Curry,Andrew Bynum,Derek Fisher,Pau Gasol,Ron Artest,Shannon Brown,1,5:51,LAL,shot,,,,,,,,,,Shannon Brown,2,,,made,,driving dunk,25,6
Anthony Morrow,Anthony Tolliver,Corey Maggette,Ronny Turiaf,Stephen Curry,Andrew Bynum,Derek Fisher,Pau Gasol,Ron Artest,Shannon Brown,1,5:41,GSW,shot,,,,,,,,,,Anthony Tolliver,,,,missed,,jump,15,26
Anthony Morrow,Anthony Tolliver,Corey Maggette,Ronny Turiaf,Stephen Curry,Andrew Bynum,Derek Fisher,Pau Gasol,Ron Artest,Shannon Brown,1,5:39,LAL,rebound,,,,,,,,,,Shannon Brown,,,,,,def,,
Anthony Morrow,Anthony Tolliver,Corey Maggette,Ronny Turiaf,Stephen Curry,Andrew Bynum,Derek Fisher,Pau Gasol,Ron Artest,Shannon Brown,1,5:34,LAL,shot,,,,,,,,,,Shannon Brown,2,,,made,,jump,35,27
Anthony Morrow,Anthony Tolliver,Corey Maggette,Ronny Turiaf,Stephen Curry,Andrew Bynum,Derek Fisher,Pau Gasol,Ron Artest,Shannon Brown,1,5:12,GSW,shot,,,,,,,,,,Stephen Curry,,,,missed,,layup,25,6
Anthony Morrow,Anthony Tolliver,Corey Maggette,Ronny Turiaf,Stephen Curry,Andrew Bynum,Derek Fisher,Pau Gasol,Ron Artest,Shannon Brown,1,5:10,LAL,rebound,,,,,,,,,,Andrew Bynum,,,,,,def,,
Anthony Morrow,Anthony Tolliver,Corey Maggette,Ronny Turiaf,Stephen Curry,Andrew Bynum,Derek Fisher,Pau Gasol,Ron Artest,Shannon Brown,1,4:57,LAL,shot,,,,,,,,,,Pau Gasol,2,,,made,,layup,25,6
Anthony Morrow,Anthony Tolliver,Corey Maggette,Ronny Turiaf,Stephen Curry,Andrew Bynum,Derek Fisher,Pau Gasol,Ron Artest,Shannon Brown,1,4:45,GSW,shot,,,,,,,,,,Stephen Curry,,,,missed,,layup,25,6
Anthony Morrow,Anthony Tolliver,Corey Maggette,Ronny Turiaf,Stephen Curry,Andrew Bynum,Derek Fisher,Pau Gasol,Ron Artest,Shannon Brown,1,4:44,LAL,rebound,,,,,,,,,,Pau Gasol,,,,,,def,,
Anthony Morrow,Anthony Tolliver,Corey Maggette,Ronny Turiaf,Stephen Curry,Andrew Bynum,Derek Fisher,Pau Gasol,Ron Artest,Shannon Brown,1,4:38,LAL,shot,Derek Fisher,,,,,,,,,Shannon Brown,2,,,made,,jump,46,6
Anthony Morrow,Anthony Tolliver,Corey Maggette,Ronny Turiaf,Stephen Curry,Andrew Bynum,Derek Fisher,Pau Gasol,Ron Artest,Shannon Brown,1,4:30,GSW,timeout,,,,,,,,,,,,,,,,regular,,
Anthony Morrow,Anthony Tolliver,Corey Maggette,Ronny Turiaf,Stephen Curry,Derek Fisher,Lamar Odom,Pau Gasol,Ron Artest,Shannon Brown,1,4:30,LAL,sub,,,,Lamar Odom,,Andrew Bynum,,,,,,,,,,,,
Anthony Morrow,Anthony Tolliver,Corey Maggette,Ronny Turiaf,Stephen Curry,Derek Fisher,Lamar Odom,Pau Gasol,Ron Artest,Shannon Brown,1,4:17,GSW,shot,,,Shannon Brown,,,,,,,Ronny Turiaf,,,,missed,,layup,25,6
Anthony Morrow,Anthony Tolliver,Corey Maggette,Ronny Turiaf,Stephen Curry,Derek Fisher,Lamar Odom,Pau Gasol,Ron Artest,Shannon Brown,1,4:15,LAL,rebound,,,,,,,,,,Shannon Brown,,,,,,def,,
Anthony Morrow,Anthony Tolliver,Corey Maggette,Ronny Turiaf,Stephen Curry,Derek Fisher,Lamar Odom,Pau Gasol,Ron Artest,Shannon Brown,1,4:04,LAL,shot,Pau Gasol,,,,,,,,,Derek Fisher,2,,,made,,jump,5,7
Anthony Morrow,Anthony Tolliver,Corey Maggette,Ronny Turiaf,Stephen Curry,Derek Fisher,Lamar Odom,Pau Gasol,Ron Artest,Shannon Brown,1,3:42,GSW,shot,,,,,,,,,,Anthony Morrow,2,,,made,,turnaround jump,15,10
Anthony Morrow,Anthony Tolliver,Corey Maggette,Ronny Turiaf,Stephen Curry,Derek Fisher,Lamar Odom,Pau Gasol,Ron Artest,Shannon Brown,1,3:24,LAL,shot,,,,,,,,,,Ron Artest,,,,missed,,fade away jumper,21,17
Anthony Morrow,Anthony Tolliver,Corey Maggette,Ronny Turiaf,Stephen Curry,Derek Fisher,Lamar Odom,Pau Gasol,Ron Artest,Shannon Brown,1,3:21,GSW,rebound,,,,,,,,,,Ronny Turiaf,,,,,,def,,
Anthony Morrow,Anthony Tolliver,Corey Maggette,Ronny Turiaf,Stephen Curry,Derek Fisher,Lamar Odom,Pau Gasol,Ron Artest,Shannon Brown,1,3:16,GSW,turnover,,,,,,,,,,Corey Maggette,,,out of bounds lost ball turnover,,,,,
Anthony Morrow,Anthony Tolliver,Corey Maggette,Ronny Turiaf,Stephen Curry,Derek Fisher,Lamar Odom,Pau Gasol,Ron Artest,Shannon Brown,1,3:00,LAL,shot,Derek Fisher,,,,,,,,,Lamar Odom,3,,,made,,3pt,37,28
Anthony Morrow,Anthony Tolliver,Corey Maggette,Ronny Turiaf,Stephen Curry,Derek Fisher,Lamar Odom,Pau Gasol,Ron Artest,Shannon Brown,1,2:52,GSW,turnover,,,,,,,,,,Stephen Curry,,,bad pass,,Ron Artest,,,
Anthony Morrow,Anthony Tolliver,Corey Maggette,Ronny Turiaf,Stephen Curry,Derek Fisher,Lamar Odom,Pau Gasol,Ron Artest,Shannon Brown,1,2:50,GSW,foul,,,,,,,,Derek Fisher,,Stephen Curry,,,,,,shooting,,
Anthony Morrow,Anthony Tolliver,Corey Maggette,Ronny Turiaf,Stephen Curry,Derek Fisher,Lamar Odom,Pau Gasol,Ron Artest,Shannon Brown,1,2:50,LAL,timeout,,,,,,,,,,,,,,,,regular,,
Anthony Morrow,Anthony Tolliver,C.J. Watson,Corey Maggette,Ronny Turiaf,Derek Fisher,Lamar Odom,Pau Gasol,Ron Artest,Shannon Brown,1,2:50,GSW,sub,,,,C.J. Watson,,Stephen Curry,,,,,,,,,,,,
Anthony Morrow,Anthony Tolliver,C.J. Watson,Corey Maggette,Ronny Turiaf,Andrew Bynum,Derek Fisher,Lamar Odom,Pau Gasol,Shannon Brown,1,2:50,LAL,sub,,,,Andrew Bynum,,Ron Artest,,,,,,,,,,,,
Anthony Morrow,Anthony Tolliver,C.J. Watson,Corey Maggette,Ronny Turiaf,Andrew Bynum,Derek Fisher,Lamar Odom,Pau Gasol,Shannon Brown,1,2:50,LAL,free throw,,,,,,,1,,2,Derek Fisher,,,foul,made,,,,
Anthony Morrow,Anthony Tolliver,C.J. Watson,Corey Maggette,Ronny Turiaf,Andrew Bynum,Derek Fisher,Lamar Odom,Pau Gasol,Shannon Brown,1,2:50,LAL,free throw,,,,,,,2,,2,Derek Fisher,,,foul,made,,,,
Anthony Morrow,Anthony Tolliver,C.J. Watson,Corey Maggette,Ronny Turiaf,Andrew Bynum,Derek Fisher,Lamar Odom,Pau Gasol,Shannon Brown,1,2:35,GSW,shot,,,,,,,,,,Anthony Tolliver,,,,missed,,jump,43,7
Anthony Morrow,Anthony Tolliver,C.J. Watson,Corey Maggette,Ronny Turiaf,Andrew Bynum,Derek Fisher,Lamar Odom,Pau Gasol,Shannon Brown,1,2:34,LAL,rebound,,,,,,,,,,Derek Fisher,,,,,,def,,
Anthony Morrow,Anthony Tolliver,C.J. Watson,Corey Maggette,Ronny Turiaf,Andrew Bynum,Derek Fisher,Lamar Odom,Pau Gasol,Shannon Brown,1,2:28,LAL,turnover,,,,,,,,,,Derek Fisher,,,bad pass,,,,,
Anthony Morrow,Anthony Tolliver,C.J. Watson,Corey Maggette,Ronny Turiaf,Andrew Bynum,Jordan Farmar,Lamar Odom,Pau Gasol,Shannon Brown,1,2:28,LAL,sub,,,,Jordan Farmar,,Derek Fisher,,,,,,,,,,,,
Anthony Morrow,Anthony Tolliver,C.J. Watson,Corey Maggette,Ronny Turiaf,Andrew Bynum,Jordan Farmar,Lamar Odom,Pau Gasol,Shannon Brown,1,2:15,GSW,shot,,,,,,,,,,C.J. Watson,,,,missed,,jump,14,18
Anthony Morrow,Anthony Tolliver,C.J. Watson,Corey Maggette,Ronny Turiaf,Andrew Bynum,Jordan Farmar,Lamar Odom,Pau Gasol,Shannon Brown,1,2:14,GSW,rebound,,,,,,,,,,,,,,,,,,
Anthony Morrow,Anthony Tolliver,C.J. Watson,Corey Maggette,Ronny Turiaf,Andrew Bynum,Jordan Farmar,Lamar Odom,Pau Gasol,Shannon Brown,1,2:14,LAL,foul,,,,,,,,Ronny Turiaf,,Lamar Odom,,,,,,loose ball,,
Anthony Morrow,Anthony Tolliver,C.J. Watson,Corey Maggette,Ronny Turiaf,Andrew Bynum,Jordan Farmar,Lamar Odom,Pau Gasol,Shannon Brown,1,2:06,GSW,shot,,,,,,,,,,C.J. Watson,,,,missed,,jump,20,26
Anthony Morrow,Anthony Tolliver,C.J. Watson,Corey Maggette,Ronny Turiaf,Andrew Bynum,Jordan Farmar,Lamar Odom,Pau Gasol,Shannon Brown,1,2:05,LAL,rebound,,,,,,,,,,Shannon Brown,,,,,,def,,
Anthony Morrow,Anthony Tolliver,C.J. Watson,Corey Maggette,Ronny Turiaf,Andrew Bynum,Jordan Farmar,Lamar Odom,Pau Gasol,Shannon Brown,1,1:57,LAL,shot,Shannon Brown,,,,,,,,,Lamar Odom,2,,,made,,layup,25,6
Anthony Morrow,Anthony Tolliver,C.J. Watson,Corey Maggette,Ronny Turiaf,Andrew Bynum,Jordan Farmar,Lamar Odom,Pau Gasol,Shannon Brown,1,1:38,GSW,shot,Ronny Turiaf,,,,,,,,,C.J. Watson,2,,,made,,driving layup,25,6
Anthony Morrow,Anthony Tolliver,C.J. Watson,Corey Maggette,Ronny Turiaf,Andrew Bynum,Jordan Farmar,Lamar Odom,Pau Gasol,Shannon Brown,1,1:20,LAL,turnover,,,,,,,,,,Andrew Bynum,,,traveling,,,,,
Anthony Morrow,Anthony Tolliver,C.J. Watson,Devean George,Ronny Turiaf,Andrew Bynum,Jordan Farmar,Lamar Odom,Pau Gasol,Shannon Brown,1,1:20,GSW,sub,,,,Devean George,,Corey Maggette,,,,,,,,,,,,
Anthony Morrow,Anthony Tolliver,C.J. Watson,Devean George,Ronny Turiaf,Andrew Bynum,Jordan Farmar,Lamar Odom,Pau Gasol,Shannon Brown,1,1:04,GSW,shot,,,,,,,,,,Ronny Turiaf,,,,missed,,jump,36,17
Anthony Morrow,Anthony Tolliver,C.J. Watson,Devean George,Ronny Turiaf,Andrew Bynum,Jordan Farmar,Lamar Odom,Pau Gasol,Shannon Brown,1,1:02,GSW,rebound,,,,,,,,,,Devean George,,,,,,off,,
Anthony Morrow,Anthony Tolliver,C.J. Watson,Devean George,Ronny Turiaf,Andrew Bynum,Jordan Farmar,Lamar Odom,Pau Gasol,Shannon Brown,1,0:57,GSW,shot,,,,,,,,,,Anthony Tolliver,,,,missed,,jump,5,8
Anthony Morrow,Anthony Tolliver,C.J. Watson,Devean George,Ronny Turiaf,Andrew Bynum,Jordan Farmar,Lamar Odom,Pau Gasol,Shannon Brown,1,0:56,LAL,rebound,,,,,,,,,,Pau Gasol,,,,,,def,,
Anthony Morrow,Anthony Tolliver,C.J. Watson,Devean George,Ronny Turiaf,Andrew Bynum,Jordan Farmar,Lamar Odom,Pau Gasol,Shannon Brown,1,0:48,LAL,shot,,,,,,,,,,Shannon Brown,2,,,made,,driving layup,25,6
Anthony Morrow,Anthony Tolliver,C.J. Watson,Devean George,Ronny Turiaf,Andrew Bynum,Jordan Farmar,Lamar Odom,Pau Gasol,Shannon Brown,1,0:27,GSW,turnover,,,,,,,,,,Devean George,,,lost ball,,Andrew Bynum,,,
Anthony Morrow,Anthony Tolliver,C.J. Watson,Devean George,Ronny Turiaf,Andrew Bynum,Jordan Farmar,Lamar Odom,Pau Gasol,Shannon Brown,1,0:07,LAL,shot,,,,,,,,,,Shannon Brown,,,,missed,,3pt,48,6
Anthony Morrow,Anthony Tolliver,C.J. Watson,Devean George,Ronny Turiaf,Andrew Bynum,Jordan Farmar,Lamar Odom,Pau Gasol,Shannon Brown,1,0:06,LAL,rebound,,,,,,,,,,Andrew Bynum,,,,,,off,,
Anthony Morrow,Anthony Tolliver,C.J. Watson,Devean George,Ronny Turiaf,Andrew Bynum,Jordan Farmar,Lamar Odom,Pau Gasol,Shannon Brown,1,0:06,GSW,foul,,,,,,,,Andrew Bynum,,C.J. Watson,,,,,,shooting,,
Anthony Morrow,Anthony Tolliver,C.J. Watson,Devean George,Ronny Turiaf,Andrew Bynum,Jordan Farmar,Lamar Odom,Pau Gasol,Shannon Brown,1,0:06,LAL,free throw,,,,,,,1,,2,Andrew Bynum,,,foul,made,,,,
Anthony Morrow,Anthony Tolliver,C.J. Watson,Devean George,Ronny Turiaf,Andrew Bynum,Jordan Farmar,Lamar Odom,Sasha Vujacic,Shannon Brown,1,0:06,LAL,sub,,,,Sasha Vujacic,,Pau Gasol,,,,,,,,,,,,
Andris Biedrins,Anthony Morrow,C.J. Watson,Devean George,Ronny Turiaf,Andrew Bynum,Jordan Farmar,Lamar Odom,Sasha Vujacic,Shannon Brown,1,0:06,GSW,sub,,,,Andris Biedrins,,Anthony Tolliver,,,,,,,,,,,,
Andris Biedrins,Anthony Morrow,C.J. Watson,Devean George,Ronny Turiaf,Andrew Bynum,Jordan Farmar,Lamar Odom,Sasha Vujacic,Shannon Brown,1,0:06,LAL,free throw,,,,,,,2,,2,Andrew Bynum,,,foul,missed,,,,
Andris Biedrins,Anthony Morrow,C.J. Watson,Devean George,Ronny Turiaf,Andrew Bynum,Jordan Farmar,Lamar Odom,Sasha Vujacic,Shannon Brown,1,0:05,GSW,rebound,,,,,,,,,,Ronny Turiaf,,,,,,def,,
Andris Biedrins,Anthony Morrow,C.J. Watson,Devean George,Ronny Turiaf,Andrew Bynum,Jordan Farmar,Lamar Odom,Sasha Vujacic,Shannon Brown,1,0:01,GSW,shot,,,,,,,,,,C.J. Watson,,,,missed,,3pt,40,26
Andris Biedrins,Anthony Morrow,C.J. Watson,Devean George,Ronny Turiaf,Andrew Bynum,Jordan Farmar,Lamar Odom,Sasha Vujacic,Shannon Brown,1,0:00,GSW,rebound,,,,,,,,,,,,,,,,,,
Andris Biedrins,Anthony Tolliver,C.J. Watson,Devean George,Stephen Curry,Adam Morrison,Andrew Bynum,Jordan Farmar,Lamar Odom,Sasha Vujacic,2,11:38,GSW,turnover,,,,,,,,,,Anthony Tolliver,,,bad pass,,,,,
Andris Biedrins,Anthony Tolliver,C.J. Watson,Devean George,Stephen Curry,Adam Morrison,Andrew Bynum,Jordan Farmar,Lamar Odom,Sasha Vujacic,2,11:14,LAL,shot,,,,,,,,,,Adam Morrison,,,,missed,,jump,33,5
Andris Biedrins,Anthony Tolliver,C.J. Watson,Devean George,Stephen Curry,Adam Morrison,Andrew Bynum,Jordan Farmar,Lamar Odom,Sasha Vujacic,2,11:13,GSW,rebound,,,,,,,,,,Stephen Curry,,,,,,def,,
Andris Biedrins,Anthony Tolliver,C.J. Watson,Devean George,Stephen Curry,Adam Morrison,Andrew Bynum,Jordan Farmar,Lamar Odom,Sasha Vujacic,2,11:09,LAL,foul,,,,,,,,Anthony Tolliver,,Lamar Odom,,,,,,personal,,
Andris Biedrins,Anthony Tolliver,C.J. Watson,Devean George,Stephen Curry,Adam Morrison,Andrew Bynum,Jordan Farmar,Lamar Odom,Sasha Vujacic,2,10:55,GSW,shot,,,,,,,,,,Stephen Curry,,,,missed,,3pt,42,26