a1,a2,a3,a4,a5,h1,h2,h3,h4,h5,period,time,team,etype,assist,away,block,entered,home,left,num,opponent,outof,player,points,possession,reason,result,steal,type,x,y
Boris Diaw,D.J. Augustin,Gerald Wallace,Nazr Mohammed,Stephen Jackson,Al Jefferson,Corey Brewer,Jonny Flynn,Ryan Gomes,Ryan Hollins,1,12:00,OFF,jump ball,,Nazr Mohammed,,,Ryan Hollins,,,,,,,Ryan Gomes,,,,,,
Boris Diaw,D.J. Augustin,Gerald Wallace,Nazr Mohammed,Stephen Jackson,Al Jefferson,Corey Brewer,Jonny Flynn,Ryan Gomes,Ryan Hollins,1,11:43,MIN,shot,,,,,,,,,,Corey Brewer,2,,,made,,driving layup,25,6
Boris Diaw,D.J. Augustin,Gerald Wallace,Nazr Mohammed,Stephen Jackson,Al Jefferson,Corey Brewer,Jonny Flynn,Ryan Gomes,Ryan Hollins,1,11:28,CHA,shot,Boris Diaw,,,,,,,,,Stephen Jackson,2,,,made,,fade away jumper,25,23
Boris Diaw,D.J. Augustin,Gerald Wallace,Nazr Mohammed,Stephen Jackson,Al Jefferson,Corey Brewer,Jonny Flynn,Ryan Gomes,Ryan Hollins,1,11:04,MIN,shot,,,,,,,,,,Ryan Hollins,,,,missed,,jump,11,20
Boris Diaw,D.J. Augustin,Gerald Wallace,Nazr Mohammed,Stephen Jackson,Al Jefferson,Corey Brewer,Jonny Flynn,Ryan Gomes,Ryan Hollins,1,11:03,CHA,rebound,,,,,,,,,,Stephen Jackson,,,,,,def,,
Boris Diaw,D.J. Augustin,Gerald Wallace,Nazr Mohammed,Stephen Jackson,Al Jefferson,Corey Brewer,Jonny Flynn,Ryan Gomes,Ryan Hollins,1,10:46,CHA,shot,Stephen Jackson,,,,,,,,,Nazr Mohammed,2,,,made,,hook,27,12
Boris Diaw,D.J. Augustin,Gerald Wallace,Nazr Mohammed,Stephen Jackson,Al Jefferson,Corey Brewer,Jonny Flynn,Ryan Gomes,Ryan Hollins,1,10:27,MIN,shot,,,,,,,,,,Corey Brewer,,,,missed,,layup,25,6
Boris Diaw,D.J. Augustin,Gerald Wallace,Nazr Mohammed,Stephen Jackson,Al Jefferson,Corey Brewer,Jonny Flynn,Ryan Gomes,Ryan Hollins,1,10:26,CHA,rebound,,,,,,,,,,Nazr Mohammed,,,,,,def,,
Boris Diaw,D.J. Augustin,Gerald Wallace,Nazr Mohammed,Stephen Jackson,Al Jefferson,Corey Brewer,Jonny Flynn,Ryan Gomes,Ryan Hollins,1,10:13,CHA,shot,,,,,,,,,,D.J. Augustin,3,,,made,,3pt,31,30
Boris Diaw,D.J. Augustin,Gerald Wallace,Nazr Mohammed,Stephen Jackson,Al Jefferson,Corey Brewer,Jonny Flynn,Ryan Gomes,Ryan Hollins,1,9:57,MIN,shot,,,,,,,,,,Ryan Hollins,,,,missed,,jump,9,11
Boris Diaw,D.J. Augustin,Gerald Wallace,Nazr Mohammed,Stephen Jackson,Al Jefferson,Corey Brewer,Jonny Flynn,Ryan Gomes,Ryan Hollins,1,9:55,CHA,rebound,,,,,,,,,,Nazr Mohammed,,,,,,def,,
Boris Diaw,D.J. Augustin,Gerald Wallace,Nazr Mohammed,Stephen Jackson,Al Jefferson,Corey Brewer,Jonny Flynn,Ryan Gomes,Ryan Hollins,1,9:40,CHA,shot,,,,,,,,,,Boris Diaw,2,,,made,,step back jump,10,8
Boris Diaw,D.J. Augustin,Gerald Wallace,Nazr Mohammed,Stephen Jackson,Al Jefferson,Corey Brewer,Jonny Flynn,Ryan Gomes,Ryan Hollins,1,9:17,MIN,shot,,,,,,,,,,Ryan Gomes,,,,missed,,3pt,5,21
Boris Diaw,D.J. Augustin,Gerald Wallace,Nazr Mohammed,Stephen Jackson,Al Jefferson,Corey Brewer,Jonny Flynn,Ryan Gomes,Ryan Hollins,1,9:16,CHA,rebound,,,,,,,,,,Stephen Jackson,,,,,,def,,
Boris Diaw,D.J. Augustin,Gerald Wallace,Nazr Mohammed,Stephen Jackson,Al Jefferson,Corey Brewer,Jonny Flynn,Ryan Gomes,Ryan Hollins,1,9:07,CHA,shot,,,,,,,,,,Boris Diaw,,,,missed,,3pt,25,30
Boris Diaw,D.J. Augustin,Gerald Wallace,Nazr Mohammed,Stephen Jackson,Al Jefferson,Corey Brewer,Jonny Flynn,Ryan Gomes,Ryan Hollins,1,9:06,MIN,rebound,,,,,,,,,,Al Jefferson,,,,,,def,,
Boris Diaw,D.J. Augustin,Gerald Wallace,Nazr Mohammed,Stephen Jackson,Al Jefferson,Corey Brewer,Jonny Flynn,Ryan Gomes,Ryan Hollins,1,9:00,MIN,shot,,,,,,,,,,Jonny Flynn,2,,,made,,driving layup,25,6
Boris Diaw,D.J. Augustin,Gerald Wallace,Nazr Mohammed,Stephen Jackson,Al Jefferson,Corey Brewer,Jonny Flynn,Ryan Gomes,Ryan Hollins,1,8:41,CHA,shot,,,,,,,,,,Gerald Wallace,,,,missed,,jump,30,24
Boris Diaw,D.J. Augustin,Gerald Wallace,Nazr Mohammed,Stephen Jackson,Al Jefferson,Corey Brewer,Jonny Flynn,Ryan Gomes,Ryan Hollins,1,8:40,CHA,rebound,,,,,,,,,,,,,,,,,,
Boris Diaw,D.J. Augustin,Gerald Wallace,Nazr Mohammed,Stephen Jackson,Al Jefferson,Corey Brewer,Jonny Flynn,Ryan Gomes,Ryan Hollins,1,8:40,MIN,foul,,,,,,,,Stephen Jackson,,Corey Brewer,,,,,,loose ball,,
Boris Diaw,D.J. Augustin,Gerald Wallace,Nazr Mohammed,Stephen Jackson,Al Jefferson,Corey Brewer,Jonny Flynn,Ryan Gomes,Ryan Hollins,1,8:37,CHA,shot,D.J. Augustin,,,,,,,,,Boris Diaw,3,,,made,,3pt,17,29
Boris Diaw,D.J. Augustin,Gerald Wallace,Nazr Mohammed,Stephen Jackson,Al Jefferson,Corey Brewer,Jonny Flynn,Ryan Gomes,Ryan Hollins,1,8:26,MIN,shot,Ryan Hollins,,,,,,,,,Al Jefferson,2,,,made,,jump,25,12
Boris Diaw,D.J. Augustin,Gerald Wallace,Nazr Mohammed,Stephen Jackson,Al Jefferson,Corey Brewer,Jonny Flynn,Ryan Gomes,Ryan Hollins,1,8:14,CHA,shot,,,,,,,,,,Boris Diaw,,,,missed,,jump,36,26
Boris Diaw,D.J. Augustin,Gerald Wallace,Nazr Mohammed,Stephen Jackson,Al Jefferson,Corey Brewer,Jonny Flynn,Ryan Gomes,Ryan Hollins,1,8:13,CHA,rebound,,,,,,,,,,Nazr Mohammed,,,,,,off,,
Boris Diaw,D.J. Augustin,Gerald Wallace,Nazr Mohammed,Stephen Jackson,Al Jefferson,Corey Brewer,Jonny Flynn,Ryan Gomes,Ryan Hollins,1,8:11,MIN,foul,,,,,,,,Nazr Mohammed,,Al Jefferson,,,,,,shooting,,
Boris Diaw,D.J. Augustin,Gerald Wallace,Nazr Mohammed,Stephen Jackson,Al Jefferson,Corey Brewer,Jonny Flynn,Ryan Gomes,Ryan Hollins,1,8:11,CHA,free throw,,,,,,,1,,2,Nazr Mohammed,,,foul,made,,,,
Boris Diaw,D.J. Augustin,Gerald Wallace,Nazr Mohammed,Stephen Jackson,Al Jefferson,Corey Brewer,Jonny Flynn,Ryan Gomes,Ryan Hollins,1,8:11,CHA,free throw,,,,,,,2,,2,Nazr Mohammed,,,foul,made,,,,
Boris Diaw,D.J. Augustin,Gerald Wallace,Nazr Mohammed,Stephen Jackson,Al Jefferson,Corey Brewer,Jonny Flynn,Ryan Gomes,Ryan Hollins,1,7:56,MIN,shot,,,,,,,,,,Jonny Flynn,2,,,made,,pullup jump,8,9
Boris Diaw,D.J. Augustin,Gerald Wallace,Nazr Mohammed,Stephen Jackson,Al Jefferson,Corey Brewer,Jonny Flynn,Ryan Gomes,Ryan Hollins,1,7:35,MIN,foul,,,,,,,,Stephen Jackson,,Ryan Hollins,,,,,,shooting,,
Boris Diaw,D.J. Augustin,Gerald Wallace,Nazr Mohammed,Stephen Jackson,Al Jefferson,Corey Brewer,Jonny Flynn,Ryan Gomes,Ryan Hollins,1,7:35,CHA,free throw,,,,,,,1,,3,Stephen Jackson,,,foul,made,,,,
Boris Diaw,D.J. Augustin,Gerald Wallace,Nazr Mohammed,Stephen Jackson,Al Jefferson,Corey Brewer,Jonny Flynn,Ryan Gomes,Ryan Hollins,1,7:35,CHA,free throw,,,,,,,2,,3,Stephen Jackson,,,foul,made,,,,
Boris Diaw,D.J. Augustin,Gerald Wallace,Nazr Mohammed,Stephen Jackson,Al Jefferson,Corey Brewer,Jonny Flynn,Ryan Gomes,Ryan Hollins,1,7:35,CHA,free throw,,,,,,,3,,3,Stephen Jackson,,,foul,made,,,,
Boris Diaw,D.J. Augustin,Gerald Wallace,Nazr Mohammed,Stephen Jackson,Al Jefferson,Corey Brewer,Jonny Flynn,Ryan Gomes,Ryan Hollins,1,7:12,MIN,shot,Ryan Gomes,,,,,,,,,Jonny Flynn,3,,,made,,3pt,2,9
Boris Diaw,D.J. Augustin,Gerald Wallace,Nazr Mohammed,Stephen Jackson,Al Jefferson,Corey Brewer,Jonny Flynn,Ryan Gomes,Ryan Hollins,1,6:53,CHA,shot,,,,,,,,,,D.J. Augustin,,,,missed,,3pt,2,8
Boris Diaw,D.J. Augustin,Gerald Wallace,Nazr Mohammed,Stephen Jackson,Al Jefferson,Corey Brewer,Jonny Flynn,Ryan Gomes,Ryan Hollins,1,6:52,MIN,rebound,,,,,,,,,,Ryan Hollins,,,,,,def,,
Boris Diaw,D.J. Augustin,Gerald Wallace,Nazr Mohammed,Stephen Jackson,Al Jefferson,Corey Brewer,Jonny Flynn,Ryan Gomes,Ryan Hollins,1,6:32,MIN,shot,,,,,,,,,,Al Jefferson,,,,missed,,jump,39,12
Boris Diaw,D.J. Augustin,Gerald Wallace,Nazr Mohammed,Stephen Jackson,Al Jefferson,Corey Brewer,Jonny Flynn,Ryan Gomes,Ryan Hollins,1,6:31,CHA,rebound,,,,,,,,,,Nazr Mohammed,,,,,,def,,
Boris Diaw,D.J. Augustin,Gerald Wallace,Nazr Mohammed,Stephen Jackson,Al Jefferson,Corey Brewer,Jonny Flynn,Ryan Gomes,Ryan Hollins,1,6:09,CHA,shot,D.J. Augustin,,,,,,,,,Nazr Mohammed,2,,,made,,reverse layup,25,6
Boris Diaw,D.J. Augustin,Gerald Wallace,Nazr Mohammed,Stephen Jackson,Al Jefferson,Corey Brewer,Jonny Flynn,Ryan Gomes,Ryan Hollins,1,5:58,CHA,foul,,,,,,,,Al Jefferson,,Nazr Mohammed,,,,,,personal,,
Boris Diaw,D.J. Augustin,Gerald Wallace,Nazr Mohammed,Stephen Jackson,Al Jefferson,Corey Brewer,Jonny Flynn,Ryan Gomes,Ryan Hollins,1,5:58,MIN,timeout,,,,,,,,,,,,,,,,regular,,
Boris Diaw,D.J. Augustin,Gerald Wallace,Nazr Mohammed,Stephen Jackson,Al Jefferson,Corey Brewer,Jonny Flynn,Kevin Love,Ryan Gomes,1,5:58,MIN,sub,,,,Kevin Love,,Ryan Hollins,,,,,,,,,,,,
Boris Diaw,D.J. Augustin,Gerald Wallace,Nazr Mohammed,Stephen Jackson,Al Jefferson,Corey Brewer,Jonny Flynn,Kevin Love,Ryan Gomes,1,5:52,MIN,shot,Corey Brewer,,,,,,,,,Kevin Love,2,,,made,,layup,25,6
Boris Diaw,D.J. Augustin,Gerald Wallace,Nazr Mohammed,Stephen Jackson,Al Jefferson,Corey Brewer,Jonny Flynn,Kevin Love,Ryan Gomes,1,5:30,CHA,shot,Boris Diaw,,,,,,,,,D.J. Augustin,3,,,made,,3pt,2,13
Boris Diaw,D.J. Augustin,Gerald Wallace,Nazr Mohammed,Stephen Jackson,Al Jefferson,Corey Brewer,Jonny Flynn,Kevin Love,Ryan Gomes,1,5:19,MIN,shot,Jonny Flynn,,,,,,,,,Ryan Gomes,3,,,made,,3pt,39,27
Boris Diaw,D.J. Augustin,Gerald Wallace,Nazr Mohammed,Stephen Jackson,Al Jefferson,Corey Brewer,Jonny Flynn,Kevin Love,Ryan Gomes,1,5:00,CHA,shot,,,,,,,,,,Stephen Jackson,,,,missed,,jump,22,9
Boris Diaw,D.J. Augustin,Gerald Wallace,Nazr Mohammed,Stephen Jackson,Al Jefferson,Corey Brewer,Jonny Flynn,Kevin Love,Ryan Gomes,1,4:59,CHA,rebound,,,,,,,,,,,,,,,,,,
Boris Diaw,D.J. Augustin,Gerald Wallace,Nazr Mohammed,Stephen Jackson,Al Jefferson,Corey Brewer,Jonny Flynn,Kevin Love,Ryan Gomes,1,4:59,MIN,foul,,,,,,,,Nazr Mohammed,,Kevin Love,,,,,,loose ball,,
Boris Diaw,D.J. Augustin,Gerald Wallace,Nazr Mohammed,Stephen Jackson,Al Jefferson,Corey Brewer,Damien Wilkins,Jonny Flynn,Kevin Love,1,4:59,MIN,sub,,,,Damien Wilkins,,Ryan Gomes,,,,,,,,,,,,
Boris Diaw,D.J. Augustin,Gerald Wallace,Nazr Mohammed,Stephen Jackson,Al Jefferson,Corey Brewer,Damien Wilkins,Jonny Flynn,Kevin Love,1,4:49,CHA,turnover,,,,,,,,,,Boris Diaw,,,bad pass,,,,,
Boris Diaw,D.J. Augustin,Gerald Wallace,Nazr Mohammed,Stephen Jackson,Al Jefferson,Corey Brewer,Damien Wilkins,Jonny Flynn,Kevin Love,1,4:34,MIN,shot,,,Boris Diaw,,,,,,,Kevin Love,,,,missed,,jump,37,6
Boris Diaw,D.J. Augustin,Gerald Wallace,Nazr Mohammed,Stephen Jackson,Al Jefferson,Corey Brewer,Damien Wilkins,Jonny Flynn,Kevin Love,1,4:32,CHA,rebound,,,,,,,,,,Nazr Mohammed,,,,,,def,,
Boris Diaw,D.J. Augustin,Gerald Wallace,Nazr Mohammed,Stephen Jackson,Al Jefferson,Corey Brewer,Damien Wilkins,Jonny Flynn,Kevin Love,1,4:26,CHA,shot,,,,,,,,,,Boris Diaw,,,,missed,,layup,25,6
Boris Diaw,D.J. Augustin,Gerald Wallace,Nazr Mohammed,Stephen Jackson,Al Jefferson,Corey Brewer,Damien Wilkins,Jonny Flynn,Kevin Love,1,4:25,CHA,rebound,,,,,,,,,,Gerald Wallace,,,,,,off,,
Boris Diaw,D.J. Augustin,Gerald Wallace,Nazr Mohammed,Stephen Jackson,Al Jefferson,Corey Brewer,Damien Wilkins,Jonny Flynn,Kevin Love,1,4:16,CHA,shot,Gerald Wallace,,,,,,,,,Stephen Jackson,3,,,made,,3pt,43,24
Boris Diaw,D.J. Augustin,Gerald Wallace,Nazr Mohammed,Stephen Jackson,Al Jefferson,Corey Brewer,Damien Wilkins,Jonny Flynn,Kevin Love,1,3:59,MIN,shot,,,,,,,,,,Jonny Flynn,,,,missed,,step back jump,33,21
Boris Diaw,D.J. Augustin,Gerald Wallace,Nazr Mohammed,Stephen Jackson,Al Jefferson,Corey Brewer,Damien Wilkins,Jonny Flynn,Kevin Love,1,3:57,CHA,rebound,,,,,,,,,,Nazr Mohammed,,,,,,def,,
Boris Diaw,D.J. Augustin,Gerald Wallace,Nazr Mohammed,Stephen Jackson,Al Jefferson,Corey Brewer,Damien Wilkins,Jonny Flynn,Kevin Love,1,3:43,CHA,shot,D.J. Augustin,,,,,,,,,Nazr Mohammed,2,,,made,,layup,25,6
Boris Diaw,D.J. Augustin,Gerald Wallace,Nazr Mohammed,Stephen Jackson,Al Jefferson,Corey Brewer,Damien Wilkins,Jonny Flynn,Kevin Love,1,3:21,MIN,shot,Damien Wilkins,,,,,,,,,Al Jefferson,2,,,made,,turnaround jump,37,6
Boris Diaw,D.J. Augustin,Gerald Wallace,Nazr Mohammed,Stephen Jackson,Al Jefferson,Corey Brewer,Damien Wilkins,Jonny Flynn,Kevin Love,1,3:06,CHA,shot,,,,,,,,,,D.J. Augustin,3,,,made,,3pt,11,27
Boris Diaw,D.J. Augustin,Gerald Wallace,Nazr Mohammed,Stephen Jackson,Al Jefferson,Corey Brewer,Damien Wilkins,Jonny Flynn,Kevin Love,1,2:58,MIN,timeout,,,,,,,,,,,,,,,,short,,
Boris Diaw,D.J. Augustin,Gerald Wallace,Nazr Mohammed,Stephen Jackson,Al Jefferson,Corey Brewer,Damien Wilkins,Jonny Flynn,Kevin Love,1,2:58,CHA,timeout,,,,,,,,,,,,,,,,regular,,
Boris Diaw,D.J. Augustin,Gerald Wallace,Nazr Mohammed,Stephen Jackson,Al Jefferson,Corey Brewer,Damien Wilkins,Jonny Flynn,Kevin Love,1,2:41,MIN,shot,,,,,,,,,,Al Jefferson,2,,,made,,turnaround jump,21,12
Boris Diaw,D.J. Augustin,Gerald Wallace,Nazr Mohammed,Stephen Jackson,Al Jefferson,Corey Brewer,Damien Wilkins,Jonny Flynn,Kevin Love,1,2:24,CHA,shot,,,,,,,,,,Stephen Jackson,,,,missed,,3pt,13,27
Boris Diaw,D.J. Augustin,Gerald Wallace,Nazr Mohammed,Stephen Jackson,Al Jefferson,Corey Brewer,Damien Wilkins,Jonny Flynn,Kevin Love,1,2:23,MIN,rebound,,,,,,,,,,Damien Wilkins,,,,,,def,,
Boris Diaw,D.J. Augustin,Gerald Wallace,Nazr Mohammed,Stephen Jackson,Al Jefferson,Corey Brewer,Damien Wilkins,Jonny Flynn,Kevin Love,1,2:16,MIN,shot,,,Boris Diaw,,,,,,,Kevin Love,,,,missed,,reverse layup,23,8
Boris Diaw,D.J. Augustin,Gerald Wallace,Nazr Mohammed,Stephen Jackson,Al Jefferson,Corey Brewer,Damien Wilkins,Jonny Flynn,Kevin Love,1,2:14,CHA,rebound,,,,,,,,,,Nazr Mohammed,,,,,,def,,
Boris Diaw,D.J. Augustin,Gerald Wallace,Nazr Mohammed,Stephen Jackson,Al Jefferson,Corey Brewer,Damien Wilkins,Jonny Flynn,Kevin Love,1,2:05,CHA,shot,,,,,,,,,,Gerald Wallace,,,,missed,,jump,23,17
Boris Diaw,D.J. Augustin,Gerald Wallace,Nazr Mohammed,Stephen Jackson,Al Jefferson,Corey Brewer,Damien Wilkins,Jonny Flynn,Kevin Love,1,2:04,MIN,rebound,,,,,,,,,,Jonny Flynn,,,,,,def,,
Boris Diaw,D.J. Augustin,Gerald Wallace,Nazr Mohammed,Stephen Jackson,Al Jefferson,Corey Brewer,Damien Wilkins,Jonny Flynn,Kevin Love,1,1:58,MIN,shot,Jonny Flynn,,,,,,,,,Al Jefferson,2,,,made,,layup,25,6
Boris Diaw,D.J. Augustin,Gerald Wallace,Nazr Mohammed,Stephen Jackson,Al Jefferson,Corey Brewer,Damien Wilkins,Jonny Flynn,Kevin Love,1,1:36,CHA,shot,Stephen Jackson,,,,,,,,,Boris Diaw,2,,,made,,slam dunk,25,6
Boris Diaw,D.J. Augustin,Gerald Wallace,Nazr Mohammed,Stephen Jackson,Al Jefferson,Corey Brewer,Damien Wilkins,Jonny Flynn,Kevin Love,1,1:24,MIN,turnover,,,,,,,,,,Jonny Flynn,,,lost ball,,D.J. Augustin,,,
Boris Diaw,D.J. Augustin,Gerald Wallace,Nazr Mohammed,Stephen Jackson,Al Jefferson,Corey Brewer,Damien Wilkins,Jonny Flynn,Kevin Love,1,1:20,MIN,foul,,,,,,,,Gerald Wallace,,Corey Brewer,,,,,,shooting,,
Boris Diaw,D.J. Augustin,Gerald Wallace,Nazr Mohammed,Stephen Jackson,Corey Brewer,Damien Wilkins,Jonny Flynn,Kevin Love,Ryan Hollins,1,1:20,MIN,sub,,,,Ryan Hollins,,Al Jefferson,,,,,,,,,,,,
Boris Diaw,D.J. Augustin,Gerald Wallace,Nazr Mohammed,Stephen Jackson,Corey Brewer,Damien Wilkins,Jonny Flynn,Kevin Love,Ryan Hollins,1,1:20,CHA,free throw,,,,,,,1,,2,Gerald Wallace,,,foul,made,,,,
Boris Diaw,D.J. Augustin,Gerald Wallace,Nazr Mohammed,Stephen Jackson,Corey Brewer,Damien Wilkins,Kevin Love,Ramon Sessions,Ryan Hollins,1,1:20,MIN,sub,,,,Ramon Sessions,,Jonny Flynn,,,,,,,,,,,,
Boris Diaw,D.J. Augustin,Gerald Wallace,Nazr Mohammed,Stephen Jackson,Damien Wilkins,Kevin Love,Ramon Sessions,Ryan Gomes,Ryan Hollins,1,1:20,MIN,sub,,,,Ryan Gomes,,Corey Brewer,,,,,,,,,,,,
Boris Diaw,D.J. Augustin,Gerald Wallace,Stephen Jackson,Tyson Chandler,Damien Wilkins,Kevin Love,Ramon Sessions,Ryan Gomes,Ryan Hollins,1,1:20,CHA,sub,,,,Tyson Chandler,,Nazr Mohammed,,,,,,,,,,,,
Acie Law,Boris Diaw,Gerald Wallace,Stephen Jackson,Tyson Chandler,Damien Wilkins,Kevin Love,Ramon Sessions,Ryan Gomes,Ryan Hollins,1,1:20,CHA,sub,,,,Acie Law,,D.J. Augustin,,,,,,,,,,,,
Acie Law,Boris Diaw,Gerald Wallace,Stephen Jackson,Tyson Chandler,Damien Wilkins,Kevin Love,Ramon Sessions,Ryan Gomes,Ryan Hollins,1,1:20,CHA,free throw,,,,,,,2,,2,Gerald Wallace,,,foul,made,,,,
Acie Law,Boris Diaw,Gerald Wallace,Stephen Jackson,Tyson Chandler,Damien Wilkins,Kevin Love,Ramon Sessions,Ryan Gomes,Ryan Hollins,1,0:57,MIN,shot,Damien Wilkins,,,,,,,,,Ramon Sessions,2,,,made,,jump,15,25
Acie Law,Boris Diaw,Gerald Wallace,Stephen Jackson,Tyson Chandler,Damien Wilkins,Kevin Love,Ramon Sessions,Ryan Gomes,Ryan Hollins,1,0:42,CHA,turnover,,,,,,,,,,Acie Law,,,bad pass,,Kevin Love,,,
Acie Law,Boris Diaw,Gerald Wallace,Stephen Jackson,Tyson Chandler,Damien Wilkins,Kevin Love,Ramon Sessions,Ryan Gomes,Ryan Hollins,1,0:35,CHA,foul,,,,,,,,Ramon Sessions,,Boris Diaw,,,,,,personal,,
Acie Law,Boris Diaw,Gerald Wallace,Stephen Jackson,Tyson Chandler,Damien Wilkins,Kevin Love,Ramon Sessions,Ryan Gomes,Ryan Hollins,1,0:25,MIN,shot,,,,,,,,,,Ryan Gomes,,,,missed,,3pt,19,30
Acie Law,Boris Diaw,Gerald Wallace,Stephen Jackson,Tyson Chandler,Damien Wilkins,Kevin Love,Ramon Sessions,Ryan Gomes,Ryan Hollins,1,0:24,CHA,rebound,,,,,,,,,,Gerald Wallace,,,,,,def,,
Acie Law,Boris Diaw,Gerald Wallace,Stephen Jackson,Tyson Chandler,Damien Wilkins,Kevin Love,Ramon Sessions,Ryan Gomes,Ryan Hollins,1,0:02,CHA,shot,,,,,,,,,,Stephen Jackson,3,,,made,,3pt,41,28
Acie Law,Boris Diaw,Gerald Wallace,Stephen Jackson,Tyson Chandler,Damien Wilkins,Kevin Love,Ramon Sessions,Ryan Gomes,Ryan Hollins,1,0:00,MIN,shot,,,,,,,,,,Ryan Gomes,,,,missed,,3pt,7,38
Acie Law,Boris Diaw,Gerald Wallace,Stephen Jackson,Tyson Chandler,Damien Wilkins,Kevin Love,Ramon Sessions,Ryan Gomes,Ryan Hollins,1,0:00,MIN,rebound,,,,,,,,,,,,,,,,,,
Acie Law,Gerald Wallace,Nazr Mohammed,Ronald Murray,Tyson Chandler,Damien Wilkins,Kevin Love,Ramon Sessions,Ryan Gomes,Ryan Hollins,2,11:37,CHA,shot,,,,,,,,,,Ronald Murray,3,,,made,,3pt,41,25
Acie Law,Gerald Wallace,Nazr Mohammed,Ronald Murray,Tyson Chandler,Damien Wilkins,Kevin Love,Ramon Sessions,Ryan Gomes,Ryan Hollins,2,11:17,CHA,foul,,,,,,,,Kevin Love,,Tyson Chandler,,,,,,shooting,,
Acie Law,Gerald Wallace,Nazr Mohammed,Ronald Murray,Tyson Chandler,Damien Wilkins,Kevin Love,Ramon Sessions,Ryan Gomes,Ryan Hollins,2,11:17,MIN,free throw,,,,,,,1,,2,Kevin Love,,,foul,made,,,,
Acie Law,Gerald Wallace,Nazr Mohammed,Ronald Murray,Tyson Chandler,Kevin Love,Ramon Sessions,Ryan Gomes,Ryan Hollins,Wayne Ellington,2,11:17,MIN,sub,,,,Wayne Ellington,,Damien Wilkins,,,,,,,,,,,,
Acie Law,Gerald Wallace,Nazr Mohammed,Ronald Murray,Tyson Chandler,Kevin Love,Ramon Sessions,Ryan Gomes,Ryan Hollins,Wayne Ellington,2,11:17,MIN,free throw,,,,,,,2,,2,Kevin Love,,,foul,made,,,,
Acie Law,Gerald Wallace,Nazr Mohammed,Ronald Murray,Tyson Chandler,Kevin Love,Ramon Sessions,Ryan Gomes,Ryan Hollins,Wayne Ellington,2,11:00,CHA,shot,,,Kevin Love,,,,,,,Gerald Wallace,,,,missed,,layup,25,6
Acie Law,Gerald Wallace,Nazr Mohammed,Ronald Murray,Tyson Chandler,Kevin Love,Ramon Sessions,Ryan Gomes,Ryan Hollins,Wayne Ellington,2,10:59,MIN,rebound,,,,,,,,,,Kevin Love,,,,,,def,,
Acie Law,Gerald Wallace,Nazr Mohammed,Ronald Murray,Tyson Chandler,Kevin Love,Ramon Sessions,Ryan Gomes,Ryan Hollins,Wayne Ellington,2,10:54,CHA,violation,,,,,,,,,,Gerald Wallace,,,,,,defensive goaltending,,
Acie Law,Gerald Wallace,Nazr Mohammed,Ronald Murray,Tyson Chandler,Kevin Love,Ramon Sessions,Ryan Gomes,Ryan Hollins,Wayne Ellington,2,10:54,MIN,shot,Ryan Gomes,,,,,,,,,Ryan Hollins,2,,,made,,driving layup,25,6
Acie Law,Gerald Wallace,Nazr Mohammed,Ronald Murray,Tyson Chandler,Kevin Love,Ramon Sessions,Ryan Gomes,Ryan Hollins,Wayne Ellington,2,10:40,CHA,shot,,,,,,,,,,Acie Law,,,,missed,,jump,15,20
Acie Law,Gerald Wallace,Nazr Mohammed,Ronald Murray,Tyson Chandler,Kevin Love,Ramon Sessions,Ryan Gomes,Ryan Hollins,Wayne Ellington,2,10:39,MIN,rebound,,,,,,,,,,Wayne Ellington,,,,,,def,,
Acie Law,Gerald Wallace,Nazr Mohammed,Ronald Murray,Tyson Chandler,Kevin Love,Ramon Sessions,Ryan Gomes,Ryan Hollins,Wayne Ellington,2,10:29,MIN,shot,,,,,,,,,,Wayne Ellington,,,,missed,,3pt,43,24
Acie Law,Gerald Wallace,Nazr Mohammed,Ronald Murray,Tyson Chandler,Kevin Love,Ramon Sessions,Ryan Gomes,Ryan Hollins,Wayne Ellington,2,10:27,CHA,rebound,,,,,,,,,,Gerald Wallace,,,,,,def,,
Acie Law,Gerald Wallace,Nazr Mohammed,Ronald Murray,Tyson Chandler,Kevin Love,Ramon Sessions,Ryan Gomes,Ryan Hollins,Wayne Ellington,2,10:23,MIN,foul,,,,,,,,Nazr Mohammed,,Wayne Ellington,,,,,,shooting,,
Acie Law,Gerald Wallace,Nazr Mohammed,Ronald Murray,Tyson Chandler,Kevin Love,Ramon Sessions,Ryan Gomes,Ryan Hollins,Wayne Ellington,2,10:23,CHA,free throw,,,,,,,1,,2,Nazr Mohammed,,,foul,missed,,,,
Acie Law,Gerald Wallace,Nazr Mohammed,Ronald Murray,Tyson Chandler,Kevin Love,Ramon Sessions,Ryan Gomes,Ryan Hollins,Wayne Ellington,2,10:23,CHA,rebound,,,,,,,,,,,,,,,,,,
Acie Law,Gerald Wallace,Nazr Mohammed,Ronald Murray,Tyson Chandler,Kevin Love,Ramon Sessions,Ryan Gomes,Ryan Hollins,Wayne Ellington,2,10:23,CHA,free throw,,,,,,,2,,2,Nazr Mohammed,,,foul,made,,,,
Acie Law,Gerald Wallace,Nazr Mohammed,Ronald Murray,Tyson Chandler,Kevin Love,Ramon Sessions,Ryan Gomes,Ryan Hollins,Wayne Ellington,2,10:12,MIN,shot,,,,,,,,,,Ramon Sessions,,,,missed,,layup,25,6
Acie Law,Gerald Wallace,Nazr Mohammed,Ronald Murray,Tyson Chandler,Kevin Love,Ramon Sessions,Ryan Gomes,Ryan Hollins,Wayne Ellington,2,10:11,CHA,rebound,,,,,,,,,,Nazr Mohammed,,,,,,def,,
Acie Law,Gerald Wallace,Nazr Mohammed,Ronald Murray,Tyson Chandler,Kevin Love,Ramon Sessions,Ryan Gomes,Ryan Hollins,Wayne Ellington,2,9:48,CHA,shot,Nazr Mohammed,,,,,,,,,Tyson Chandler,2,,,made,,layup,25,6
Acie Law,Gerald Wallace,Nazr Mohammed,Ronald Murray,Tyson Chandler,Kevin Love,Ramon Sessions,Ryan Gomes,Ryan Hollins,Wayne Ellington,2,9:28,MIN,shot,Kevin Love,,,,,,,,,Ryan Gomes,2,,,made,,jump,23,25
Acie Law,Gerald Wallace,Nazr Mohammed,Ronald Murray,Tyson Chandler,Kevin Love,Ramon Sessions,Ryan Gomes,Ryan Hollins,Wayne Ellington,2,9:09,CHA,shot,Ronald Murray,,,,,,,,,Nazr Mohammed,2,,,made,,jump,22,21
Acie Law,Gerald Wallace,Nazr Mohammed,Ronald Murray,Tyson Chandler,Kevin Love,Ramon Sessions,Ryan Gomes,Ryan Hollins,Wayne Ellington,2,8:51,MIN,turnover,,,,,,,,,,Ryan Gomes,,,lost ball,,Gerald Wallace,,,
Acie Law,Gerald Wallace,Nazr Mohammed,Ronald Murray,Tyson Chandler,Kevin Love,Ramon Sessions,Ryan Gomes,Ryan Hollins,Wayne Ellington,2,8:48,CHA,shot,Gerald Wallace,,,,,,,,,Acie Law,2,,,made,,driving dunk,25,6
Acie Law,Gerald Wallace,Nazr Mohammed,Ronald Murray,Tyson Chandler,Kevin Love,Ramon Sessions,Ryan Gomes,Ryan Hollins,Wayne Ellington,2,8:38,MIN,timeout,,,,,,,,,,,,,,,,regular,,
Gerald Wallace,Nazr Mohammed,Ronald Murray,Stephen Jackson,Tyson Chandler,Kevin Love,Ramon Sessions,Ryan Gomes,Ryan Hollins,Wayne Ellington,2,8:38,CHA,sub,,,,Stephen Jackson,,Acie Law,,,,,,,,,,,,
D.J. Augustin,Nazr Mohammed,Ronald Murray,Stephen Jackson,Tyson Chandler,Kevin Love,Ramon Sessions,Ryan Gomes,Ryan Hollins,Wayne Ellington,2,8:38,CHA,sub,,,,D.J. Augustin,,Gerald Wallace,,,,,,,,,,,,
D.J. Augustin,Nazr Mohammed,Ronald Murray,Stephen Jackson,Tyson Chandler,Corey Brewer,Kevin Love,Ramon Sessions,Ryan Gomes,Ryan Hollins,2,8:38,MIN,sub,,,,Corey Brewer,,Wayne Ellington,,,,,,,,,,,,
D.J. Augustin,Nazr Mohammed,Ronald Murray,Stephen Jackson,Tyson Chandler,Al Jefferson,Corey Brewer,Kevin Love,Ramon Sessions,Ryan Gomes,2,8:38,MIN,sub,,,,Al Jefferson,,Ryan Hollins,,,,,,,,,,,,
D.J. Augustin,Nazr Mohammed,Ronald Murray,Stephen Jackson,Tyson Chandler,Al Jefferson,Corey Brewer,Kevin Love,Ramon Sessions,Ryan Gomes,2,8:34,CHA,foul,,,,,,,,Ramon Sessions,,D.J. Augustin,,,,,,personal,,
D.J. Augustin,Nazr Mohammed,Ronald Murray,Stephen Jackson,Tyson Chandler,Al Jefferson,Corey Brewer,Kevin Love,Ramon Sessions,Ryan Gomes,2,8:27,MIN,turnover,,,,,,,,,,Corey Brewer,,,bad pass,,Stephen Jackson,,,
D.J. Augustin,Nazr Mohammed,Ronald Murray,Stephen Jackson,Tyson Chandler,Al Jefferson,Corey Brewer,Kevin Love,Ramon Sessions,Ryan Gomes,2,8:11,CHA,shot,,,,,,,,,,Stephen Jackson,2,,,made,,jump,10,8
D.J. Augustin,Nazr Mohammed,Ronald Murray,Stephen Jackson,Tyson Chandler,Al Jefferson,Corey Brewer,Kevin Love,Ramon Sessions,Ryan Gomes,2,7:49,MIN,turnover,,,,,,,,,,Ramon Sessions,,,traveling,,,,,
D.J. Augustin,Nazr Mohammed,Ronald Murray,Stephen Jackson,Tyson Chandler,Al Jefferson,Corey Brewer,Kevin Love,Ramon Sessions,Ryan Gomes,2,7:36,CHA,turnover,,,,,,,,,,D.J. Augustin,,,bad pass,,Kevin Love,,,
D.J. Augustin,Nazr Mohammed,Ronald Murray,Stephen Jackson,Tyson Chandler,Al Jefferson,Corey Brewer,Kevin Love,Ramon Sessions,Ryan Gomes,2,7:25,MIN,shot,,,,,,,,,,Al Jefferson,,,,missed,,turnaround jump,34,9