a1,a2,a3,a4,a5,h1,h2,h3,h4,h5,period,time,team,etype,assist,away,block,entered,home,left,num,opponent,outof,player,points,possession,reason,result,steal,type,x,y
Darren Collison,David West,Emeka Okafor,Morris Peterson,Peja Stojakovic,Boris Diaw,Gerald Wallace,Nazr Mohammed,Raymond Felton,Stephen Jackson,1,12:00,OFF,jump ball,,Emeka Okafor,,,Nazr Mohammed,,,,,,,Gerald Wallace,,,,,,
Darren Collison,David West,Emeka Okafor,Morris Peterson,Peja Stojakovic,Boris Diaw,Gerald Wallace,Nazr Mohammed,Raymond Felton,Stephen Jackson,1,11:48,CHA,shot,Boris Diaw,,,,,,,,,Nazr Mohammed,2,,,made,,jump,41,10
Darren Collison,David West,Emeka Okafor,Morris Peterson,Peja Stojakovic,Boris Diaw,Gerald Wallace,Nazr Mohammed,Raymond Felton,Stephen Jackson,1,11:36,NOH,turnover,,,,,,,,,,Darren Collison,,,bad pass,,Boris Diaw,,,
Darren Collison,David West,Emeka Okafor,Morris Peterson,Peja Stojakovic,Boris Diaw,Gerald Wallace,Nazr Mohammed,Raymond Felton,Stephen Jackson,1,11:30,CHA,shot,,,,,,,,,,Raymond Felton,,,,missed,,jump,7,8
Darren Collison,David West,Emeka Okafor,Morris Peterson,Peja Stojakovic,Boris Diaw,Gerald Wallace,Nazr Mohammed,Raymond Felton,Stephen Jackson,1,11:28,NOH,rebound,,,,,,,,,,Emeka Okafor,,,,,,def,,
Darren Collison,David West,Emeka Okafor,Morris Peterson,Peja Stojakovic,Boris Diaw,Gerald Wallace,Nazr Mohammed,Raymond Felton,Stephen Jackson,1,11:24,NOH,shot,,,,,,,,,,Darren Collison,,,,missed,,jump,11,19
Darren Collison,David West,Emeka Okafor,Morris Peterson,Peja Stojakovic,Boris Diaw,Gerald Wallace,Nazr Mohammed,Raymond Felton,Stephen Jackson,1,11:20,CHA,rebound,,,,,,,,,,Gerald Wallace,,,,,,def,,
Darren Collison,David West,Emeka Okafor,Morris Peterson,Peja Stojakovic,Boris Diaw,Gerald Wallace,Nazr Mohammed,Raymond Felton,Stephen Jackson,1,11:12,CHA,shot,Stephen Jackson,,,,,,,,,Nazr Mohammed,2,,,made,,layup,25,6
Darren Collison,David West,Emeka Okafor,Morris Peterson,Peja Stojakovic,Boris Diaw,Gerald Wallace,Nazr Mohammed,Raymond Felton,Stephen Jackson,1,10:46,NOH,shot,,,,,,,,,,Emeka Okafor,,,,missed,,hook,24,12
Darren Collison,David West,Emeka Okafor,Morris Peterson,Peja Stojakovic,Boris Diaw,Gerald Wallace,Nazr Mohammed,Raymond Felton,Stephen Jackson,1,10:45,CHA,rebound,,,,,,,,,,Nazr Mohammed,,,,,,def,,
Darren Collison,David West,Emeka Okafor,Morris Peterson,Peja Stojakovic,Boris Diaw,Gerald Wallace,Nazr Mohammed,Raymond Felton,Stephen Jackson,1,10:37,CHA,shot,,,,,,,,,,Stephen Jackson,,,,missed,,jump,22,23
Darren Collison,David West,Emeka Okafor,Morris Peterson,Peja Stojakovic,Boris Diaw,Gerald Wallace,Nazr Mohammed,Raymond Felton,Stephen Jackson,1,10:36,NOH,rebound,,,,,,,,,,Emeka Okafor,,,,,,def,,
Darren Collison,David West,Emeka Okafor,Morris Peterson,Peja Stojakovic,Boris Diaw,Gerald Wallace,Nazr Mohammed,Raymond Felton,Stephen Jackson,1,10:25,NOH,shot,,,,,,,,,,David West,2,,,made,,layup,25,6
Darren Collison,David West,Emeka Okafor,Morris Peterson,Peja Stojakovic,Boris Diaw,Gerald Wallace,Nazr Mohammed,Raymond Felton,Stephen Jackson,1,10:25,CHA,foul,,,,,,,,David West,,Nazr Mohammed,,,,,,shooting,,
Darren Collison,David West,Emeka Okafor,Morris Peterson,Peja Stojakovic,Boris Diaw,Gerald Wallace,Nazr Mohammed,Raymond Felton,Stephen Jackson,1,10:25,NOH,free throw,,,,,,,1,,1,David West,,,foul,made,,,,
Darren Collison,David West,Emeka Okafor,Morris Peterson,Peja Stojakovic,Boris Diaw,Gerald Wallace,Nazr Mohammed,Raymond Felton,Stephen Jackson,1,10:25,CHA,turnover,,,,,,,,,,Boris Diaw,,,bad pass,,Emeka Okafor,,,
Darren Collison,David West,Emeka Okafor,Morris Peterson,Peja Stojakovic,Boris Diaw,Gerald Wallace,Nazr Mohammed,Raymond Felton,Stephen Jackson,1,10:19,NOH,shot,,,,,,,,,,Morris Peterson,,,,missed,,layup,25,6
Darren Collison,David West,Emeka Okafor,Morris Peterson,Peja Stojakovic,Boris Diaw,Gerald Wallace,Nazr Mohammed,Raymond Felton,Stephen Jackson,1,10:16,NOH,rebound,,,,,,,,,,,,,,,,,,
Darren Collison,David West,Emeka Okafor,Morris Peterson,Peja Stojakovic,Boris Diaw,Gerald Wallace,Nazr Mohammed,Raymond Felton,Stephen Jackson,1,9:51,NOH,shot,,,,,,,,,,Peja Stojakovic,,,,missed,,jump,36,7
Darren Collison,David West,Emeka Okafor,Morris Peterson,Peja Stojakovic,Boris Diaw,Gerald Wallace,Nazr Mohammed,Raymond Felton,Stephen Jackson,1,9:50,NOH,rebound,,,,,,,,,,Emeka Okafor,,,,,,off,,
Darren Collison,David West,Emeka Okafor,Morris Peterson,Peja Stojakovic,Boris Diaw,Gerald Wallace,Nazr Mohammed,Raymond Felton,Stephen Jackson,1,9:50,NOH,shot,,,,,,,,,,Emeka Okafor,2,,,made,,putback dunk,25,6
Darren Collison,David West,Emeka Okafor,Morris Peterson,Peja Stojakovic,Boris Diaw,Gerald Wallace,Nazr Mohammed,Raymond Felton,Stephen Jackson,1,9:11,CHA,shot,,,,,,,,,,Gerald Wallace,,,,missed,,jump,10,18
Darren Collison,David West,Emeka Okafor,Morris Peterson,Peja Stojakovic,Boris Diaw,Gerald Wallace,Nazr Mohammed,Raymond Felton,Stephen Jackson,1,9:11,CHA,rebound,,,,,,,,,,,,,,,,,,
Darren Collison,David West,Emeka Okafor,Morris Peterson,Peja Stojakovic,Boris Diaw,Gerald Wallace,Nazr Mohammed,Raymond Felton,Stephen Jackson,1,8:47,CHA,shot,,,,,,,,,,Boris Diaw,,,,missed,,jump,10,12
Darren Collison,David West,Emeka Okafor,Morris Peterson,Peja Stojakovic,Boris Diaw,Gerald Wallace,Nazr Mohammed,Raymond Felton,Stephen Jackson,1,8:47,NOH,rebound,,,,,,,,,,Peja Stojakovic,,,,,,def,,
Darren Collison,David West,Emeka Okafor,Morris Peterson,Peja Stojakovic,Boris Diaw,Gerald Wallace,Nazr Mohammed,Raymond Felton,Stephen Jackson,1,8:40,NOH,shot,,,,,,,,,,Peja Stojakovic,,,,missed,,3pt,1,13
Darren Collison,David West,Emeka Okafor,Morris Peterson,Peja Stojakovic,Boris Diaw,Gerald Wallace,Nazr Mohammed,Raymond Felton,Stephen Jackson,1,8:40,CHA,rebound,,,,,,,,,,Boris Diaw,,,,,,def,,
Darren Collison,David West,Emeka Okafor,Morris Peterson,Peja Stojakovic,Boris Diaw,Gerald Wallace,Nazr Mohammed,Raymond Felton,Stephen Jackson,1,8:25,CHA,shot,,,,,,,,,,Raymond Felton,,,,missed,,jump,11,16
Darren Collison,David West,Emeka Okafor,Morris Peterson,Peja Stojakovic,Boris Diaw,Gerald Wallace,Nazr Mohammed,Raymond Felton,Stephen Jackson,1,8:25,NOH,rebound,,,,,,,,,,Peja Stojakovic,,,,,,def,,
Darren Collison,David West,Emeka Okafor,Morris Peterson,Peja Stojakovic,Boris Diaw,Gerald Wallace,Nazr Mohammed,Raymond Felton,Stephen Jackson,1,8:10,NOH,shot,,,,,,,,,,David West,2,,,made,,running hook,21,12
Darren Collison,David West,Emeka Okafor,Morris Peterson,Peja Stojakovic,Boris Diaw,Gerald Wallace,Nazr Mohammed,Raymond Felton,Stephen Jackson,1,7:59,CHA,turnover,,,,,,,,,,Stephen Jackson,,,bad pass,,,,,
Darren Collison,David West,Emeka Okafor,Morris Peterson,Peja Stojakovic,Boris Diaw,Gerald Wallace,Nazr Mohammed,Raymond Felton,Stephen Jackson,1,7:46,NOH,shot,,,,,,,,,,David West,2,,,made,,step back jump,11,12
Darren Collison,David West,Emeka Okafor,Morris Peterson,Peja Stojakovic,Boris Diaw,Gerald Wallace,Nazr Mohammed,Raymond Felton,Stephen Jackson,1,7:31,CHA,shot,,,,,,,,,,Boris Diaw,,,,missed,,3pt,29,31
Darren Collison,David West,Emeka Okafor,Morris Peterson,Peja Stojakovic,Boris Diaw,Gerald Wallace,Nazr Mohammed,Raymond Felton,Stephen Jackson,1,7:31,NOH,rebound,,,,,,,,,,Morris Peterson,,,,,,def,,
Darren Collison,David West,Emeka Okafor,Morris Peterson,Peja Stojakovic,Boris Diaw,Gerald Wallace,Nazr Mohammed,Raymond Felton,Stephen Jackson,1,7:26,NOH,shot,Morris Peterson,,,,,,,,,Peja Stojakovic,3,,,made,,3pt,1,7
Darren Collison,David West,Emeka Okafor,Morris Peterson,Peja Stojakovic,Boris Diaw,Gerald Wallace,Nazr Mohammed,Raymond Felton,Stephen Jackson,1,7:20,CHA,shot,,,,,,,,,,Stephen Jackson,3,,,made,,3pt,12,29
Darren Collison,David West,Emeka Okafor,Morris Peterson,Peja Stojakovic,Boris Diaw,Gerald Wallace,Nazr Mohammed,Raymond Felton,Stephen Jackson,1,7:10,NOH,shot,Peja Stojakovic,,,,,,,,,Darren Collison,2,,,made,,jump,10,19
Darren Collison,David West,Emeka Okafor,Morris Peterson,Peja Stojakovic,Boris Diaw,Gerald Wallace,Nazr Mohammed,Raymond Felton,Stephen Jackson,1,6:50,CHA,shot,,,Emeka Okafor,,,,,,,Boris Diaw,,,,missed,,layup,25,6
Darren Collison,David West,Emeka Okafor,Morris Peterson,Peja Stojakovic,Boris Diaw,Gerald Wallace,Nazr Mohammed,Raymond Felton,Stephen Jackson,1,6:50,CHA,rebound,,,,,,,,,,,,,,,,,,
Darren Collison,David West,Emeka Okafor,Morris Peterson,Peja Stojakovic,Boris Diaw,Gerald Wallace,Nazr Mohammed,Raymond Felton,Stephen Jackson,1,6:42,NOH,violation,,,,,,,,,,Emeka Okafor,,,,,,defensive goaltending,,
Darren Collison,David West,Emeka Okafor,Morris Peterson,Peja Stojakovic,Boris Diaw,Gerald Wallace,Nazr Mohammed,Raymond Felton,Stephen Jackson,1,6:42,CHA,shot,,,,,,,,,,Raymond Felton,2,,,made,,layup,25,6
Darren Collison,David West,Emeka Okafor,Morris Peterson,Peja Stojakovic,Boris Diaw,Gerald Wallace,Nazr Mohammed,Raymond Felton,Stephen Jackson,1,6:23,NOH,turnover,,,,,,,,,,Peja Stojakovic,,,bad pass,,Stephen Jackson,,,
Darren Collison,David West,Emeka Okafor,Morris Peterson,Peja Stojakovic,Boris Diaw,Gerald Wallace,Nazr Mohammed,Raymond Felton,Stephen Jackson,1,6:18,CHA,shot,Stephen Jackson,,,,,,,,,Gerald Wallace,2,,,made,,layup,25,6
Darren Collison,David West,Emeka Okafor,Morris Peterson,Peja Stojakovic,Boris Diaw,Gerald Wallace,Nazr Mohammed,Raymond Felton,Stephen Jackson,1,5:51,NOH,shot,,,,,,,,,,David West,,,,missed,,jump,9,16
Darren Collison,David West,Emeka Okafor,Morris Peterson,Peja Stojakovic,Boris Diaw,Gerald Wallace,Nazr Mohammed,Raymond Felton,Stephen Jackson,1,5:49,CHA,rebound,,,,,,,,,,Boris Diaw,,,,,,def,,
Darren Collison,David West,Emeka Okafor,Morris Peterson,Peja Stojakovic,Boris Diaw,Gerald Wallace,Nazr Mohammed,Raymond Felton,Stephen Jackson,1,5:33,CHA,shot,,,,,,,,,,Stephen Jackson,2,,,made,,fade away jumper,23,15
Darren Collison,David West,Emeka Okafor,Morris Peterson,Peja Stojakovic,Boris Diaw,Gerald Wallace,Nazr Mohammed,Raymond Felton,Stephen Jackson,1,5:08,NOH,shot,,,,,,,,,,Emeka Okafor,2,,,made,,layup,25,6
Darren Collison,David West,Emeka Okafor,Morris Peterson,Peja Stojakovic,Boris Diaw,Gerald Wallace,Nazr Mohammed,Raymond Felton,Stephen Jackson,1,4:51,CHA,shot,,,,,,,,,,Gerald Wallace,,,,missed,,jump,31,22
Darren Collison,David West,Emeka Okafor,Morris Peterson,Peja Stojakovic,Boris Diaw,Gerald Wallace,Nazr Mohammed,Raymond Felton,Stephen Jackson,1,4:50,NOH,rebound,,,,,,,,,,Emeka Okafor,,,,,,def,,
Darren Collison,David West,Emeka Okafor,Morris Peterson,Peja Stojakovic,Boris Diaw,Gerald Wallace,Nazr Mohammed,Raymond Felton,Stephen Jackson,1,4:44,NOH,shot,,,,,,,,,,Darren Collison,,,,missed,,jump,36,21
Darren Collison,David West,Emeka Okafor,Morris Peterson,Peja Stojakovic,Boris Diaw,Gerald Wallace,Nazr Mohammed,Raymond Felton,Stephen Jackson,1,4:44,CHA,rebound,,,,,,,,,,Gerald Wallace,,,,,,def,,
Darren Collison,David West,Emeka Okafor,Morris Peterson,Peja Stojakovic,Boris Diaw,Gerald Wallace,Nazr Mohammed,Raymond Felton,Stephen Jackson,1,4:37,CHA,shot,Stephen Jackson,,,,,,,,,Nazr Mohammed,2,,,made,,alley oop dunk,25,6
Darren Collison,David West,Emeka Okafor,Morris Peterson,Peja Stojakovic,Boris Diaw,Gerald Wallace,Nazr Mohammed,Raymond Felton,Stephen Jackson,1,4:21,NOH,shot,Darren Collison,,,,,,,,,Peja Stojakovic,3,,,made,,3pt,32,31
Darren Collison,David West,Emeka Okafor,Morris Peterson,Peja Stojakovic,Boris Diaw,Gerald Wallace,Nazr Mohammed,Raymond Felton,Stephen Jackson,1,3:55,NOH,foul,,,,,,,,Nazr Mohammed,,David West,,,,,,shooting,,
Darren Collison,David West,Emeka Okafor,Morris Peterson,Peja Stojakovic,Boris Diaw,Gerald Wallace,Nazr Mohammed,Raymond Felton,Stephen Jackson,1,3:55,CHA,timeout,,,,,,,,,,,,,,,,regular,,
Darren Collison,David West,Emeka Okafor,Morris Peterson,Peja Stojakovic,Boris Diaw,Gerald Wallace,Nazr Mohammed,Raymond Felton,Stephen Jackson,1,3:55,CHA,free throw,,,,,,,1,,2,Nazr Mohammed,,,foul,made,,,,
Darren Collison,David West,Emeka Okafor,Morris Peterson,Peja Stojakovic,Boris Diaw,Gerald Wallace,Nazr Mohammed,Raymond Felton,Stephen Jackson,1,3:55,CHA,free throw,,,,,,,2,,2,Nazr Mohammed,,,foul,missed,,,,
Darren Collison,David West,Emeka Okafor,Morris Peterson,Peja Stojakovic,Boris Diaw,Gerald Wallace,Nazr Mohammed,Raymond Felton,Stephen Jackson,1,3:55,CHA,rebound,,,,,,,,,,Boris Diaw,,,,,,off,,
Darren Collison,David West,Emeka Okafor,Morris Peterson,Peja Stojakovic,Boris Diaw,Gerald Wallace,Nazr Mohammed,Raymond Felton,Stephen Jackson,1,3:51,CHA,shot,Boris Diaw,,,,,,,,,Stephen Jackson,3,,,made,,3pt,33,30
Darren Collison,David West,Emeka Okafor,Morris Peterson,Peja Stojakovic,Boris Diaw,Gerald Wallace,Nazr Mohammed,Raymond Felton,Stephen Jackson,1,3:31,NOH,shot,,,,,,,,,,David West,,,,missed,,jump,11,8
Darren Collison,David West,Emeka Okafor,Morris Peterson,Peja Stojakovic,Boris Diaw,Gerald Wallace,Nazr Mohammed,Raymond Felton,Stephen Jackson,1,3:30,CHA,rebound,,,,,,,,,,Nazr Mohammed,,,,,,def,,
Darren Collison,David West,Emeka Okafor,Morris Peterson,Peja Stojakovic,Boris Diaw,Gerald Wallace,Nazr Mohammed,Raymond Felton,Stephen Jackson,1,3:15,CHA,shot,,,,,,,,,,Stephen Jackson,,,,missed,,jump,27,13
Darren Collison,David West,Emeka Okafor,Morris Peterson,Peja Stojakovic,Boris Diaw,Gerald Wallace,Nazr Mohammed,Raymond Felton,Stephen Jackson,1,3:14,NOH,rebound,,,,,,,,,,David West,,,,,,def,,
Darren Collison,David West,Emeka Okafor,Morris Peterson,Peja Stojakovic,Boris Diaw,Gerald Wallace,Nazr Mohammed,Raymond Felton,Stephen Jackson,1,3:02,CHA,violation,,,,,,,,,,Stephen Jackson,,,,,,kicked ball,,
Darren Collison,David West,Emeka Okafor,Morris Peterson,Peja Stojakovic,Boris Diaw,Gerald Wallace,Nazr Mohammed,Raymond Felton,Stephen Jackson,1,2:53,NOH,shot,,,,,,,,,,Darren Collison,,,,missed,,jump,9,19
Darren Collison,David West,Emeka Okafor,Morris Peterson,Peja Stojakovic,Boris Diaw,Gerald Wallace,Nazr Mohammed,Raymond Felton,Stephen Jackson,1,2:52,CHA,rebound,,,,,,,,,,Gerald Wallace,,,,,,def,,
Darren Collison,David West,Emeka Okafor,Morris Peterson,Peja Stojakovic,Boris Diaw,Gerald Wallace,Nazr Mohammed,Raymond Felton,Stephen Jackson,1,2:46,CHA,turnover,,,,,,,,,,Boris Diaw,,,traveling,,,,,
Darren Collison,David West,Emeka Okafor,Morris Peterson,Peja Stojakovic,Boris Diaw,Gerald Wallace,Nazr Mohammed,Raymond Felton,Stephen Jackson,1,2:46,NOH,timeout,,,,,,,,,,,,,,,,regular,,
Darren Collison,David West,Emeka Okafor,Morris Peterson,Peja Stojakovic,Boris Diaw,Gerald Wallace,Nazr Mohammed,Raymond Felton,Stephen Jackson,1,2:24,NOH,shot,,,Nazr Mohammed,,,,,,,David West,,,,missed,,layup,25,6
Darren Collison,David West,Emeka Okafor,Morris Peterson,Peja Stojakovic,Boris Diaw,Gerald Wallace,Nazr Mohammed,Raymond Felton,Stephen Jackson,1,2:23,CHA,rebound,,,,,,,,,,Raymond Felton,,,,,,def,,
Darren Collison,David West,Emeka Okafor,Morris Peterson,Peja Stojakovic,Boris Diaw,Gerald Wallace,Nazr Mohammed,Raymond Felton,Stephen Jackson,1,2:17,CHA,shot,Raymond Felton,,,,,,,,,Boris Diaw,2,,,made,,layup,25,6
Darren Collison,David West,Emeka Okafor,Morris Peterson,Peja Stojakovic,Boris Diaw,Gerald Wallace,Nazr Mohammed,Raymond Felton,Stephen Jackson,1,2:17,NOH,foul,,,,,,,,Boris Diaw,,Morris Peterson,,,,,,shooting,,
Darren Collison,David West,Emeka Okafor,Morris Peterson,Peja Stojakovic,Boris Diaw,Gerald Wallace,Nazr Mohammed,Raymond Felton,Stephen Jackson,1,2:17,CHA,free throw,,,,,,,1,,1,Boris Diaw,,,foul,made,,,,
Darren Collison,David West,Emeka Okafor,Morris Peterson,Peja Stojakovic,Boris Diaw,Gerald Wallace,Nazr Mohammed,Raymond Felton,Stephen Jackson,1,2:02,NOH,shot,,,,,,,,,,Morris Peterson,,,,missed,,3pt,13,29
Darren Collison,David West,Emeka Okafor,Morris Peterson,Peja Stojakovic,Boris Diaw,Gerald Wallace,Nazr Mohammed,Raymond Felton,Stephen Jackson,1,2:01,CHA,rebound,,,,,,,,,,Gerald Wallace,,,,,,def,,
Darren Collison,David West,Emeka Okafor,Morris Peterson,Peja Stojakovic,Boris Diaw,Gerald Wallace,Nazr Mohammed,Raymond Felton,Stephen Jackson,1,1:44,CHA,shot,Raymond Felton,,,,,,,,,Gerald Wallace,2,,,made,,alley oop dunk,25,6
Darren Collison,David West,Emeka Okafor,Morris Peterson,Peja Stojakovic,Boris Diaw,Gerald Wallace,Nazr Mohammed,Raymond Felton,Stephen Jackson,1,1:29,NOH,shot,,,,,,,,,,Peja Stojakovic,,,,missed,,3pt,33,30
Darren Collison,David West,Emeka Okafor,Morris Peterson,Peja Stojakovic,Boris Diaw,Gerald Wallace,Nazr Mohammed,Raymond Felton,Stephen Jackson,1,1:28,CHA,rebound,,,,,,,,,,Boris Diaw,,,,,,def,,
Darren Collison,David West,Emeka Okafor,Morris Peterson,Peja Stojakovic,Boris Diaw,Gerald Wallace,Nazr Mohammed,Raymond Felton,Stephen Jackson,1,1:15,CHA,shot,Boris Diaw,,,,,,,,,Nazr Mohammed,2,,,made,,jump bank,15,10
Darren Collison,David West,Emeka Okafor,Morris Peterson,Peja Stojakovic,Boris Diaw,Gerald Wallace,Nazr Mohammed,Raymond Felton,Stephen Jackson,1,0:53,NOH,shot,,,,,,,,,,Emeka Okafor,,,,missed,,jump,25,13
Darren Collison,David West,Emeka Okafor,Morris Peterson,Peja Stojakovic,Boris Diaw,Gerald Wallace,Nazr Mohammed,Raymond Felton,Stephen Jackson,1,0:53,CHA,rebound,,,,,,,,,,Nazr Mohammed,,,,,,def,,
Darren Collison,David West,Emeka Okafor,Morris Peterson,Peja Stojakovic,Boris Diaw,Gerald Wallace,Nazr Mohammed,Raymond Felton,Stephen Jackson,1,0:37,NOH,foul,,,,,,,,Gerald Wallace,,Darren Collison,,,,,,personal,,
Darren Collison,David West,Emeka Okafor,Morris Peterson,Peja Stojakovic,Boris Diaw,Gerald Wallace,Nazr Mohammed,Raymond Felton,Stephen Jackson,1,0:32,CHA,turnover,,,,,,,,,,Stephen Jackson,,,bad pass,,,,,
Darren Collison,David West,Emeka Okafor,Morris Peterson,Peja Stojakovic,Boris Diaw,Gerald Wallace,Nazr Mohammed,Raymond Felton,Stephen Jackson,1,0:24,NOH,shot,Darren Collison,,,,,,,,,Emeka Okafor,2,,,made,,alley oop layup,25,6
Darren Collison,David West,Emeka Okafor,Morris Peterson,Peja Stojakovic,Boris Diaw,Gerald Wallace,Nazr Mohammed,Raymond Felton,Stephen Jackson,1,0:03,CHA,shot,,,,,,,,,,Raymond Felton,,,,missed,,3pt,22,32
Darren Collison,David West,Emeka Okafor,Morris Peterson,Peja Stojakovic,Boris Diaw,Gerald Wallace,Nazr Mohammed,Raymond Felton,Stephen Jackson,1,0:00,CHA,rebound,,,,,,,,,,Stephen Jackson,,,,,,off,,
Darius Songaila,Darren Collison,David West,James Posey,Peja Stojakovic,Boris Diaw,D.J. Augustin,Gerald Wallace,Ronald Murray,Stephen Jackson,2,11:52,NOH,turnover,,,,,,,,,,David West,,,bad pass,,Stephen Jackson,,,
Darius Songaila,Darren Collison,David West,James Posey,Peja Stojakovic,Boris Diaw,D.J. Augustin,Gerald Wallace,Ronald Murray,Stephen Jackson,2,11:42,CHA,shot,,,James Posey,,,,,,,Ronald Murray,,,,missed,,layup,25,6
Darius Songaila,Darren Collison,David West,James Posey,Peja Stojakovic,Boris Diaw,D.J. Augustin,Gerald Wallace,Ronald Murray,Stephen Jackson,2,11:38,CHA,rebound,,,,,,,,,,,,,,,,,,
Darius Songaila,Darren Collison,David West,James Posey,Peja Stojakovic,Boris Diaw,D.J. Augustin,Gerald Wallace,Ronald Murray,Stephen Jackson,2,11:27,CHA,shot,D.J. Augustin,,,,,,,,,Gerald Wallace,2,,,made,,jump,25,24
Darius Songaila,Darren Collison,David West,James Posey,Peja Stojakovic,Boris Diaw,D.J. Augustin,Gerald Wallace,Ronald Murray,Stephen Jackson,2,11:01,NOH,shot,,,,,,,,,,Darren Collison,,,,missed,,jump,30,18
Darius Songaila,Darren Collison,David West,James Posey,Peja Stojakovic,Boris Diaw,D.J. Augustin,Gerald Wallace,Ronald Murray,Stephen Jackson,2,10:57,CHA,rebound,,,,,,,,,,Stephen Jackson,,,,,,def,,
Darius Songaila,Darren Collison,David West,James Posey,Peja Stojakovic,Boris Diaw,D.J. Augustin,Gerald Wallace,Ronald Murray,Stephen Jackson,2,10:47,CHA,shot,,,,,,,,,,Stephen Jackson,,,,missed,,jump,33,24
Darius Songaila,Darren Collison,David West,James Posey,Peja Stojakovic,Boris Diaw,D.J. Augustin,Gerald Wallace,Ronald Murray,Stephen Jackson,2,10:45,NOH,rebound,,,,,,,,,,David West,,,,,,def,,
Darius Songaila,Darren Collison,David West,James Posey,Peja Stojakovic,Boris Diaw,D.J. Augustin,Gerald Wallace,Ronald Murray,Stephen Jackson,2,10:39,NOH,shot,,,,,,,,,,Darren Collison,2,,,made,,jump,20,26
Darius Songaila,Darren Collison,David West,James Posey,Peja Stojakovic,Boris Diaw,D.J. Augustin,Gerald Wallace,Ronald Murray,Stephen Jackson,2,10:17,CHA,shot,,,,,,,,,,Ronald Murray,2,,,made,,layup,25,6
Darius Songaila,Darren Collison,David West,James Posey,Peja Stojakovic,Boris Diaw,D.J. Augustin,Gerald Wallace,Ronald Murray,Stephen Jackson,2,10:17,NOH,foul,,,,,,,,Ronald Murray,,James Posey,,,,,,shooting,,
Darius Songaila,David West,James Posey,Jason Hart,Peja Stojakovic,Boris Diaw,D.J. Augustin,Gerald Wallace,Ronald Murray,Stephen Jackson,2,10:17,NOH,sub,,,,Jason Hart,,Darren Collison,,,,,,,,,,,,
Darius Songaila,David West,James Posey,Jason Hart,Peja Stojakovic,Boris Diaw,D.J. Augustin,Gerald Wallace,Ronald Murray,Stephen Jackson,2,10:17,CHA,free throw,,,,,,,1,,1,Ronald Murray,,,foul,missed,,,,
Darius Songaila,David West,James Posey,Jason Hart,Peja Stojakovic,Boris Diaw,D.J. Augustin,Gerald Wallace,Ronald Murray,Stephen Jackson,2,10:17,NOH,rebound,,,,,,,,,,Darius Songaila,,,,,,def,,
Darius Songaila,David West,James Posey,Jason Hart,Peja Stojakovic,Boris Diaw,D.J. Augustin,Gerald Wallace,Ronald Murray,Stephen Jackson,2,10:17,NOH,turnover,,,,,,,,,,Jason Hart,,,bad pass,,Stephen Jackson,,,
Darius Songaila,David West,James Posey,Jason Hart,Peja Stojakovic,Boris Diaw,D.J. Augustin,Gerald Wallace,Ronald Murray,Stephen Jackson,2,10:04,NOH,foul,,,,,,,,D.J. Augustin,,Jason Hart,,,,,,shooting,,
Darius Songaila,David West,James Posey,Jason Hart,Peja Stojakovic,Boris Diaw,D.J. Augustin,Gerald Wallace,Ronald Murray,Stephen Jackson,2,10:04,CHA,free throw,,,,,,,1,,2,D.J. Augustin,,,foul,made,,,,
Darius Songaila,David West,James Posey,Jason Hart,Peja Stojakovic,Boris Diaw,D.J. Augustin,Gerald Wallace,Ronald Murray,Stephen Jackson,2,10:04,CHA,free throw,,,,,,,2,,2,D.J. Augustin,,,foul,made,,,,
Darius Songaila,David West,James Posey,Jason Hart,Peja Stojakovic,Boris Diaw,D.J. Augustin,Gerald Wallace,Ronald Murray,Stephen Jackson,2,9:54,NOH,shot,,,,,,,,,,Darius Songaila,,,,missed,,jump,15,8
Darius Songaila,David West,James Posey,Jason Hart,Peja Stojakovic,Boris Diaw,D.J. Augustin,Gerald Wallace,Ronald Murray,Stephen Jackson,2,9:53,CHA,rebound,,,,,,,,,,,,,,,,,,
Darius Songaila,David West,James Posey,Jason Hart,Peja Stojakovic,Boris Diaw,D.J. Augustin,Gerald Wallace,Ronald Murray,Stephen Jackson,2,9:32,CHA,shot,,,,,,,,,,Stephen Jackson,,,,missed,,layup,25,6
Darius Songaila,David West,James Posey,Jason Hart,Peja Stojakovic,Boris Diaw,D.J. Augustin,Gerald Wallace,Ronald Murray,Stephen Jackson,2,9:31,NOH,rebound,,,,,,,,,,James Posey,,,,,,def,,
Darius Songaila,David West,James Posey,Jason Hart,Peja Stojakovic,Boris Diaw,D.J. Augustin,Gerald Wallace,Ronald Murray,Stephen Jackson,2,9:25,NOH,shot,Jason Hart,,,,,,,,,Darius Songaila,2,,,made,,jump,9,9
Darius Songaila,David West,James Posey,Jason Hart,Peja Stojakovic,Boris Diaw,D.J. Augustin,Gerald Wallace,Ronald Murray,Stephen Jackson,2,9:04,CHA,shot,,,,,,,,,,Boris Diaw,,,,missed,,jump,33,24
Darius Songaila,David West,James Posey,Jason Hart,Peja Stojakovic,Boris Diaw,D.J. Augustin,Gerald Wallace,Ronald Murray,Stephen Jackson,2,9:03,NOH,rebound,,,,,,,,,,James Posey,,,,,,def,,
Darius Songaila,David West,James Posey,Jason Hart,Peja Stojakovic,Boris Diaw,D.J. Augustin,Gerald Wallace,Ronald Murray,Stephen Jackson,2,8:56,NOH,timeout,,,,,,,,,,,,,,,,regular,,
Darius Songaila,David West,James Posey,Jason Hart,Peja Stojakovic,Boris Diaw,D.J. Augustin,Gerald Wallace,Ronald Murray,Stephen Graham,2,8:56,CHA,sub,,,,Stephen Graham,,Stephen Jackson,,,,,,,,,,,,
Darius Songaila,David West,James Posey,Jason Hart,Peja Stojakovic,Boris Diaw,D.J. Augustin,Gerald Wallace,Ronald Murray,Stephen Graham,2,8:47,CHA,foul,,,,,,,,David West,,D.J. Augustin,,,,,,shooting,,
Darius Songaila,David West,James Posey,Jason Hart,Peja Stojakovic,Boris Diaw,D.J. Augustin,Gerald Wallace,Ronald Murray,Stephen Graham,2,8:47,NOH,free throw,,,,,,,1,,2,David West,,,foul,made,,,,
Darius Songaila,David West,James Posey,Jason Hart,Julian Wright,Boris Diaw,D.J. Augustin,Gerald Wallace,Ronald Murray,Stephen Graham,2,8:47,NOH,sub,,,,Julian Wright,,Peja Stojakovic,,,,,,,,,,,,
Darius Songaila,David West,James Posey,Jason Hart,Julian Wright,Boris Diaw,D.J. Augustin,Gerald Wallace,Ronald Murray,Stephen Graham,2,8:47,NOH,free throw,,,,,,,2,,2,David West,,,foul,made,,,,