a1,a2,a3,a4,a5,h1,h2,h3,h4,h5,period,time,team,etype,assist,away,block,entered,home,left,num,opponent,outof,player,points,possession,reason,result,steal,type,x,y
Marc Gasol,Mike Conley,O.J. Mayo,Rudy Gay,Zach Randolph,Al Jefferson,Corey Brewer,Jonny Flynn,Ryan Gomes,Ryan Hollins,1,12:00,OFF,jump ball,,Marc Gasol,,,Ryan Hollins,,,,,,,Zach Randolph,,,,,,
Marc Gasol,Mike Conley,O.J. Mayo,Rudy Gay,Zach Randolph,Al Jefferson,Corey Brewer,Jonny Flynn,Ryan Gomes,Ryan Hollins,1,11:37,MEM,shot,,,,,,,,,,Mike Conley,,,,missed,,jump,17,19
Marc Gasol,Mike Conley,O.J. Mayo,Rudy Gay,Zach Randolph,Al Jefferson,Corey Brewer,Jonny Flynn,Ryan Gomes,Ryan Hollins,1,11:35,MIN,rebound,,,,,,,,,,Ryan Hollins,,,,,,def,,
Marc Gasol,Mike Conley,O.J. Mayo,Rudy Gay,Zach Randolph,Al Jefferson,Corey Brewer,Jonny Flynn,Ryan Gomes,Ryan Hollins,1,11:21,MIN,shot,,,,,,,,,,Ryan Gomes,2,,,made,,running jump,23,16
Marc Gasol,Mike Conley,O.J. Mayo,Rudy Gay,Zach Randolph,Al Jefferson,Corey Brewer,Jonny Flynn,Ryan Gomes,Ryan Hollins,1,11:04,MEM,turnover,,,,,,,,,,Mike Conley,,,bad pass,,Jonny Flynn,,,
Marc Gasol,Mike Conley,O.J. Mayo,Rudy Gay,Zach Randolph,Al Jefferson,Corey Brewer,Jonny Flynn,Ryan Gomes,Ryan Hollins,1,11:00,MIN,shot,Ryan Gomes,,,,,,,,,Jonny Flynn,2,,,made,,driving layup,25,6
Marc Gasol,Mike Conley,O.J. Mayo,Rudy Gay,Zach Randolph,Al Jefferson,Corey Brewer,Jonny Flynn,Ryan Gomes,Ryan Hollins,1,10:39,MEM,turnover,,,,,,,,,,O.J. Mayo,,,lost ball,,Corey Brewer,,,
Marc Gasol,Mike Conley,O.J. Mayo,Rudy Gay,Zach Randolph,Al Jefferson,Corey Brewer,Jonny Flynn,Ryan Gomes,Ryan Hollins,1,10:23,MIN,shot,,,,,,,,,,Corey Brewer,2,,,made,,running hook,20,11
Marc Gasol,Mike Conley,O.J. Mayo,Rudy Gay,Zach Randolph,Al Jefferson,Corey Brewer,Jonny Flynn,Ryan Gomes,Ryan Hollins,1,10:13,MEM,shot,,,,,,,,,,Marc Gasol,,,,missed,,layup,25,6
Marc Gasol,Mike Conley,O.J. Mayo,Rudy Gay,Zach Randolph,Al Jefferson,Corey Brewer,Jonny Flynn,Ryan Gomes,Ryan Hollins,1,10:12,MEM,rebound,,,,,,,,,,Marc Gasol,,,,,,off,,
Marc Gasol,Mike Conley,O.J. Mayo,Rudy Gay,Zach Randolph,Al Jefferson,Corey Brewer,Jonny Flynn,Ryan Gomes,Ryan Hollins,1,10:10,MEM,shot,,,,,,,,,,Marc Gasol,,,,missed,,reverse layup,25,6
Marc Gasol,Mike Conley,O.J. Mayo,Rudy Gay,Zach Randolph,Al Jefferson,Corey Brewer,Jonny Flynn,Ryan Gomes,Ryan Hollins,1,10:09,MIN,rebound,,,,,,,,,,Corey Brewer,,,,,,def,,
Marc Gasol,Mike Conley,O.J. Mayo,Rudy Gay,Zach Randolph,Al Jefferson,Corey Brewer,Jonny Flynn,Ryan Gomes,Ryan Hollins,1,10:03,MIN,shot,,,,,,,,,,Corey Brewer,,,,missed,,layup,25,6
Marc Gasol,Mike Conley,O.J. Mayo,Rudy Gay,Zach Randolph,Al Jefferson,Corey Brewer,Jonny Flynn,Ryan Gomes,Ryan Hollins,1,10:02,MEM,rebound,,,,,,,,,,Zach Randolph,,,,,,def,,
Marc Gasol,Mike Conley,O.J. Mayo,Rudy Gay,Zach Randolph,Al Jefferson,Corey Brewer,Jonny Flynn,Ryan Gomes,Ryan Hollins,1,9:41,MEM,shot,,,,,,,,,,Zach Randolph,,,,missed,,jump,39,9
Marc Gasol,Mike Conley,O.J. Mayo,Rudy Gay,Zach Randolph,Al Jefferson,Corey Brewer,Jonny Flynn,Ryan Gomes,Ryan Hollins,1,9:40,MEM,rebound,,,,,,,,,,,,,,,,,,
Marc Gasol,Mike Conley,O.J. Mayo,Rudy Gay,Zach Randolph,Al Jefferson,Corey Brewer,Jonny Flynn,Ryan Gomes,Ryan Hollins,1,9:31,MEM,shot,Marc Gasol,,,,,,,,,Rudy Gay,2,,,made,,jump,25,26
Marc Gasol,Mike Conley,O.J. Mayo,Rudy Gay,Zach Randolph,Al Jefferson,Corey Brewer,Jonny Flynn,Ryan Gomes,Ryan Hollins,1,9:16,MIN,turnover,,,,,,,,,,Ryan Hollins,,,bad pass,,Rudy Gay,,,
Marc Gasol,Mike Conley,O.J. Mayo,Rudy Gay,Zach Randolph,Al Jefferson,Corey Brewer,Jonny Flynn,Ryan Gomes,Ryan Hollins,1,9:12,MEM,shot,,,,,,,,,,Rudy Gay,2,,,made,,driving slam dunk,25,6
Marc Gasol,Mike Conley,O.J. Mayo,Rudy Gay,Zach Randolph,Al Jefferson,Corey Brewer,Jonny Flynn,Ryan Gomes,Ryan Hollins,1,8:57,MIN,shot,,,,,,,,,,Al Jefferson,,,,missed,,layup,25,6
Marc Gasol,Mike Conley,O.J. Mayo,Rudy Gay,Zach Randolph,Al Jefferson,Corey Brewer,Jonny Flynn,Ryan Gomes,Ryan Hollins,1,8:56,MEM,rebound,,,,,,,,,,Zach Randolph,,,,,,def,,
Marc Gasol,Mike Conley,O.J. Mayo,Rudy Gay,Zach Randolph,Al Jefferson,Corey Brewer,Jonny Flynn,Ryan Gomes,Ryan Hollins,1,8:51,MEM,shot,Mike Conley,,,,,,,,,O.J. Mayo,2,,,made,,driving layup,25,6
Marc Gasol,Mike Conley,O.J. Mayo,Rudy Gay,Zach Randolph,Al Jefferson,Corey Brewer,Jonny Flynn,Ryan Gomes,Ryan Hollins,1,8:38,MEM,foul,,,,,,,,Ryan Hollins,,Zach Randolph,,,,,,personal,,
Marc Gasol,Mike Conley,O.J. Mayo,Rudy Gay,Zach Randolph,Al Jefferson,Corey Brewer,Jonny Flynn,Ryan Gomes,Ryan Hollins,1,8:28,MIN,shot,,,,,,,,,,Corey Brewer,,,,missed,,3pt,8,25
Marc Gasol,Mike Conley,O.J. Mayo,Rudy Gay,Zach Randolph,Al Jefferson,Corey Brewer,Jonny Flynn,Ryan Gomes,Ryan Hollins,1,8:27,MEM,rebound,,,,,,,,,,Zach Randolph,,,,,,def,,
Marc Gasol,Mike Conley,O.J. Mayo,Rudy Gay,Zach Randolph,Al Jefferson,Corey Brewer,Jonny Flynn,Ryan Gomes,Ryan Hollins,1,8:13,MEM,shot,,,,,,,,,,Zach Randolph,,,,missed,,jump,29,21
Marc Gasol,Mike Conley,O.J. Mayo,Rudy Gay,Zach Randolph,Al Jefferson,Corey Brewer,Jonny Flynn,Ryan Gomes,Ryan Hollins,1,8:12,MIN,rebound,,,,,,,,,,Corey Brewer,,,,,,def,,
Marc Gasol,Mike Conley,O.J. Mayo,Rudy Gay,Zach Randolph,Al Jefferson,Corey Brewer,Jonny Flynn,Ryan Gomes,Ryan Hollins,1,7:57,MIN,shot,,,,,,,,,,Ryan Gomes,,,,missed,,3pt,5,19
Marc Gasol,Mike Conley,O.J. Mayo,Rudy Gay,Zach Randolph,Al Jefferson,Corey Brewer,Jonny Flynn,Ryan Gomes,Ryan Hollins,1,7:56,MEM,rebound,,,,,,,,,,Zach Randolph,,,,,,def,,
Marc Gasol,Mike Conley,O.J. Mayo,Rudy Gay,Zach Randolph,Al Jefferson,Corey Brewer,Jonny Flynn,Ryan Gomes,Ryan Hollins,1,7:51,MIN,violation,,,,,,,,,,Jonny Flynn,,,,,,kicked ball,,
Marc Gasol,Mike Conley,O.J. Mayo,Rudy Gay,Zach Randolph,Al Jefferson,Corey Brewer,Jonny Flynn,Ryan Gomes,Ryan Hollins,1,7:40,MEM,shot,Marc Gasol,,,,,,,,,Zach Randolph,2,,,made,,layup,25,6
Marc Gasol,Mike Conley,O.J. Mayo,Rudy Gay,Zach Randolph,Al Jefferson,Corey Brewer,Jonny Flynn,Ryan Gomes,Ryan Hollins,1,7:40,MIN,foul,,,,,,,,Zach Randolph,,Ryan Hollins,,,,,,shooting,,
Marc Gasol,Mike Conley,O.J. Mayo,Rudy Gay,Zach Randolph,Al Jefferson,Corey Brewer,Jonny Flynn,Ryan Gomes,Ryan Hollins,1,7:40,MEM,free throw,,,,,,,1,,1,Zach Randolph,,,foul,missed,,,,
Marc Gasol,Mike Conley,O.J. Mayo,Rudy Gay,Zach Randolph,Al Jefferson,Corey Brewer,Jonny Flynn,Ryan Gomes,Ryan Hollins,1,7:39,MIN,rebound,,,,,,,,,,,,,,,,,,
Marc Gasol,Mike Conley,O.J. Mayo,Rudy Gay,Zach Randolph,Al Jefferson,Corey Brewer,Jonny Flynn,Ryan Gomes,Ryan Hollins,1,7:27,MIN,shot,,,,,,,,,,Corey Brewer,,,,missed,,jump,37,6
Marc Gasol,Mike Conley,O.J. Mayo,Rudy Gay,Zach Randolph,Al Jefferson,Corey Brewer,Jonny Flynn,Ryan Gomes,Ryan Hollins,1,7:26,MEM,rebound,,,,,,,,,,Zach Randolph,,,,,,def,,
Marc Gasol,Mike Conley,O.J. Mayo,Rudy Gay,Zach Randolph,Al Jefferson,Corey Brewer,Jonny Flynn,Ryan Gomes,Ryan Hollins,1,7:16,MEM,shot,,,,,,,,,,Mike Conley,,,,missed,,jump,25,12
Marc Gasol,Mike Conley,O.J. Mayo,Rudy Gay,Zach Randolph,Al Jefferson,Corey Brewer,Jonny Flynn,Ryan Gomes,Ryan Hollins,1,7:15,MEM,rebound,,,,,,,,,,Marc Gasol,,,,,,off,,
Marc Gasol,Mike Conley,O.J. Mayo,Rudy Gay,Zach Randolph,Al Jefferson,Corey Brewer,Jonny Flynn,Ryan Gomes,Ryan Hollins,1,7:13,MEM,shot,,,,,,,,,,Marc Gasol,,,,missed,,layup,25,6
Marc Gasol,Mike Conley,O.J. Mayo,Rudy Gay,Zach Randolph,Al Jefferson,Corey Brewer,Jonny Flynn,Ryan Gomes,Ryan Hollins,1,7:12,MIN,rebound,,,,,,,,,,Al Jefferson,,,,,,def,,
Marc Gasol,Mike Conley,O.J. Mayo,Rudy Gay,Zach Randolph,Al Jefferson,Corey Brewer,Jonny Flynn,Ryan Gomes,Ryan Hollins,1,6:56,MEM,foul,,,,,,,,Al Jefferson,,Marc Gasol,,,,,,shooting,,
Marc Gasol,Mike Conley,O.J. Mayo,Rudy Gay,Zach Randolph,Al Jefferson,Corey Brewer,Jonny Flynn,Ryan Gomes,Ryan Hollins,1,6:56,MIN,free throw,,,,,,,1,,2,Al Jefferson,,,foul,missed,,,,
Marc Gasol,Mike Conley,O.J. Mayo,Rudy Gay,Zach Randolph,Al Jefferson,Corey Brewer,Jonny Flynn,Ryan Gomes,Ryan Hollins,1,6:56,MIN,rebound,,,,,,,,,,,,,,,,,,
Marc Gasol,Mike Conley,O.J. Mayo,Rudy Gay,Zach Randolph,Al Jefferson,Corey Brewer,Jonny Flynn,Ryan Gomes,Ryan Hollins,1,6:56,MIN,free throw,,,,,,,2,,2,Al Jefferson,,,foul,missed,,,,
Marc Gasol,Mike Conley,O.J. Mayo,Rudy Gay,Zach Randolph,Al Jefferson,Corey Brewer,Jonny Flynn,Ryan Gomes,Ryan Hollins,1,6:55,MEM,rebound,,,,,,,,,,Zach Randolph,,,,,,def,,
Marc Gasol,Mike Conley,O.J. Mayo,Rudy Gay,Zach Randolph,Al Jefferson,Corey Brewer,Jonny Flynn,Ryan Gomes,Ryan Hollins,1,6:43,MEM,shot,,,,,,,,,,Rudy Gay,,,,missed,,jump,23,25
Marc Gasol,Mike Conley,O.J. Mayo,Rudy Gay,Zach Randolph,Al Jefferson,Corey Brewer,Jonny Flynn,Ryan Gomes,Ryan Hollins,1,6:42,MIN,rebound,,,,,,,,,,Ryan Hollins,,,,,,def,,
Marc Gasol,Mike Conley,O.J. Mayo,Rudy Gay,Zach Randolph,Al Jefferson,Corey Brewer,Jonny Flynn,Ryan Gomes,Ryan Hollins,1,6:33,MEM,foul,,,,,,,,Jonny Flynn,,Mike Conley,,,,,,shooting,,
Marc Gasol,Mike Conley,O.J. Mayo,Rudy Gay,Zach Randolph,Al Jefferson,Corey Brewer,Jonny Flynn,Ryan Gomes,Ryan Hollins,1,6:33,MIN,free throw,,,,,,,1,,2,Jonny Flynn,,,foul,made,,,,
Marc Gasol,Mike Conley,O.J. Mayo,Rudy Gay,Zach Randolph,Corey Brewer,Jonny Flynn,Kevin Love,Ryan Gomes,Ryan Hollins,1,6:33,MIN,sub,,,,Kevin Love,,Al Jefferson,,,,,,,,,,,,
Marc Gasol,Mike Conley,O.J. Mayo,Rudy Gay,Zach Randolph,Corey Brewer,Jonny Flynn,Kevin Love,Ryan Gomes,Ryan Hollins,1,6:33,MIN,free throw,,,,,,,2,,2,Jonny Flynn,,,foul,made,,,,
Marc Gasol,Mike Conley,O.J. Mayo,Rudy Gay,Zach Randolph,Corey Brewer,Jonny Flynn,Kevin Love,Ryan Gomes,Ryan Hollins,1,6:17,MEM,shot,Zach Randolph,,,,,,,,,O.J. Mayo,2,,,made,,reverse layup,25,6
Marc Gasol,Mike Conley,O.J. Mayo,Rudy Gay,Zach Randolph,Corey Brewer,Jonny Flynn,Kevin Love,Ryan Gomes,Ryan Hollins,1,6:15,MIN,turnover,,,,,,,,,,Kevin Love,,,bad pass,,,,,
Marc Gasol,Mike Conley,O.J. Mayo,Rudy Gay,Zach Randolph,Corey Brewer,Jonny Flynn,Kevin Love,Ryan Gomes,Ryan Hollins,1,6:08,MEM,turnover,,,,,,,,,,Mike Conley,,,bad pass,,Corey Brewer,,,
Marc Gasol,Mike Conley,O.J. Mayo,Rudy Gay,Zach Randolph,Corey Brewer,Jonny Flynn,Kevin Love,Ryan Gomes,Ryan Hollins,1,5:52,MIN,shot,,,,,,,,,,Kevin Love,,,,missed,,jump,35,22
Marc Gasol,Mike Conley,O.J. Mayo,Rudy Gay,Zach Randolph,Corey Brewer,Jonny Flynn,Kevin Love,Ryan Gomes,Ryan Hollins,1,5:51,MEM,rebound,,,,,,,,,,Rudy Gay,,,,,,def,,
Marc Gasol,Mike Conley,O.J. Mayo,Rudy Gay,Zach Randolph,Corey Brewer,Jonny Flynn,Kevin Love,Ryan Gomes,Ryan Hollins,1,5:41,MEM,shot,Zach Randolph,,,,,,,,,Mike Conley,2,,,made,,layup,25,6
Marc Gasol,Mike Conley,O.J. Mayo,Rudy Gay,Zach Randolph,Corey Brewer,Jonny Flynn,Kevin Love,Ryan Gomes,Ryan Hollins,1,5:32,MIN,shot,Jonny Flynn,,,,,,,,,Ryan Gomes,3,,,made,,3pt,2,12
Marc Gasol,Mike Conley,O.J. Mayo,Rudy Gay,Zach Randolph,Corey Brewer,Jonny Flynn,Kevin Love,Ryan Gomes,Ryan Hollins,1,5:08,MEM,shot,,,,,,,,,,Mike Conley,2,,,made,,driving layup,25,6
Marc Gasol,Mike Conley,O.J. Mayo,Rudy Gay,Zach Randolph,Corey Brewer,Jonny Flynn,Kevin Love,Ryan Gomes,Ryan Hollins,1,4:58,MIN,timeout,,,,,,,,,,,,,,,,regular,,
Marc Gasol,Mike Conley,O.J. Mayo,Rudy Gay,Zach Randolph,Corey Brewer,Jonny Flynn,Kevin Love,Ryan Gomes,Ryan Hollins,1,4:52,MIN,shot,,,,,,,,,,Jonny Flynn,,,,missed,,jump,40,10
Marc Gasol,Mike Conley,O.J. Mayo,Rudy Gay,Zach Randolph,Corey Brewer,Jonny Flynn,Kevin Love,Ryan Gomes,Ryan Hollins,1,4:51,MEM,rebound,,,,,,,,,,Rudy Gay,,,,,,def,,
Marc Gasol,Mike Conley,O.J. Mayo,Rudy Gay,Zach Randolph,Corey Brewer,Jonny Flynn,Kevin Love,Ryan Gomes,Ryan Hollins,1,4:48,MEM,turnover,,,,,,,,,,O.J. Mayo,,,out of bounds lost ball turnover,,,,,
Marc Gasol,Mike Conley,O.J. Mayo,Rudy Gay,Zach Randolph,Corey Brewer,Jonny Flynn,Kevin Love,Ryan Gomes,Ryan Hollins,1,4:29,MIN,shot,,,,,,,,,,Ryan Hollins,,,,missed,,reverse layup,25,6
Marc Gasol,Mike Conley,O.J. Mayo,Rudy Gay,Zach Randolph,Corey Brewer,Jonny Flynn,Kevin Love,Ryan Gomes,Ryan Hollins,1,4:28,MIN,rebound,,,,,,,,,,Kevin Love,,,,,,off,,
Marc Gasol,Mike Conley,O.J. Mayo,Rudy Gay,Zach Randolph,Corey Brewer,Jonny Flynn,Kevin Love,Ryan Gomes,Ryan Hollins,1,4:28,MIN,shot,,,,,,,,,,Kevin Love,,,,missed,,tip,25,6
Marc Gasol,Mike Conley,O.J. Mayo,Rudy Gay,Zach Randolph,Corey Brewer,Jonny Flynn,Kevin Love,Ryan Gomes,Ryan Hollins,1,4:27,MEM,rebound,,,,,,,,,,Rudy Gay,,,,,,def,,
Marc Gasol,Mike Conley,O.J. Mayo,Rudy Gay,Zach Randolph,Corey Brewer,Jonny Flynn,Kevin Love,Ryan Gomes,Ryan Hollins,1,4:17,MEM,shot,,,,,,,,,,Zach Randolph,,,,missed,,jump,12,8
Marc Gasol,Mike Conley,O.J. Mayo,Rudy Gay,Zach Randolph,Corey Brewer,Jonny Flynn,Kevin Love,Ryan Gomes,Ryan Hollins,1,4:16,MIN,rebound,,,,,,,,,,Corey Brewer,,,,,,def,,
Marc Gasol,Mike Conley,O.J. Mayo,Rudy Gay,Zach Randolph,Corey Brewer,Jonny Flynn,Kevin Love,Ryan Gomes,Ryan Hollins,1,4:03,MIN,shot,,,,,,,,,,Corey Brewer,,,,missed,,layup,25,6
Marc Gasol,Mike Conley,O.J. Mayo,Rudy Gay,Zach Randolph,Corey Brewer,Jonny Flynn,Kevin Love,Ryan Gomes,Ryan Hollins,1,4:02,MEM,rebound,,,,,,,,,,Mike Conley,,,,,,def,,
Marc Gasol,Mike Conley,O.J. Mayo,Rudy Gay,Zach Randolph,Corey Brewer,Jonny Flynn,Kevin Love,Ryan Gomes,Ryan Hollins,1,3:56,MEM,shot,Mike Conley,,,,,,,,,O.J. Mayo,2,,,made,,layup,25,6
Marc Gasol,Mike Conley,O.J. Mayo,Rudy Gay,Zach Randolph,Corey Brewer,Jonny Flynn,Kevin Love,Ryan Gomes,Ryan Hollins,1,3:42,MIN,shot,Jonny Flynn,,,,,,,,,Ryan Gomes,3,,,made,,3pt,6,22
Marc Gasol,Mike Conley,O.J. Mayo,Rudy Gay,Zach Randolph,Corey Brewer,Jonny Flynn,Kevin Love,Ryan Gomes,Ryan Hollins,1,3:15,MEM,shot,,,,,,,,,,Rudy Gay,2,,,made,,turnaround fade away,9,8
Marc Gasol,Mike Conley,O.J. Mayo,Rudy Gay,Zach Randolph,Corey Brewer,Jonny Flynn,Kevin Love,Ryan Gomes,Ryan Hollins,1,2:57,MIN,shot,,,,,,,,,,Ryan Gomes,,,,missed,,jump,7,7
Marc Gasol,Mike Conley,O.J. Mayo,Rudy Gay,Zach Randolph,Corey Brewer,Jonny Flynn,Kevin Love,Ryan Gomes,Ryan Hollins,1,2:56,MEM,rebound,,,,,,,,,,Marc Gasol,,,,,,def,,
Marc Gasol,Mike Conley,O.J. Mayo,Rudy Gay,Zach Randolph,Corey Brewer,Jonny Flynn,Kevin Love,Ryan Gomes,Ryan Hollins,1,2:46,MEM,shot,O.J. Mayo,,,,,,,,,Mike Conley,3,,,made,,3pt,2,7
Marc Gasol,Mike Conley,O.J. Mayo,Rudy Gay,Zach Randolph,Corey Brewer,Jonny Flynn,Kevin Love,Ryan Gomes,Ryan Hollins,1,2:29,MIN,shot,,,,,,,,,,Corey Brewer,,,,missed,,3pt,32,30
Marc Gasol,Mike Conley,O.J. Mayo,Rudy Gay,Zach Randolph,Corey Brewer,Jonny Flynn,Kevin Love,Ryan Gomes,Ryan Hollins,1,2:28,MIN,rebound,,,,,,,,,,Kevin Love,,,,,,off,,
Marc Gasol,Mike Conley,O.J. Mayo,Rudy Gay,Zach Randolph,Corey Brewer,Jonny Flynn,Kevin Love,Ryan Gomes,Ryan Hollins,1,2:17,MIN,shot,Jonny Flynn,,,,,,,,,Ryan Gomes,3,,,made,,3pt,21,31
Marc Gasol,Mike Conley,O.J. Mayo,Rudy Gay,Zach Randolph,Corey Brewer,Jonny Flynn,Kevin Love,Ryan Gomes,Ryan Hollins,1,2:01,MIN,foul,,,,,,,,Marc Gasol,,Ryan Hollins,,,,,,shooting,,
Marc Gasol,Mike Conley,O.J. Mayo,Rudy Gay,Zach Randolph,Corey Brewer,Jonny Flynn,Kevin Love,Ryan Gomes,Ryan Hollins,1,2:01,MEM,timeout,,,,,,,,,,,,,,,,regular,,
Marc Gasol,Mike Conley,O.J. Mayo,Rudy Gay,Zach Randolph,Corey Brewer,Damien Wilkins,Jonny Flynn,Kevin Love,Ryan Hollins,1,2:01,MIN,sub,,,,Damien Wilkins,,Ryan Gomes,,,,,,,,,,,,
Marc Gasol,Mike Conley,O.J. Mayo,Rudy Gay,Zach Randolph,Corey Brewer,Damien Wilkins,Jonny Flynn,Kevin Love,Ramon Sessions,1,2:01,MIN,sub,,,,Ramon Sessions,,Ryan Hollins,,,,,,,,,,,,
Marc Gasol,Mike Conley,O.J. Mayo,Rudy Gay,Zach Randolph,Damien Wilkins,Jonny Flynn,Kevin Love,Ramon Sessions,Wayne Ellington,1,2:01,MIN,sub,,,,Wayne Ellington,,Corey Brewer,,,,,,,,,,,,
Marc Gasol,Mike Conley,O.J. Mayo,Rudy Gay,Zach Randolph,Al Jefferson,Damien Wilkins,Kevin Love,Ramon Sessions,Wayne Ellington,1,2:01,MIN,sub,,,,Al Jefferson,,Jonny Flynn,,,,,,,,,,,,
Marc Gasol,Mike Conley,O.J. Mayo,Rudy Gay,Zach Randolph,Al Jefferson,Damien Wilkins,Kevin Love,Ramon Sessions,Wayne Ellington,1,2:01,MEM,free throw,,,,,,,1,,2,Marc Gasol,,,foul,made,,,,
Marc Gasol,Marcus Williams,O.J. Mayo,Rudy Gay,Zach Randolph,Al Jefferson,Damien Wilkins,Kevin Love,Ramon Sessions,Wayne Ellington,1,2:01,MEM,sub,,,,Marcus Williams,,Mike Conley,,,,,,,,,,,,
Marc Gasol,Marcus Williams,Rudy Gay,Sam Young,Zach Randolph,Al Jefferson,Damien Wilkins,Kevin Love,Ramon Sessions,Wayne Ellington,1,2:01,MEM,sub,,,,Sam Young,,O.J. Mayo,,,,,,,,,,,,
Marc Gasol,Marcus Williams,Rudy Gay,Sam Young,Zach Randolph,Al Jefferson,Damien Wilkins,Kevin Love,Ramon Sessions,Wayne Ellington,1,2:01,MEM,free throw,,,,,,,2,,2,Marc Gasol,,,foul,made,,,,
Marc Gasol,Marcus Williams,Rudy Gay,Sam Young,Zach Randolph,Al Jefferson,Damien Wilkins,Kevin Love,Ramon Sessions,Wayne Ellington,1,1:50,MIN,shot,,,,,,,,,,Ramon Sessions,,,,missed,,driving reverse layup,25,6
Marc Gasol,Marcus Williams,Rudy Gay,Sam Young,Zach Randolph,Al Jefferson,Damien Wilkins,Kevin Love,Ramon Sessions,Wayne Ellington,1,1:49,MEM,rebound,,,,,,,,,,Zach Randolph,,,,,,def,,
Marc Gasol,Marcus Williams,Rudy Gay,Sam Young,Zach Randolph,Al Jefferson,Damien Wilkins,Kevin Love,Ramon Sessions,Wayne Ellington,1,1:38,MEM,shot,,,,,,,,,,Zach Randolph,2,,,made,,jump,40,12
Marc Gasol,Marcus Williams,Rudy Gay,Sam Young,Zach Randolph,Al Jefferson,Damien Wilkins,Kevin Love,Ramon Sessions,Wayne Ellington,1,1:18,MIN,shot,,,,,,,,,,Al Jefferson,,,,missed,,jump,12,15
Marc Gasol,Marcus Williams,Rudy Gay,Sam Young,Zach Randolph,Al Jefferson,Damien Wilkins,Kevin Love,Ramon Sessions,Wayne Ellington,1,1:17,MEM,rebound,,,,,,,,,,Rudy Gay,,,,,,def,,
Marc Gasol,Marcus Williams,Rudy Gay,Sam Young,Zach Randolph,Al Jefferson,Damien Wilkins,Kevin Love,Ramon Sessions,Wayne Ellington,1,1:09,MEM,turnover,,,,,,,,,,Marcus Williams,,,bad pass,,,,,
Marc Gasol,Marcus Williams,Rudy Gay,Sam Young,Zach Randolph,Al Jefferson,Damien Wilkins,Kevin Love,Ramon Sessions,Wayne Ellington,1,0:57,MIN,shot,,,,,,,,,,Kevin Love,,,,missed,,3pt,13,29
Marc Gasol,Marcus Williams,Rudy Gay,Sam Young,Zach Randolph,Al Jefferson,Damien Wilkins,Kevin Love,Ramon Sessions,Wayne Ellington,1,0:56,MEM,rebound,,,,,,,,,,Marcus Williams,,,,,,def,,
Marc Gasol,Marcus Williams,Rudy Gay,Sam Young,Zach Randolph,Al Jefferson,Damien Wilkins,Kevin Love,Ramon Sessions,Wayne Ellington,1,0:38,MEM,shot,,,,,,,,,,Rudy Gay,,,,missed,,3pt,39,28
Marc Gasol,Marcus Williams,Rudy Gay,Sam Young,Zach Randolph,Al Jefferson,Damien Wilkins,Kevin Love,Ramon Sessions,Wayne Ellington,1,0:37,MIN,rebound,,,,,,,,,,Al Jefferson,,,,,,def,,
Marc Gasol,Marcus Williams,Rudy Gay,Sam Young,Zach Randolph,Al Jefferson,Damien Wilkins,Kevin Love,Ramon Sessions,Wayne Ellington,1,0:25,MIN,shot,,,,,,,,,,Wayne Ellington,,,,missed,,jump,10,21
Marc Gasol,Marcus Williams,Rudy Gay,Sam Young,Zach Randolph,Al Jefferson,Damien Wilkins,Kevin Love,Ramon Sessions,Wayne Ellington,1,0:24,MEM,rebound,,,,,,,,,,Zach Randolph,,,,,,def,,
Marc Gasol,Marcus Williams,Rudy Gay,Sam Young,Zach Randolph,Al Jefferson,Damien Wilkins,Kevin Love,Ramon Sessions,Wayne Ellington,1,0:00,MEM,shot,,,,,,,,,,Marcus Williams,2,,,made,,running jump,22,14
Hasheem Thabeet,Marcus Williams,Rudy Gay,Sam Young,Zach Randolph,Al Jefferson,Damien Wilkins,Kevin Love,Ramon Sessions,Wayne Ellington,2,11:50,MIN,turnover,,,,,,,,,,Ramon Sessions,,,bad pass,,Zach Randolph,,,
Hasheem Thabeet,Marcus Williams,Rudy Gay,Sam Young,Zach Randolph,Al Jefferson,Damien Wilkins,Kevin Love,Ramon Sessions,Wayne Ellington,2,11:37,MIN,foul,,,,,,,,Rudy Gay,,Damien Wilkins,,,,,,personal,,
Hasheem Thabeet,Marcus Williams,Rudy Gay,Sam Young,Zach Randolph,Al Jefferson,Damien Wilkins,Kevin Love,Ramon Sessions,Wayne Ellington,2,11:24,MEM,shot,Rudy Gay,,,,,,,,,Marcus Williams,3,,,made,,3pt,11,26
Hasheem Thabeet,Marcus Williams,Rudy Gay,Sam Young,Zach Randolph,Al Jefferson,Damien Wilkins,Kevin Love,Ramon Sessions,Wayne Ellington,2,11:06,MIN,shot,Wayne Ellington,,,,,,,,,Kevin Love,2,,,made,,jump hook,31,11
Hasheem Thabeet,Marcus Williams,Rudy Gay,Sam Young,Zach Randolph,Al Jefferson,Damien Wilkins,Kevin Love,Ramon Sessions,Wayne Ellington,2,10:51,MEM,shot,,,,,,,,,,Sam Young,,,,missed,,jump,32,10
Hasheem Thabeet,Marcus Williams,Rudy Gay,Sam Young,Zach Randolph,Al Jefferson,Damien Wilkins,Kevin Love,Ramon Sessions,Wayne Ellington,2,10:50,MIN,rebound,,,,,,,,,,Damien Wilkins,,,,,,def,,
Hasheem Thabeet,Marcus Williams,Rudy Gay,Sam Young,Zach Randolph,Al Jefferson,Damien Wilkins,Kevin Love,Ramon Sessions,Wayne Ellington,2,10:37,MIN,shot,,,,,,,,,,Al Jefferson,,,,missed,,jump,30,12
Hasheem Thabeet,Marcus Williams,Rudy Gay,Sam Young,Zach Randolph,Al Jefferson,Damien Wilkins,Kevin Love,Ramon Sessions,Wayne Ellington,2,10:36,MIN,rebound,,,,,,,,,,Kevin Love,,,,,,off,,
Hasheem Thabeet,Marcus Williams,Rudy Gay,Sam Young,Zach Randolph,Al Jefferson,Damien Wilkins,Kevin Love,Ramon Sessions,Wayne Ellington,2,10:35,MEM,foul,,,,,,,,Kevin Love,,Hasheem Thabeet,,,,,,shooting,,
Hasheem Thabeet,Marcus Williams,Rudy Gay,Sam Young,Zach Randolph,Al Jefferson,Damien Wilkins,Kevin Love,Ramon Sessions,Wayne Ellington,2,10:35,MIN,free throw,,,,,,,1,,2,Kevin Love,,,foul,made,,,,
Hasheem Thabeet,Marcus Williams,Rudy Gay,Sam Young,Zach Randolph,Al Jefferson,Damien Wilkins,Kevin Love,Ramon Sessions,Wayne Ellington,2,10:35,MIN,free throw,,,,,,,2,,2,Kevin Love,,,foul,made,,,,
Hasheem Thabeet,Marcus Williams,Rudy Gay,Sam Young,Zach Randolph,Al Jefferson,Damien Wilkins,Kevin Love,Ramon Sessions,Wayne Ellington,2,10:11,MEM,shot,,,,,,,,,,Zach Randolph,2,,,made,,jump bank,42,19
Hasheem Thabeet,Marcus Williams,Rudy Gay,Sam Young,Zach Randolph,Al Jefferson,Damien Wilkins,Kevin Love,Ramon Sessions,Wayne Ellington,2,10:05,MIN,shot,,,,,,,,,,Ramon Sessions,2,,,made,,driving layup,25,6
Hasheem Thabeet,Marcus Williams,Rudy Gay,Sam Young,Zach Randolph,Al Jefferson,Damien Wilkins,Kevin Love,Ramon Sessions,Wayne Ellington,2,9:42,MEM,shot,,,,,,,,,,Sam Young,,,,missed,,layup,25,6
Hasheem Thabeet,Marcus Williams,Rudy Gay,Sam Young,Zach Randolph,Al Jefferson,Damien Wilkins,Kevin Love,Ramon Sessions,Wayne Ellington,2,9:41,MEM,rebound,,,,,,,,,,Rudy Gay,,,,,,off,,
Hasheem Thabeet,Marcus Williams,Rudy Gay,Sam Young,Zach Randolph,Al Jefferson,Damien Wilkins,Kevin Love,Ramon Sessions,Wayne Ellington,2,9:32,MEM,turnover,,,,,,,,,,Rudy Gay,,,bad pass,,Al Jefferson,,,
Hasheem Thabeet,Marcus Williams,Rudy Gay,Sam Young,Zach Randolph,Al Jefferson,Damien Wilkins,Kevin Love,Ramon Sessions,Wayne Ellington,2,9:27,MIN,shot,,,Rudy Gay,,,,,,,Ramon Sessions,,,,missed,,layup,25,6
Hasheem Thabeet,Marcus Williams,Rudy Gay,Sam Young,Zach Randolph,Al Jefferson,Damien Wilkins,Kevin Love,Ramon Sessions,Wayne Ellington,2,9:26,MIN,rebound,,,,,,,,,,Wayne Ellington,,,,,,off,,
Hasheem Thabeet,Marcus Williams,Rudy Gay,Sam Young,Zach Randolph,Al Jefferson,Damien Wilkins,Kevin Love,Ramon Sessions,Wayne Ellington,2,9:25,MIN,shot,,,,,,,,,,Wayne Ellington,2,,,made,,layup,25,6
Hasheem Thabeet,Marc Gasol,Marcus Williams,Rudy Gay,Sam Young,Al Jefferson,Damien Wilkins,Kevin Love,Ramon Sessions,Wayne Ellington,2,9:02,MEM,sub,,,,Marc Gasol,,Zach Randolph,,,,,,,,,,,,
Hasheem Thabeet,Marc Gasol,Marcus Williams,O.J. Mayo,Sam Young,Al Jefferson,Damien Wilkins,Kevin Love,Ramon Sessions,Wayne Ellington,2,9:02,MEM,sub,,,,O.J. Mayo,,Rudy Gay,,,,,,,,,,,,
Hasheem Thabeet,Marc Gasol,Marcus Williams,O.J. Mayo,Sam Young,Al Jefferson,Damien Wilkins,Kevin Love,Ramon Sessions,Wayne Ellington,2,8:58,MEM,shot,,,,,,,,,,O.J. Mayo,,,,missed,,jump,8,8
Hasheem Thabeet,Marc Gasol,Marcus Williams,O.J. Mayo,Sam Young,Al Jefferson,Damien Wilkins,Kevin Love,Ramon Sessions,Wayne Ellington,2,8:57,MEM,rebound,,,,,,,,,,,,,,,,,,
Hasheem Thabeet,Marc Gasol,Marcus Williams,O.J. Mayo,Sam Young,Al Jefferson,Damien Wilkins,Kevin Love,Ramon Sessions,Wayne Ellington,2,8:57,MIN,foul,,,,,,,,Hasheem Thabeet,,Kevin Love,,,,,,loose ball,,
Hasheem Thabeet,Marc Gasol,Marcus Williams,O.J. Mayo,Sam Young,Al Jefferson,Damien Wilkins,Kevin Love,Ramon Sessions,Wayne Ellington,2,8:57,MEM,timeout,,,,,,,,,,,,,,,,,,
Hasheem Thabeet,Marc Gasol,Marcus Williams,O.J. Mayo,Sam Young,Al Jefferson,Damien Wilkins,Kevin Love,Ramon Sessions,Wayne Ellington,2,8:51,MEM,shot,,,,,,,,,,Marc Gasol,2,,,made,,hook,25,11
Hasheem Thabeet,Marc Gasol,Marcus Williams,O.J. Mayo,Sam Young,Al Jefferson,Damien Wilkins,Kevin Love,Ramon Sessions,Wayne Ellington,2,8:51,MIN,foul,,,,,,,,Marc Gasol,,Kevin Love,,,,,,shooting,,