a1,a2,a3,a4,a5,h1,h2,h3,h4,h5,period,time,team,etype,assist,away,block,entered,home,left,num,opponent,outof,player,points,possession,reason,result,steal,type,x,y
Aaron Brooks,Chuck Hayes,Luis Scola,Shane Battier,Trevor Ariza,Marc Gasol,Mike Conley,O.J. Mayo,Rudy Gay,Zach Randolph,1,12:00,OFF,jump ball,,Luis Scola,,,Marc Gasol,,,,,,,Zach Randolph,,,,,,
Aaron Brooks,Chuck Hayes,Luis Scola,Shane Battier,Trevor Ariza,Marc Gasol,Mike Conley,O.J. Mayo,Rudy Gay,Zach Randolph,1,11:43,MEM,shot,,,,,,,,,,Zach Randolph,2,,,made,,jump bank,31,12
Aaron Brooks,Chuck Hayes,Luis Scola,Shane Battier,Trevor Ariza,Marc Gasol,Mike Conley,O.J. Mayo,Rudy Gay,Zach Randolph,1,11:18,HOU,shot,,,,,,,,,,Trevor Ariza,,,,missed,,jump,11,20
Aaron Brooks,Chuck Hayes,Luis Scola,Shane Battier,Trevor Ariza,Marc Gasol,Mike Conley,O.J. Mayo,Rudy Gay,Zach Randolph,1,11:16,MEM,rebound,,,,,,,,,,Mike Conley,,,,,,def,,
Aaron Brooks,Chuck Hayes,Luis Scola,Shane Battier,Trevor Ariza,Marc Gasol,Mike Conley,O.J. Mayo,Rudy Gay,Zach Randolph,1,11:07,MEM,shot,,,Luis Scola,,,,,,,Marc Gasol,,,,missed,,turnaround jump,24,12
Aaron Brooks,Chuck Hayes,Luis Scola,Shane Battier,Trevor Ariza,Marc Gasol,Mike Conley,O.J. Mayo,Rudy Gay,Zach Randolph,1,11:05,HOU,rebound,,,,,,,,,,Trevor Ariza,,,,,,def,,
Aaron Brooks,Chuck Hayes,Luis Scola,Shane Battier,Trevor Ariza,Marc Gasol,Mike Conley,O.J. Mayo,Rudy Gay,Zach Randolph,1,11:02,MEM,foul,,,,,,,,Trevor Ariza,,Rudy Gay,,,,,,shooting,,
Aaron Brooks,Chuck Hayes,Luis Scola,Shane Battier,Trevor Ariza,Marc Gasol,Mike Conley,O.J. Mayo,Rudy Gay,Zach Randolph,1,11:02,HOU,free throw,,,,,,,1,,2,Trevor Ariza,,,foul,missed,,,,
Aaron Brooks,Chuck Hayes,Luis Scola,Shane Battier,Trevor Ariza,Marc Gasol,Mike Conley,O.J. Mayo,Rudy Gay,Zach Randolph,1,11:02,HOU,rebound,,,,,,,,,,,,,,,,,,
Aaron Brooks,Chuck Hayes,Luis Scola,Shane Battier,Trevor Ariza,Marc Gasol,Mike Conley,O.J. Mayo,Rudy Gay,Zach Randolph,1,11:02,HOU,free throw,,,,,,,2,,2,Trevor Ariza,,,foul,made,,,,
Aaron Brooks,Chuck Hayes,Luis Scola,Shane Battier,Trevor Ariza,Marc Gasol,Mike Conley,O.J. Mayo,Rudy Gay,Zach Randolph,1,10:44,MEM,shot,Zach Randolph,,,,,,,,,O.J. Mayo,2,,,made,,layup,25,6
Aaron Brooks,Chuck Hayes,Luis Scola,Shane Battier,Trevor Ariza,Marc Gasol,Mike Conley,O.J. Mayo,Rudy Gay,Zach Randolph,1,10:33,HOU,foul,,,,,,,,Marc Gasol,,Luis Scola,,,,,,offensive,,
Aaron Brooks,Chuck Hayes,Luis Scola,Shane Battier,Trevor Ariza,Marc Gasol,Mike Conley,O.J. Mayo,Rudy Gay,Zach Randolph,1,10:33,HOU,turnover,,,,,,,,,,Luis Scola,,,foul,,,,,
Aaron Brooks,Chuck Hayes,Luis Scola,Shane Battier,Trevor Ariza,Marc Gasol,Mike Conley,O.J. Mayo,Rudy Gay,Zach Randolph,1,10:17,MEM,shot,Rudy Gay,,,,,,,,,Zach Randolph,2,,,made,,jump,23,25
Aaron Brooks,Chuck Hayes,Luis Scola,Shane Battier,Trevor Ariza,Marc Gasol,Mike Conley,O.J. Mayo,Rudy Gay,Zach Randolph,1,10:05,HOU,shot,,,,,,,,,,Aaron Brooks,,,,missed,,3pt,16,30
Aaron Brooks,Chuck Hayes,Luis Scola,Shane Battier,Trevor Ariza,Marc Gasol,Mike Conley,O.J. Mayo,Rudy Gay,Zach Randolph,1,10:04,HOU,rebound,,,,,,,,,,Luis Scola,,,,,,off,,
Aaron Brooks,Chuck Hayes,Luis Scola,Shane Battier,Trevor Ariza,Marc Gasol,Mike Conley,O.J. Mayo,Rudy Gay,Zach Randolph,1,10:02,HOU,shot,,,,,,,,,,Luis Scola,2,,,made,,layup,25,6
Aaron Brooks,Chuck Hayes,Luis Scola,Shane Battier,Trevor Ariza,Marc Gasol,Mike Conley,O.J. Mayo,Rudy Gay,Zach Randolph,1,9:50,MEM,shot,Marc Gasol,,,,,,,,,Rudy Gay,2,,,made,,layup,25,6
Aaron Brooks,Chuck Hayes,Luis Scola,Shane Battier,Trevor Ariza,Marc Gasol,Mike Conley,O.J. Mayo,Rudy Gay,Zach Randolph,1,9:34,HOU,turnover,,,,,,,,,,Trevor Ariza,,,lost ball,,Mike Conley,,,
Aaron Brooks,Chuck Hayes,Luis Scola,Shane Battier,Trevor Ariza,Marc Gasol,Mike Conley,O.J. Mayo,Rudy Gay,Zach Randolph,1,9:30,HOU,foul,,,,,,,,Rudy Gay,,Aaron Brooks,,,,,,shooting,,
Aaron Brooks,Chuck Hayes,Luis Scola,Shane Battier,Trevor Ariza,Marc Gasol,Mike Conley,O.J. Mayo,Rudy Gay,Zach Randolph,1,9:30,MEM,free throw,,,,,,,1,,2,Rudy Gay,,,foul,made,,,,
Aaron Brooks,Chuck Hayes,Luis Scola,Shane Battier,Trevor Ariza,Marc Gasol,Mike Conley,O.J. Mayo,Rudy Gay,Zach Randolph,1,9:30,MEM,free throw,,,,,,,2,,2,Rudy Gay,,,foul,made,,,,
Aaron Brooks,Chuck Hayes,Luis Scola,Shane Battier,Trevor Ariza,Marc Gasol,Mike Conley,O.J. Mayo,Rudy Gay,Zach Randolph,1,9:11,HOU,shot,,,,,,,,,,Aaron Brooks,2,,,made,,driving layup,25,6
Aaron Brooks,Chuck Hayes,Luis Scola,Shane Battier,Trevor Ariza,Marc Gasol,Mike Conley,O.J. Mayo,Rudy Gay,Zach Randolph,1,8:53,MEM,shot,,,,,,,,,,Rudy Gay,2,,,made,,running jump,18,14
Aaron Brooks,Chuck Hayes,Luis Scola,Shane Battier,Trevor Ariza,Marc Gasol,Mike Conley,O.J. Mayo,Rudy Gay,Zach Randolph,1,8:42,HOU,shot,Chuck Hayes,,,,,,,,,Trevor Ariza,2,,,made,,dunk,25,6
Aaron Brooks,Chuck Hayes,Luis Scola,Shane Battier,Trevor Ariza,Marc Gasol,Mike Conley,O.J. Mayo,Rudy Gay,Zach Randolph,1,8:24,MEM,shot,,,Chuck Hayes,,,,,,,Marc Gasol,,,,missed,,layup,25,6
Aaron Brooks,Chuck Hayes,Luis Scola,Shane Battier,Trevor Ariza,Marc Gasol,Mike Conley,O.J. Mayo,Rudy Gay,Zach Randolph,1,8:22,HOU,rebound,,,,,,,,,,Luis Scola,,,,,,def,,
Aaron Brooks,Chuck Hayes,Luis Scola,Shane Battier,Trevor Ariza,Marc Gasol,Mike Conley,O.J. Mayo,Rudy Gay,Zach Randolph,1,8:15,HOU,shot,Luis Scola,,,,,,,,,Chuck Hayes,2,,,made,,reverse layup,25,6
Aaron Brooks,Chuck Hayes,Luis Scola,Shane Battier,Trevor Ariza,Marc Gasol,Mike Conley,O.J. Mayo,Rudy Gay,Zach Randolph,1,8:02,MEM,foul,,,,,,,,Chuck Hayes,,Rudy Gay,,,,,,offensive,,
Aaron Brooks,Chuck Hayes,Luis Scola,Shane Battier,Trevor Ariza,Marc Gasol,Mike Conley,O.J. Mayo,Rudy Gay,Zach Randolph,1,8:02,MEM,turnover,,,,,,,,,,Rudy Gay,,,foul,,,,,
Aaron Brooks,Chuck Hayes,Luis Scola,Shane Battier,Trevor Ariza,Marc Gasol,Mike Conley,O.J. Mayo,Rudy Gay,Zach Randolph,1,7:43,HOU,shot,Shane Battier,,,,,,,,,Luis Scola,2,,,made,,jump,23,26
Aaron Brooks,Chuck Hayes,Luis Scola,Shane Battier,Trevor Ariza,Marc Gasol,Mike Conley,O.J. Mayo,Rudy Gay,Zach Randolph,1,7:16,MEM,shot,,,,,,,,,,Mike Conley,,,,missed,,3pt,47,9
Aaron Brooks,Chuck Hayes,Luis Scola,Shane Battier,Trevor Ariza,Marc Gasol,Mike Conley,O.J. Mayo,Rudy Gay,Zach Randolph,1,7:15,HOU,rebound,,,,,,,,,,Shane Battier,,,,,,def,,
Aaron Brooks,Chuck Hayes,Luis Scola,Shane Battier,Trevor Ariza,Marc Gasol,Mike Conley,O.J. Mayo,Rudy Gay,Zach Randolph,1,7:12,HOU,turnover,,,,,,,,,,Shane Battier,,,lost ball,,Mike Conley,,,
Aaron Brooks,Chuck Hayes,Luis Scola,Shane Battier,Trevor Ariza,Marc Gasol,Mike Conley,O.J. Mayo,Rudy Gay,Zach Randolph,1,7:10,MEM,foul,,,,,,,,Shane Battier,,Marc Gasol,,,,,,offensive,,
Aaron Brooks,Chuck Hayes,Luis Scola,Shane Battier,Trevor Ariza,Marc Gasol,Mike Conley,O.J. Mayo,Rudy Gay,Zach Randolph,1,7:10,MEM,turnover,,,,,,,,,,Marc Gasol,,,foul,,,,,
Aaron Brooks,Chuck Hayes,Luis Scola,Shane Battier,Trevor Ariza,Marc Gasol,Mike Conley,O.J. Mayo,Sam Young,Zach Randolph,1,7:10,MEM,sub,,,,Sam Young,,Rudy Gay,,,,,,,,,,,,
Aaron Brooks,Chuck Hayes,Luis Scola,Shane Battier,Trevor Ariza,Marc Gasol,Mike Conley,O.J. Mayo,Sam Young,Zach Randolph,1,6:53,HOU,shot,,,,,,,,,,Luis Scola,2,,,made,,jump,25,12
Aaron Brooks,Chuck Hayes,Luis Scola,Shane Battier,Trevor Ariza,Marc Gasol,Mike Conley,O.J. Mayo,Sam Young,Zach Randolph,1,6:46,MEM,shot,,,Chuck Hayes,,,,,,,O.J. Mayo,,,,missed,,jump,18,9
Aaron Brooks,Chuck Hayes,Luis Scola,Shane Battier,Trevor Ariza,Marc Gasol,Mike Conley,O.J. Mayo,Sam Young,Zach Randolph,1,6:46,MEM,rebound,,,,,,,,,,,,,,,,,,
Aaron Brooks,Chuck Hayes,Luis Scola,Shane Battier,Trevor Ariza,Marc Gasol,Mike Conley,O.J. Mayo,Sam Young,Zach Randolph,1,6:38,MEM,turnover,,,,,,,,,,O.J. Mayo,,,bad pass,,Trevor Ariza,,,
Aaron Brooks,Chuck Hayes,Luis Scola,Shane Battier,Trevor Ariza,Marc Gasol,Mike Conley,O.J. Mayo,Sam Young,Zach Randolph,1,6:27,HOU,shot,Aaron Brooks,,,,,,,,,Trevor Ariza,3,,,made,,3pt,2,7
Aaron Brooks,Chuck Hayes,Luis Scola,Shane Battier,Trevor Ariza,Marc Gasol,Mike Conley,O.J. Mayo,Sam Young,Zach Randolph,1,6:19,MEM,timeout,,,,,,,,,,,,,,,,regular,,
Aaron Brooks,Chuck Hayes,Luis Scola,Shane Battier,Trevor Ariza,Marc Gasol,Mike Conley,O.J. Mayo,Sam Young,Zach Randolph,1,6:07,MEM,shot,,,Luis Scola,,,,,,,Marc Gasol,,,,missed,,layup,25,6
Aaron Brooks,Chuck Hayes,Luis Scola,Shane Battier,Trevor Ariza,Marc Gasol,Mike Conley,O.J. Mayo,Sam Young,Zach Randolph,1,6:05,MEM,rebound,,,,,,,,,,Marc Gasol,,,,,,off,,
Aaron Brooks,Chuck Hayes,Luis Scola,Shane Battier,Trevor Ariza,Marc Gasol,Mike Conley,O.J. Mayo,Sam Young,Zach Randolph,1,6:03,MEM,turnover,,,,,,,,,,Marc Gasol,,,lost ball,,Shane Battier,,,
Aaron Brooks,Chuck Hayes,Luis Scola,Shane Battier,Trevor Ariza,Marc Gasol,Mike Conley,O.J. Mayo,Sam Young,Zach Randolph,1,5:42,HOU,turnover,,,,,,,,,,Chuck Hayes,,,lost ball,,O.J. Mayo,,,
Aaron Brooks,Chuck Hayes,Luis Scola,Shane Battier,Trevor Ariza,Marc Gasol,Mike Conley,O.J. Mayo,Sam Young,Zach Randolph,1,5:36,MEM,shot,,,,,,,,,,O.J. Mayo,2,,,made,,driving finger roll layup,25,6
Aaron Brooks,Chuck Hayes,Luis Scola,Shane Battier,Trevor Ariza,Marc Gasol,Mike Conley,O.J. Mayo,Sam Young,Zach Randolph,1,5:29,HOU,shot,,,Zach Randolph,,,,,,,Trevor Ariza,,,,missed,,reverse layup,25,6
Aaron Brooks,Chuck Hayes,Luis Scola,Shane Battier,Trevor Ariza,Marc Gasol,Mike Conley,O.J. Mayo,Sam Young,Zach Randolph,1,5:26,MEM,rebound,,,,,,,,,,Zach Randolph,,,,,,def,,
Aaron Brooks,Chuck Hayes,Luis Scola,Shane Battier,Trevor Ariza,Marc Gasol,Mike Conley,O.J. Mayo,Sam Young,Zach Randolph,1,5:21,MEM,shot,Mike Conley,,,,,,,,,Sam Young,2,,,made,,layup,25,6
Aaron Brooks,Chuck Hayes,Luis Scola,Shane Battier,Trevor Ariza,Marc Gasol,Mike Conley,O.J. Mayo,Sam Young,Zach Randolph,1,5:12,HOU,shot,,,,,,,,,,Trevor Ariza,,,,missed,,3pt,48,12
Aaron Brooks,Chuck Hayes,Luis Scola,Shane Battier,Trevor Ariza,Marc Gasol,Mike Conley,O.J. Mayo,Sam Young,Zach Randolph,1,5:10,MEM,rebound,,,,,,,,,,Zach Randolph,,,,,,def,,
Aaron Brooks,Chuck Hayes,Luis Scola,Shane Battier,Trevor Ariza,Marc Gasol,Mike Conley,O.J. Mayo,Sam Young,Zach Randolph,1,4:56,HOU,foul,,,,,,,,Sam Young,,Chuck Hayes,,,,,,shooting,,
Aaron Brooks,Chuck Hayes,Luis Scola,Shane Battier,Trevor Ariza,Marc Gasol,Mike Conley,O.J. Mayo,Sam Young,Zach Randolph,1,4:56,MEM,free throw,,,,,,,1,,2,Sam Young,,,foul,made,,,,
Aaron Brooks,Chuck Hayes,Luis Scola,Shane Battier,Trevor Ariza,Marc Gasol,Mike Conley,O.J. Mayo,Sam Young,Zach Randolph,1,4:56,MEM,free throw,,,,,,,2,,2,Sam Young,,,foul,made,,,,
Aaron Brooks,Chuck Hayes,Luis Scola,Shane Battier,Trevor Ariza,Marc Gasol,Mike Conley,O.J. Mayo,Sam Young,Zach Randolph,1,4:35,HOU,turnover,,,,,,,,,,Luis Scola,,,bad pass,,Marc Gasol,,,
Aaron Brooks,Chuck Hayes,Luis Scola,Shane Battier,Trevor Ariza,Marc Gasol,Mike Conley,O.J. Mayo,Sam Young,Zach Randolph,1,4:29,MEM,shot,O.J. Mayo,,,,,,,,,Sam Young,2,,,made,,layup,25,6
Aaron Brooks,Chuck Hayes,Luis Scola,Shane Battier,Trevor Ariza,Marc Gasol,Mike Conley,O.J. Mayo,Sam Young,Zach Randolph,1,4:05,HOU,shot,,,,,,,,,,Trevor Ariza,,,,missed,,3pt,49,11
Aaron Brooks,Chuck Hayes,Luis Scola,Shane Battier,Trevor Ariza,Marc Gasol,Mike Conley,O.J. Mayo,Sam Young,Zach Randolph,1,4:04,HOU,rebound,,,,,,,,,,Luis Scola,,,,,,off,,
Aaron Brooks,Chuck Hayes,Luis Scola,Shane Battier,Trevor Ariza,Marc Gasol,Mike Conley,O.J. Mayo,Sam Young,Zach Randolph,1,3:59,HOU,shot,,,,,,,,,,Aaron Brooks,,,,missed,,3pt,12,27
Aaron Brooks,Chuck Hayes,Luis Scola,Shane Battier,Trevor Ariza,Marc Gasol,Mike Conley,O.J. Mayo,Sam Young,Zach Randolph,1,3:58,MEM,rebound,,,,,,,,,,Mike Conley,,,,,,def,,
Aaron Brooks,Chuck Hayes,Luis Scola,Shane Battier,Trevor Ariza,Marc Gasol,Mike Conley,O.J. Mayo,Sam Young,Zach Randolph,1,3:53,MEM,shot,,,,,,,,,,Mike Conley,2,,,made,,layup,25,6
Aaron Brooks,Chuck Hayes,Luis Scola,Shane Battier,Trevor Ariza,Marc Gasol,Mike Conley,O.J. Mayo,Sam Young,Zach Randolph,1,3:44,HOU,timeout,,,,,,,,,,,,,,,,regular,,
Aaron Brooks,Chuck Hayes,Kyle Lowry,Luis Scola,Trevor Ariza,Marc Gasol,Mike Conley,O.J. Mayo,Sam Young,Zach Randolph,1,3:44,HOU,sub,,,,Kyle Lowry,,Shane Battier,,,,,,,,,,,,
Aaron Brooks,Chuck Hayes,Kyle Lowry,Luis Scola,Trevor Ariza,Marc Gasol,Mike Conley,O.J. Mayo,Sam Young,Zach Randolph,1,3:34,HOU,shot,,,Marc Gasol,,,,,,,Aaron Brooks,,,,missed,,running layup,25,6
Aaron Brooks,Chuck Hayes,Kyle Lowry,Luis Scola,Trevor Ariza,Marc Gasol,Mike Conley,O.J. Mayo,Sam Young,Zach Randolph,1,3:32,MEM,rebound,,,,,,,,,,Marc Gasol,,,,,,def,,
Aaron Brooks,Chuck Hayes,Kyle Lowry,Luis Scola,Trevor Ariza,Marc Gasol,Mike Conley,O.J. Mayo,Sam Young,Zach Randolph,1,3:30,MEM,turnover,,,,,,,,,,Marc Gasol,,,lost ball,,Aaron Brooks,,,
Aaron Brooks,Chuck Hayes,Kyle Lowry,Luis Scola,Trevor Ariza,Marc Gasol,Mike Conley,O.J. Mayo,Sam Young,Zach Randolph,1,3:24,HOU,turnover,,,,,,,,,,Luis Scola,,,lost ball,,O.J. Mayo,,,
Aaron Brooks,Chuck Hayes,Kyle Lowry,Luis Scola,Trevor Ariza,Marc Gasol,Mike Conley,O.J. Mayo,Sam Young,Zach Randolph,1,3:21,MEM,shot,,,,,,,,,,O.J. Mayo,,,,missed,,pullup jump,20,12
Aaron Brooks,Chuck Hayes,Kyle Lowry,Luis Scola,Trevor Ariza,Marc Gasol,Mike Conley,O.J. Mayo,Sam Young,Zach Randolph,1,3:19,MEM,rebound,,,,,,,,,,Zach Randolph,,,,,,off,,
Aaron Brooks,Chuck Hayes,Kyle Lowry,Luis Scola,Trevor Ariza,Marc Gasol,Mike Conley,O.J. Mayo,Sam Young,Zach Randolph,1,3:19,MEM,shot,,,,,,,,,,Zach Randolph,,,,missed,,tip,25,6
Aaron Brooks,Chuck Hayes,Kyle Lowry,Luis Scola,Trevor Ariza,Marc Gasol,Mike Conley,O.J. Mayo,Sam Young,Zach Randolph,1,3:16,HOU,rebound,,,,,,,,,,Aaron Brooks,,,,,,def,,
Aaron Brooks,Chuck Hayes,Kyle Lowry,Luis Scola,Trevor Ariza,Marc Gasol,Mike Conley,O.J. Mayo,Sam Young,Zach Randolph,1,3:14,HOU,turnover,,,,,,,,,,Aaron Brooks,,,bad pass,,Marc Gasol,,,
Aaron Brooks,Chuck Hayes,Kyle Lowry,Luis Scola,Trevor Ariza,Marc Gasol,Mike Conley,O.J. Mayo,Sam Young,Zach Randolph,1,3:09,MEM,shot,,,,,,,,,,Mike Conley,2,,,made,,layup,25,6
Aaron Brooks,Chuck Hayes,Kyle Lowry,Luis Scola,Trevor Ariza,Marc Gasol,Mike Conley,O.J. Mayo,Sam Young,Zach Randolph,1,2:44,HOU,shot,,,,,,,,,,Trevor Ariza,,,,missed,,layup,25,6
Aaron Brooks,Chuck Hayes,Kyle Lowry,Luis Scola,Trevor Ariza,Marc Gasol,Mike Conley,O.J. Mayo,Sam Young,Zach Randolph,1,2:43,HOU,rebound,,,,,,,,,,Chuck Hayes,,,,,,off,,
Aaron Brooks,Chuck Hayes,Kyle Lowry,Luis Scola,Trevor Ariza,Marc Gasol,Mike Conley,O.J. Mayo,Sam Young,Zach Randolph,1,2:43,HOU,shot,,,,,,,,,,Chuck Hayes,2,,,made,,tip,25,6
Aaron Brooks,Chuck Hayes,Kyle Lowry,Luis Scola,Trevor Ariza,Marc Gasol,Mike Conley,O.J. Mayo,Sam Young,Zach Randolph,1,2:10,MEM,shot,,,,,,,,,,O.J. Mayo,,,,missed,,3pt,47,34
Aaron Brooks,Chuck Hayes,Kyle Lowry,Luis Scola,Trevor Ariza,Marc Gasol,Mike Conley,O.J. Mayo,Sam Young,Zach Randolph,1,2:08,HOU,rebound,,,,,,,,,,Trevor Ariza,,,,,,def,,
Aaron Brooks,Chuck Hayes,Kyle Lowry,Luis Scola,Trevor Ariza,Marc Gasol,Mike Conley,O.J. Mayo,Sam Young,Zach Randolph,1,1:55,HOU,shot,,,,,,,,,,Kyle Lowry,,,,missed,,3pt,47,5
Aaron Brooks,Chuck Hayes,Kyle Lowry,Luis Scola,Trevor Ariza,Marc Gasol,Mike Conley,O.J. Mayo,Sam Young,Zach Randolph,1,1:53,HOU,rebound,,,,,,,,,,Aaron Brooks,,,,,,off,,
Aaron Brooks,Chuck Hayes,Kyle Lowry,Luis Scola,Trevor Ariza,Marc Gasol,Mike Conley,O.J. Mayo,Sam Young,Zach Randolph,1,1:51,HOU,shot,Chuck Hayes,,,,,,,,,Luis Scola,2,,,made,,layup,25,6
Aaron Brooks,Chuck Hayes,Kyle Lowry,Luis Scola,Trevor Ariza,Marc Gasol,Mike Conley,O.J. Mayo,Sam Young,Zach Randolph,1,1:29,MEM,shot,,,,,,,,,,Zach Randolph,,,,missed,,jump,12,19
Aaron Brooks,Chuck Hayes,Kyle Lowry,Luis Scola,Trevor Ariza,Marc Gasol,Mike Conley,O.J. Mayo,Sam Young,Zach Randolph,1,1:27,HOU,rebound,,,,,,,,,,Aaron Brooks,,,,,,def,,
Aaron Brooks,Chuck Hayes,Kyle Lowry,Luis Scola,Trevor Ariza,Marc Gasol,Mike Conley,O.J. Mayo,Sam Young,Zach Randolph,1,1:16,HOU,shot,Kyle Lowry,,,,,,,,,Trevor Ariza,3,,,made,,3pt,14,29
Aaron Brooks,Chuck Hayes,Kyle Lowry,Luis Scola,Trevor Ariza,Marc Gasol,Mike Conley,O.J. Mayo,Sam Young,Zach Randolph,1,0:51,HOU,foul,,,,,,,,Marc Gasol,,Chuck Hayes,,,,,,personal,,
Aaron Brooks,Carl Landry,Kyle Lowry,Luis Scola,Trevor Ariza,Marc Gasol,Mike Conley,O.J. Mayo,Sam Young,Zach Randolph,1,0:51,HOU,sub,,,,Carl Landry,,Chuck Hayes,,,,,,,,,,,,
Aaron Brooks,Carl Landry,Kyle Lowry,Luis Scola,Trevor Ariza,Jamaal Tinsley,Marc Gasol,O.J. Mayo,Sam Young,Zach Randolph,1,0:51,MEM,sub,,,,Jamaal Tinsley,,Mike Conley,,,,,,,,,,,,
Aaron Brooks,Carl Landry,Kyle Lowry,Luis Scola,Trevor Ariza,Hasheem Thabeet,Jamaal Tinsley,O.J. Mayo,Sam Young,Zach Randolph,1,0:51,MEM,sub,,,,Hasheem Thabeet,,Marc Gasol,,,,,,,,,,,,
Aaron Brooks,Carl Landry,Kyle Lowry,Luis Scola,Trevor Ariza,Hasheem Thabeet,Jamaal Tinsley,O.J. Mayo,Sam Young,Zach Randolph,1,0:42,HOU,foul,,,,,,,,O.J. Mayo,,Luis Scola,,,,,,shooting,,
Aaron Brooks,Carl Landry,Kyle Lowry,Luis Scola,Trevor Ariza,Hasheem Thabeet,Jamaal Tinsley,O.J. Mayo,Sam Young,Zach Randolph,1,0:42,MEM,free throw,,,,,,,1,,2,O.J. Mayo,,,foul,missed,,,,
Aaron Brooks,Carl Landry,Kyle Lowry,Luis Scola,Trevor Ariza,Hasheem Thabeet,Jamaal Tinsley,O.J. Mayo,Sam Young,Zach Randolph,1,0:42,MEM,rebound,,,,,,,,,,,,,,,,,,
Aaron Brooks,Carl Landry,David Andersen,Kyle Lowry,Trevor Ariza,Hasheem Thabeet,Jamaal Tinsley,O.J. Mayo,Sam Young,Zach Randolph,1,0:42,HOU,sub,,,,David Andersen,,Luis Scola,,,,,,,,,,,,
Aaron Brooks,Carl Landry,David Andersen,Kyle Lowry,Trevor Ariza,Hasheem Thabeet,Jamaal Tinsley,O.J. Mayo,Sam Young,Zach Randolph,1,0:42,MEM,free throw,,,,,,,2,,2,O.J. Mayo,,,foul,made,,,,
Aaron Brooks,Carl Landry,David Andersen,Kyle Lowry,Trevor Ariza,Hasheem Thabeet,Jamaal Tinsley,O.J. Mayo,Sam Young,Zach Randolph,1,0:34,HOU,shot,,,,,,,,,,Aaron Brooks,2,,,made,,pullup jump,22,20
Aaron Brooks,Carl Landry,David Andersen,Kyle Lowry,Trevor Ariza,Hasheem Thabeet,Jamaal Tinsley,O.J. Mayo,Sam Young,Zach Randolph,1,0:20,MEM,turnover,,,,,,,,,,O.J. Mayo,,,bad pass,,Carl Landry,,,
Aaron Brooks,Carl Landry,David Andersen,Kyle Lowry,Trevor Ariza,Hasheem Thabeet,Jamaal Tinsley,O.J. Mayo,Sam Young,Zach Randolph,1,0:15,HOU,shot,,,,,,,,,,Aaron Brooks,,,,missed,,3pt,11,28
Aaron Brooks,Carl Landry,David Andersen,Kyle Lowry,Trevor Ariza,Hasheem Thabeet,Jamaal Tinsley,O.J. Mayo,Sam Young,Zach Randolph,1,0:13,MEM,rebound,,,,,,,,,,,,,,,,,,
Aaron Brooks,Carl Landry,David Andersen,Kyle Lowry,Trevor Ariza,Hasheem Thabeet,Jamaal Tinsley,O.J. Mayo,Sam Young,Zach Randolph,1,0:01,MEM,shot,,,,,,,,,,Jamaal Tinsley,,,,missed,,jump,36,24
Aaron Brooks,Carl Landry,David Andersen,Kyle Lowry,Trevor Ariza,Hasheem Thabeet,Jamaal Tinsley,O.J. Mayo,Sam Young,Zach Randolph,1,0:00,HOU,rebound,,,,,,,,,,Aaron Brooks,,,,,,def,,
Aaron Brooks,Carl Landry,Chase Budinger,David Andersen,Kyle Lowry,Hasheem Thabeet,Jamaal Tinsley,Rudy Gay,Sam Young,Zach Randolph,2,11:42,HOU,shot,,,,,,,,,,Chase Budinger,,,,missed,,3pt,41,26
Aaron Brooks,Carl Landry,Chase Budinger,David Andersen,Kyle Lowry,Hasheem Thabeet,Jamaal Tinsley,Rudy Gay,Sam Young,Zach Randolph,2,11:40,MEM,rebound,,,,,,,,,,Sam Young,,,,,,def,,
Aaron Brooks,Carl Landry,Chase Budinger,David Andersen,Kyle Lowry,Hasheem Thabeet,Jamaal Tinsley,Rudy Gay,Sam Young,Zach Randolph,2,11:32,MEM,shot,,,,,,,,,,Jamaal Tinsley,,,,missed,,jump,29,10
Aaron Brooks,Carl Landry,Chase Budinger,David Andersen,Kyle Lowry,Hasheem Thabeet,Jamaal Tinsley,Rudy Gay,Sam Young,Zach Randolph,2,11:29,HOU,rebound,,,,,,,,,,David Andersen,,,,,,def,,
Aaron Brooks,Carl Landry,Chase Budinger,David Andersen,Kyle Lowry,Hasheem Thabeet,Jamaal Tinsley,Rudy Gay,Sam Young,Zach Randolph,2,11:24,HOU,shot,,,,,,,,,,David Andersen,,,,missed,,jump,40,20
Aaron Brooks,Carl Landry,Chase Budinger,David Andersen,Kyle Lowry,Hasheem Thabeet,Jamaal Tinsley,Rudy Gay,Sam Young,Zach Randolph,2,11:22,MEM,rebound,,,,,,,,,,Hasheem Thabeet,,,,,,def,,
Aaron Brooks,Carl Landry,Chase Budinger,David Andersen,Kyle Lowry,Hasheem Thabeet,Jamaal Tinsley,Rudy Gay,Sam Young,Zach Randolph,2,10:57,MEM,shot,,,,,,,,,,Zach Randolph,2,,,made,,running bank,35,8
Aaron Brooks,Carl Landry,Chase Budinger,David Andersen,Kyle Lowry,Hasheem Thabeet,Jamaal Tinsley,Rudy Gay,Sam Young,Zach Randolph,2,10:51,MEM,foul,,,,,,,,Kyle Lowry,,Jamaal Tinsley,,,,,,personal,,
Aaron Brooks,Carl Landry,Chase Budinger,David Andersen,Kyle Lowry,Hasheem Thabeet,Jamaal Tinsley,Lester Hudson,Rudy Gay,Zach Randolph,2,10:51,MEM,sub,,,,Lester Hudson,,Sam Young,,,,,,,,,,,,
Aaron Brooks,Carl Landry,Chase Budinger,David Andersen,Kyle Lowry,DeMarre Carroll,Hasheem Thabeet,Jamaal Tinsley,Lester Hudson,Rudy Gay,2,10:51,MEM,sub,,,,DeMarre Carroll,,Zach Randolph,,,,,,,,,,,,
Aaron Brooks,Carl Landry,Chase Budinger,David Andersen,Kyle Lowry,DeMarre Carroll,Hasheem Thabeet,Jamaal Tinsley,Lester Hudson,Rudy Gay,2,10:40,HOU,shot,,,,,,,,,,Carl Landry,2,,,made,,running jump,25,11
Aaron Brooks,Carl Landry,Chase Budinger,David Andersen,Kyle Lowry,DeMarre Carroll,Hasheem Thabeet,Jamaal Tinsley,Lester Hudson,Rudy Gay,2,10:19,MEM,shot,,,,,,,,,,Rudy Gay,2,,,made,,pullup jump,19,16
Aaron Brooks,Carl Landry,Chase Budinger,David Andersen,Kyle Lowry,DeMarre Carroll,Hasheem Thabeet,Jamaal Tinsley,Lester Hudson,Rudy Gay,2,10:07,MEM,foul,,,,,,,,Kyle Lowry,,DeMarre Carroll,,,,,,shooting,,
Carl Landry,Chase Budinger,David Andersen,Kyle Lowry,Shane Battier,DeMarre Carroll,Hasheem Thabeet,Jamaal Tinsley,Lester Hudson,Rudy Gay,2,10:07,HOU,sub,,,,Shane Battier,,Aaron Brooks,,,,,,,,,,,,
Carl Landry,Chase Budinger,David Andersen,Kyle Lowry,Shane Battier,DeMarre Carroll,Hasheem Thabeet,Jamaal Tinsley,Lester Hudson,Rudy Gay,2,10:07,HOU,free throw,,,,,,,1,,2,Kyle Lowry,,,foul,missed,,,,
Carl Landry,Chase Budinger,David Andersen,Kyle Lowry,Shane Battier,DeMarre Carroll,Hasheem Thabeet,Jamaal Tinsley,Lester Hudson,Rudy Gay,2,10:07,HOU,rebound,,,,,,,,,,,,,,,,,,
Carl Landry,Chase Budinger,David Andersen,Kyle Lowry,Shane Battier,DeMarre Carroll,Hasheem Thabeet,Jamaal Tinsley,Lester Hudson,Rudy Gay,2,10:07,HOU,free throw,,,,,,,2,,2,Kyle Lowry,,,foul,made,,,,
Carl Landry,Chase Budinger,David Andersen,Kyle Lowry,Shane Battier,DeMarre Carroll,Hasheem Thabeet,Jamaal Tinsley,Lester Hudson,Rudy Gay,2,9:50,MEM,shot,,,,,,,,,,Rudy Gay,2,,,made,,pullup jump,35,11
Carl Landry,Chase Budinger,David Andersen,Kyle Lowry,Shane Battier,DeMarre Carroll,Hasheem Thabeet,Jamaal Tinsley,Lester Hudson,Rudy Gay,2,9:35,MEM,foul,,,,,,,,Chase Budinger,,Lester Hudson,,,,,,personal,,
Carl Landry,Chase Budinger,David Andersen,Kyle Lowry,Shane Battier,DeMarre Carroll,Hasheem Thabeet,Jamaal Tinsley,Lester Hudson,Rudy Gay,2,9:29,HOU,shot,,,Hasheem Thabeet,,,,,,,Chase Budinger,,,,missed,,jump,28,9
Carl Landry,Chase Budinger,David Andersen,Kyle Lowry,Shane Battier,DeMarre Carroll,Hasheem Thabeet,Jamaal Tinsley,Lester Hudson,Rudy Gay,2,9:28,MEM,rebound,,,,,,,,,,,,,,,,,,
Carl Landry,Chase Budinger,David Andersen,Kyle Lowry,Shane Battier,DeMarre Carroll,Hasheem Thabeet,Jamaal Tinsley,Lester Hudson,Rudy Gay,2,9:13,MEM,turnover,,,,,,,,,,Rudy Gay,,,traveling,,,,,
Carl Landry,Chase Budinger,David Andersen,Kyle Lowry,Shane Battier,DeMarre Carroll,Hasheem Thabeet,Jamaal Tinsley,Lester Hudson,Rudy Gay,2,9:03,MEM,foul,,,,,,,,Carl Landry,,Hasheem Thabeet,,,,,,personal,,
Carl Landry,Chase Budinger,David Andersen,Kyle Lowry,Shane Battier,DeMarre Carroll,Hasheem Thabeet,Jamaal Tinsley,Lester Hudson,Rudy Gay,2,8:52,MEM,foul,,,,,,,,Carl Landry,,Hasheem Thabeet,,,,,,shooting,,
Carl Landry,Chase Budinger,David Andersen,Kyle Lowry,Shane Battier,DeMarre Carroll,Hasheem Thabeet,Jamaal Tinsley,Lester Hudson,Rudy Gay,2,8:52,HOU,timeout,,,,,,,,,,,,,,,,official,,
Carl Landry,Chase Budinger,David Andersen,Kyle Lowry,Shane Battier,DeMarre Carroll,Hasheem Thabeet,Jamaal Tinsley,Lester Hudson,Rudy Gay,2,8:52,HOU,free throw,,,,,,,1,,2,Carl Landry,,,foul,made,,,,
Carl Landry,Chase Budinger,David Andersen,Kyle Lowry,Shane Battier,DeMarre Carroll,Hasheem Thabeet,Jamaal Tinsley,Lester Hudson,Rudy Gay,2,8:52,HOU,free throw,,,,,,,2,,2,Carl Landry,,,foul,made,,,,
Carl Landry,Chase Budinger,David Andersen,Kyle Lowry,Shane Battier,DeMarre Carroll,Hasheem Thabeet,Jamaal Tinsley,Lester Hudson,Rudy Gay,2,8:39,MEM,shot,,,,,,,,,,Lester Hudson,,,,missed,,running bank,15,13
Carl Landry,Chase Budinger,David Andersen,Kyle Lowry,Shane Battier,DeMarre Carroll,Hasheem Thabeet,Jamaal Tinsley,Lester Hudson,Rudy Gay,2,8:38,MEM,rebound,,,,,,,,,,Hasheem Thabeet,,,,,,off,,