a1,a2,a3,a4,a5,h1,h2,h3,h4,h5,period,time,team,etype,assist,away,block,entered,home,left,num,opponent,outof,player,points,possession,reason,result,steal,type,x,y
Boris Diaw,Nazr Mohammed,Raymond Felton,Stephen Graham,Stephen Jackson,Andrew Bynum,Derek Fisher,Kobe Bryant,Pau Gasol,Ron Artest,1,12:00,OFF,jump ball,,Nazr Mohammed,,,Andrew Bynum,,,,,,,Pau Gasol,,,,,,
Boris Diaw,Nazr Mohammed,Raymond Felton,Stephen Graham,Stephen Jackson,Andrew Bynum,Derek Fisher,Kobe Bryant,Pau Gasol,Ron Artest,1,11:41,LAL,shot,Pau Gasol,,,,,,,,,Ron Artest,2,,,made,,reverse layup,25,6
Boris Diaw,Nazr Mohammed,Raymond Felton,Stephen Graham,Stephen Jackson,Andrew Bynum,Derek Fisher,Kobe Bryant,Pau Gasol,Ron Artest,1,11:26,CHA,turnover,,,,,,,,,,Stephen Jackson,,,lost ball,,Derek Fisher,,,
Boris Diaw,Nazr Mohammed,Raymond Felton,Stephen Graham,Stephen Jackson,Andrew Bynum,Derek Fisher,Kobe Bryant,Pau Gasol,Ron Artest,1,11:26,CHA,foul,,,,,,,,Derek Fisher,,Stephen Jackson,,,,,,personal,,
Boris Diaw,Nazr Mohammed,Raymond Felton,Stephen Graham,Stephen Jackson,Andrew Bynum,Derek Fisher,Kobe Bryant,Pau Gasol,Ron Artest,1,11:04,LAL,shot,,,,,,,,,,Andrew Bynum,,,,missed,,hook,30,10
Boris Diaw,Nazr Mohammed,Raymond Felton,Stephen Graham,Stephen Jackson,Andrew Bynum,Derek Fisher,Kobe Bryant,Pau Gasol,Ron Artest,1,11:02,CHA,rebound,,,,,,,,,,Stephen Jackson,,,,,,def,,
Boris Diaw,Nazr Mohammed,Raymond Felton,Stephen Graham,Stephen Jackson,Andrew Bynum,Derek Fisher,Kobe Bryant,Pau Gasol,Ron Artest,1,10:46,CHA,shot,,,,,,,,,,Nazr Mohammed,,,,missed,,layup,25,6
Boris Diaw,Nazr Mohammed,Raymond Felton,Stephen Graham,Stephen Jackson,Andrew Bynum,Derek Fisher,Kobe Bryant,Pau Gasol,Ron Artest,1,10:44,CHA,rebound,,,,,,,,,,Nazr Mohammed,,,,,,off,,
Boris Diaw,Nazr Mohammed,Raymond Felton,Stephen Graham,Stephen Jackson,Andrew Bynum,Derek Fisher,Kobe Bryant,Pau Gasol,Ron Artest,1,10:44,CHA,shot,,,,,,,,,,Nazr Mohammed,2,,,made,,tip,25,6
Boris Diaw,Nazr Mohammed,Raymond Felton,Stephen Graham,Stephen Jackson,Andrew Bynum,Derek Fisher,Kobe Bryant,Pau Gasol,Ron Artest,1,10:35,CHA,violation,,,,,,,,,,Nazr Mohammed,,,,,,kicked ball,,
Boris Diaw,Nazr Mohammed,Raymond Felton,Stephen Graham,Stephen Jackson,Andrew Bynum,Derek Fisher,Kobe Bryant,Pau Gasol,Ron Artest,1,10:25,LAL,shot,,,,,,,,,,Andrew Bynum,,,,missed,,hook,19,9
Boris Diaw,Nazr Mohammed,Raymond Felton,Stephen Graham,Stephen Jackson,Andrew Bynum,Derek Fisher,Kobe Bryant,Pau Gasol,Ron Artest,1,10:22,CHA,rebound,,,,,,,,,,Stephen Jackson,,,,,,def,,
Boris Diaw,Nazr Mohammed,Raymond Felton,Stephen Graham,Stephen Jackson,Andrew Bynum,Derek Fisher,Kobe Bryant,Pau Gasol,Ron Artest,1,10:18,CHA,shot,,,,,,,,,,Raymond Felton,2,,,made,,driving reverse layup,25,6
Boris Diaw,Nazr Mohammed,Raymond Felton,Stephen Graham,Stephen Jackson,Andrew Bynum,Derek Fisher,Kobe Bryant,Pau Gasol,Ron Artest,1,10:03,CHA,foul,,,,,,,,Derek Fisher,,Raymond Felton,,,,,,personal,,
Boris Diaw,Nazr Mohammed,Raymond Felton,Stephen Graham,Stephen Jackson,Andrew Bynum,Derek Fisher,Kobe Bryant,Pau Gasol,Ron Artest,1,9:56,LAL,foul,,,,,,,,Boris Diaw,,Andrew Bynum,,,,,,offensive,,
Boris Diaw,Nazr Mohammed,Raymond Felton,Stephen Graham,Stephen Jackson,Andrew Bynum,Derek Fisher,Kobe Bryant,Pau Gasol,Ron Artest,1,9:56,LAL,turnover,,,,,,,,,,Andrew Bynum,,,foul,,,,,
Boris Diaw,Nazr Mohammed,Raymond Felton,Stephen Graham,Stephen Jackson,Andrew Bynum,Derek Fisher,Kobe Bryant,Pau Gasol,Ron Artest,1,9:45,CHA,shot,Boris Diaw,,,,,,,,,Stephen Jackson,2,,,made,,jump,31,22
Boris Diaw,Nazr Mohammed,Raymond Felton,Stephen Graham,Stephen Jackson,Andrew Bynum,Derek Fisher,Kobe Bryant,Pau Gasol,Ron Artest,1,9:31,LAL,shot,,,,,,,,,,Pau Gasol,,,,missed,,jump,38,19
Boris Diaw,Nazr Mohammed,Raymond Felton,Stephen Graham,Stephen Jackson,Andrew Bynum,Derek Fisher,Kobe Bryant,Pau Gasol,Ron Artest,1,9:30,LAL,rebound,,,,,,,,,,Andrew Bynum,,,,,,off,,
Boris Diaw,Nazr Mohammed,Raymond Felton,Stephen Graham,Stephen Jackson,Andrew Bynum,Derek Fisher,Kobe Bryant,Pau Gasol,Ron Artest,1,9:28,LAL,shot,,,,,,,,,,Andrew Bynum,2,,,made,,putback slam dunk,25,6
Boris Diaw,Nazr Mohammed,Raymond Felton,Stephen Graham,Stephen Jackson,Andrew Bynum,Derek Fisher,Kobe Bryant,Pau Gasol,Ron Artest,1,9:11,CHA,shot,,,,,,,,,,Boris Diaw,,,,missed,,jump,37,23
Boris Diaw,Nazr Mohammed,Raymond Felton,Stephen Graham,Stephen Jackson,Andrew Bynum,Derek Fisher,Kobe Bryant,Pau Gasol,Ron Artest,1,9:09,LAL,rebound,,,,,,,,,,Andrew Bynum,,,,,,def,,
Boris Diaw,Nazr Mohammed,Raymond Felton,Stephen Graham,Stephen Jackson,Andrew Bynum,Derek Fisher,Kobe Bryant,Pau Gasol,Ron Artest,1,9:04,CHA,foul,,,,,,,,Pau Gasol,,Boris Diaw,,,,,,personal,,
Boris Diaw,Nazr Mohammed,Raymond Felton,Stephen Graham,Stephen Jackson,Andrew Bynum,Derek Fisher,Kobe Bryant,Pau Gasol,Ron Artest,1,8:49,LAL,shot,,,,,,,,,,Andrew Bynum,,,,missed,,hook,24,21
Boris Diaw,Nazr Mohammed,Raymond Felton,Stephen Graham,Stephen Jackson,Andrew Bynum,Derek Fisher,Kobe Bryant,Pau Gasol,Ron Artest,1,8:46,CHA,rebound,,,,,,,,,,Stephen Graham,,,,,,def,,
Boris Diaw,Nazr Mohammed,Raymond Felton,Stephen Graham,Stephen Jackson,Andrew Bynum,Derek Fisher,Kobe Bryant,Pau Gasol,Ron Artest,1,8:27,CHA,shot,Boris Diaw,,,,,,,,,Raymond Felton,3,,,made,,3pt,10,27
Boris Diaw,Nazr Mohammed,Raymond Felton,Stephen Graham,Stephen Jackson,Andrew Bynum,Derek Fisher,Kobe Bryant,Pau Gasol,Ron Artest,1,8:07,LAL,shot,Pau Gasol,,,,,,,,,Andrew Bynum,2,,,made,,slam dunk,25,6
Boris Diaw,Nazr Mohammed,Raymond Felton,Stephen Graham,Stephen Jackson,Andrew Bynum,Derek Fisher,Kobe Bryant,Pau Gasol,Ron Artest,1,7:53,CHA,shot,,,,,,,,,,Boris Diaw,,,,missed,,3pt,28,31
Boris Diaw,Nazr Mohammed,Raymond Felton,Stephen Graham,Stephen Jackson,Andrew Bynum,Derek Fisher,Kobe Bryant,Pau Gasol,Ron Artest,1,7:51,LAL,rebound,,,,,,,,,,Andrew Bynum,,,,,,def,,
Boris Diaw,Nazr Mohammed,Raymond Felton,Stephen Graham,Stephen Jackson,Andrew Bynum,Derek Fisher,Kobe Bryant,Pau Gasol,Ron Artest,1,7:43,LAL,shot,Pau Gasol,,,,,,,,,Derek Fisher,3,,,made,,3pt,39,29
Boris Diaw,Nazr Mohammed,Raymond Felton,Stephen Graham,Stephen Jackson,Andrew Bynum,Derek Fisher,Kobe Bryant,Pau Gasol,Ron Artest,1,7:18,CHA,shot,,,,,,,,,,Stephen Jackson,,,,missed,,jump,45,7
Boris Diaw,Nazr Mohammed,Raymond Felton,Stephen Graham,Stephen Jackson,Andrew Bynum,Derek Fisher,Kobe Bryant,Pau Gasol,Ron Artest,1,7:17,LAL,rebound,,,,,,,,,,Pau Gasol,,,,,,def,,
Boris Diaw,Nazr Mohammed,Raymond Felton,Stephen Graham,Stephen Jackson,Andrew Bynum,Derek Fisher,Kobe Bryant,Pau Gasol,Ron Artest,1,7:13,CHA,violation,,,,,,,,,,Stephen Graham,,,,,,kicked ball,,
Boris Diaw,Nazr Mohammed,Raymond Felton,Stephen Graham,Stephen Jackson,Andrew Bynum,Derek Fisher,Kobe Bryant,Pau Gasol,Ron Artest,1,7:01,LAL,shot,,,,,,,,,,Ron Artest,,,,missed,,layup,25,6
Boris Diaw,Nazr Mohammed,Raymond Felton,Stephen Graham,Stephen Jackson,Andrew Bynum,Derek Fisher,Kobe Bryant,Pau Gasol,Ron Artest,1,7:00,CHA,rebound,,,,,,,,,,Nazr Mohammed,,,,,,def,,
Boris Diaw,Nazr Mohammed,Raymond Felton,Stephen Graham,Stephen Jackson,Andrew Bynum,Derek Fisher,Kobe Bryant,Pau Gasol,Ron Artest,1,6:49,CHA,turnover,,,,,,,,,,Nazr Mohammed,,,lost ball,,Ron Artest,,,
Boris Diaw,Nazr Mohammed,Raymond Felton,Stephen Graham,Stephen Jackson,Andrew Bynum,Derek Fisher,Kobe Bryant,Pau Gasol,Ron Artest,1,6:38,LAL,shot,,,,,,,,,,Ron Artest,,,,missed,,3pt,36,30
Boris Diaw,Nazr Mohammed,Raymond Felton,Stephen Graham,Stephen Jackson,Andrew Bynum,Derek Fisher,Kobe Bryant,Pau Gasol,Ron Artest,1,6:36,CHA,rebound,,,,,,,,,,Raymond Felton,,,,,,def,,
Boris Diaw,Nazr Mohammed,Raymond Felton,Stephen Graham,Stephen Jackson,Andrew Bynum,Derek Fisher,Kobe Bryant,Pau Gasol,Ron Artest,1,6:31,CHA,shot,,,,,,,,,,Stephen Graham,,,,missed,,layup,25,6
Boris Diaw,Nazr Mohammed,Raymond Felton,Stephen Graham,Stephen Jackson,Andrew Bynum,Derek Fisher,Kobe Bryant,Pau Gasol,Ron Artest,1,6:30,CHA,rebound,,,,,,,,,,Nazr Mohammed,,,,,,off,,
Boris Diaw,Nazr Mohammed,Raymond Felton,Stephen Graham,Stephen Jackson,Andrew Bynum,Derek Fisher,Kobe Bryant,Pau Gasol,Ron Artest,1,6:28,CHA,turnover,,,,,,,,,,Nazr Mohammed,,,bad pass,,Derek Fisher,,,
Boris Diaw,Nazr Mohammed,Raymond Felton,Stephen Graham,Stephen Jackson,Andrew Bynum,Derek Fisher,Kobe Bryant,Pau Gasol,Ron Artest,1,6:23,LAL,shot,,,,,,,,,,Derek Fisher,,,,missed,,driving layup,25,6
Boris Diaw,Nazr Mohammed,Raymond Felton,Stephen Graham,Stephen Jackson,Andrew Bynum,Derek Fisher,Kobe Bryant,Pau Gasol,Ron Artest,1,6:19,LAL,rebound,,,,,,,,,,Andrew Bynum,,,,,,off,,
Boris Diaw,Nazr Mohammed,Raymond Felton,Stephen Graham,Stephen Jackson,Andrew Bynum,Derek Fisher,Kobe Bryant,Pau Gasol,Ron Artest,1,6:19,LAL,shot,,,,,,,,,,Andrew Bynum,2,,,made,,tip,25,6
Boris Diaw,Nazr Mohammed,Raymond Felton,Stephen Graham,Stephen Jackson,Andrew Bynum,Derek Fisher,Kobe Bryant,Pau Gasol,Ron Artest,1,6:05,CHA,shot,,,,,,,,,,Stephen Graham,,,,missed,,jump,17,22
Boris Diaw,Nazr Mohammed,Raymond Felton,Stephen Graham,Stephen Jackson,Andrew Bynum,Derek Fisher,Kobe Bryant,Pau Gasol,Ron Artest,1,6:03,LAL,rebound,,,,,,,,,,Andrew Bynum,,,,,,def,,
Boris Diaw,Nazr Mohammed,Raymond Felton,Stephen Graham,Stephen Jackson,Andrew Bynum,Derek Fisher,Kobe Bryant,Pau Gasol,Ron Artest,1,5:53,LAL,turnover,,,,,,,,,,Derek Fisher,,,bad pass,,Stephen Jackson,,,
Boris Diaw,Nazr Mohammed,Raymond Felton,Stephen Graham,Stephen Jackson,Andrew Bynum,Derek Fisher,Kobe Bryant,Pau Gasol,Ron Artest,1,5:49,CHA,shot,,,,,,,,,,Stephen Jackson,2,,,made,,driving dunk,25,6
Boris Diaw,Nazr Mohammed,Raymond Felton,Stephen Graham,Stephen Jackson,Andrew Bynum,Derek Fisher,Kobe Bryant,Pau Gasol,Ron Artest,1,5:45,LAL,timeout,,,,,,,,,,,,,,,,regular,,
Boris Diaw,Nazr Mohammed,Raymond Felton,Stephen Graham,Stephen Jackson,Andrew Bynum,Derek Fisher,Kobe Bryant,Pau Gasol,Ron Artest,1,5:33,CHA,foul,,,,,,,,Pau Gasol,,Boris Diaw,,,,,,personal,,
DeSagana Diop,Nazr Mohammed,Raymond Felton,Stephen Graham,Stephen Jackson,Andrew Bynum,Derek Fisher,Kobe Bryant,Pau Gasol,Ron Artest,1,5:33,CHA,sub,,,,DeSagana Diop,,Boris Diaw,,,,,,,,,,,,
DeSagana Diop,Nazr Mohammed,Raymond Felton,Stephen Graham,Stephen Jackson,Andrew Bynum,Derek Fisher,Kobe Bryant,Pau Gasol,Ron Artest,1,5:23,LAL,shot,,,,,,,,,,Pau Gasol,,,,missed,,layup,25,6
DeSagana Diop,Nazr Mohammed,Raymond Felton,Stephen Graham,Stephen Jackson,Andrew Bynum,Derek Fisher,Kobe Bryant,Pau Gasol,Ron Artest,1,5:22,CHA,rebound,,,,,,,,,,DeSagana Diop,,,,,,def,,
DeSagana Diop,Nazr Mohammed,Raymond Felton,Stephen Graham,Stephen Jackson,Andrew Bynum,Derek Fisher,Kobe Bryant,Pau Gasol,Ron Artest,1,5:02,CHA,shot,,,,,,,,,,Stephen Graham,,,,missed,,3pt,2,6
DeSagana Diop,Nazr Mohammed,Raymond Felton,Stephen Graham,Stephen Jackson,Andrew Bynum,Derek Fisher,Kobe Bryant,Pau Gasol,Ron Artest,1,5:01,LAL,rebound,,,,,,,,,,Ron Artest,,,,,,def,,
DeSagana Diop,Nazr Mohammed,Raymond Felton,Stephen Graham,Stephen Jackson,Andrew Bynum,Derek Fisher,Kobe Bryant,Pau Gasol,Ron Artest,1,4:54,LAL,shot,,,,,,,,,,Kobe Bryant,,,,missed,,3pt,13,30
DeSagana Diop,Nazr Mohammed,Raymond Felton,Stephen Graham,Stephen Jackson,Andrew Bynum,Derek Fisher,Kobe Bryant,Pau Gasol,Ron Artest,1,4:53,CHA,rebound,,,,,,,,,,DeSagana Diop,,,,,,def,,
DeSagana Diop,Nazr Mohammed,Raymond Felton,Stephen Graham,Stephen Jackson,Andrew Bynum,Derek Fisher,Kobe Bryant,Pau Gasol,Ron Artest,1,4:34,CHA,shot,Stephen Graham,,,,,,,,,Raymond Felton,2,,,made,,jump,37,21
DeSagana Diop,Nazr Mohammed,Raymond Felton,Stephen Graham,Stephen Jackson,Andrew Bynum,Derek Fisher,Kobe Bryant,Pau Gasol,Ron Artest,1,4:24,CHA,foul,,,,,,,,Derek Fisher,,DeSagana Diop,,,,,,shooting,,
DeSagana Diop,Nazr Mohammed,Raymond Felton,Stephen Graham,Stephen Jackson,Andrew Bynum,Derek Fisher,Kobe Bryant,Pau Gasol,Ron Artest,1,4:24,LAL,free throw,,,,,,,1,,2,Derek Fisher,,,foul,made,,,,
DeSagana Diop,Nazr Mohammed,Raymond Felton,Stephen Graham,Stephen Jackson,Andrew Bynum,Derek Fisher,Kobe Bryant,Pau Gasol,Ron Artest,1,4:24,LAL,free throw,,,,,,,2,,2,Derek Fisher,,,foul,made,,,,
DeSagana Diop,Nazr Mohammed,Raymond Felton,Stephen Graham,Stephen Jackson,Andrew Bynum,Derek Fisher,Kobe Bryant,Pau Gasol,Ron Artest,1,4:05,CHA,shot,,,,,,,,,,Stephen Jackson,2,,,made,,jump,16,18
DeSagana Diop,Nazr Mohammed,Raymond Felton,Stephen Graham,Stephen Jackson,Andrew Bynum,Derek Fisher,Kobe Bryant,Pau Gasol,Ron Artest,1,3:43,LAL,shot,,,Nazr Mohammed,,,,,,,Pau Gasol,,,,missed,,layup,25,6
DeSagana Diop,Nazr Mohammed,Raymond Felton,Stephen Graham,Stephen Jackson,Andrew Bynum,Derek Fisher,Kobe Bryant,Pau Gasol,Ron Artest,1,3:43,LAL,rebound,,,,,,,,,,,,,,,,,,
DeSagana Diop,Nazr Mohammed,Raymond Felton,Stephen Graham,Stephen Jackson,Andrew Bynum,Derek Fisher,Kobe Bryant,Pau Gasol,Ron Artest,1,3:40,LAL,shot,Kobe Bryant,,,,,,,,,Ron Artest,2,,,made,,fade away jumper,11,22
DeSagana Diop,Nazr Mohammed,Raymond Felton,Stephen Graham,Stephen Jackson,Andrew Bynum,Derek Fisher,Kobe Bryant,Pau Gasol,Ron Artest,1,3:19,CHA,shot,DeSagana Diop,,,,,,,,,Nazr Mohammed,2,,,made,,layup,25,6
DeSagana Diop,Nazr Mohammed,Raymond Felton,Stephen Graham,Stephen Jackson,Andrew Bynum,Derek Fisher,Kobe Bryant,Pau Gasol,Ron Artest,1,3:06,LAL,foul,,,,,,,,Stephen Graham,,Derek Fisher,,,,,,offensive,,
DeSagana Diop,Nazr Mohammed,Raymond Felton,Stephen Graham,Stephen Jackson,Andrew Bynum,Derek Fisher,Kobe Bryant,Pau Gasol,Ron Artest,1,3:06,LAL,turnover,,,,,,,,,,Derek Fisher,,,foul,,,,,
DeSagana Diop,Nazr Mohammed,Raymond Felton,Stephen Graham,Stephen Jackson,Andrew Bynum,Derek Fisher,Kobe Bryant,Pau Gasol,Ron Artest,1,3:06,CHA,timeout,,,,,,,,,,,,,,,,regular,,
DeSagana Diop,Nazr Mohammed,Raymond Felton,Stephen Graham,Stephen Jackson,Andrew Bynum,Derek Fisher,Kobe Bryant,Lamar Odom,Ron Artest,1,3:06,LAL,sub,,,,Lamar Odom,,Pau Gasol,,,,,,,,,,,,
DeSagana Diop,Nazr Mohammed,Raymond Felton,Stephen Graham,Stephen Jackson,Andrew Bynum,Jordan Farmar,Kobe Bryant,Lamar Odom,Ron Artest,1,3:06,LAL,sub,,,,Jordan Farmar,,Derek Fisher,,,,,,,,,,,,
DeSagana Diop,Nazr Mohammed,Raymond Felton,Stephen Graham,Stephen Jackson,Andrew Bynum,Jordan Farmar,Kobe Bryant,Lamar Odom,Ron Artest,1,2:56,LAL,foul,,,,,,,,Stephen Jackson,,Ron Artest,,,,,,personal,,
DeSagana Diop,Nazr Mohammed,Raymond Felton,Stephen Graham,Stephen Jackson,Andrew Bynum,Jordan Farmar,Kobe Bryant,Lamar Odom,Ron Artest,1,2:50,CHA,shot,,,,,,,,,,Raymond Felton,,,,missed,,jump,37,20
DeSagana Diop,Nazr Mohammed,Raymond Felton,Stephen Graham,Stephen Jackson,Andrew Bynum,Jordan Farmar,Kobe Bryant,Lamar Odom,Ron Artest,1,2:49,LAL,rebound,,,,,,,,,,Andrew Bynum,,,,,,def,,
DeSagana Diop,Nazr Mohammed,Raymond Felton,Stephen Graham,Stephen Jackson,Andrew Bynum,Jordan Farmar,Kobe Bryant,Lamar Odom,Ron Artest,1,2:25,LAL,shot,,,,,,,,,,Kobe Bryant,,,,missed,,jump,12,23
DeSagana Diop,Nazr Mohammed,Raymond Felton,Stephen Graham,Stephen Jackson,Andrew Bynum,Jordan Farmar,Kobe Bryant,Lamar Odom,Ron Artest,1,2:24,CHA,rebound,,,,,,,,,,DeSagana Diop,,,,,,def,,
DeSagana Diop,Nazr Mohammed,Raymond Felton,Stephen Graham,Stephen Jackson,Andrew Bynum,Jordan Farmar,Kobe Bryant,Lamar Odom,Ron Artest,1,2:09,CHA,shot,,,,,,,,,,Stephen Jackson,2,,,made,,jump,24,28
DeSagana Diop,Nazr Mohammed,Raymond Felton,Stephen Graham,Stephen Jackson,Andrew Bynum,Jordan Farmar,Kobe Bryant,Lamar Odom,Ron Artest,1,1:53,LAL,shot,,,,,,,,,,Kobe Bryant,,,,missed,,layup,25,6
DeSagana Diop,Nazr Mohammed,Raymond Felton,Stephen Graham,Stephen Jackson,Andrew Bynum,Jordan Farmar,Kobe Bryant,Lamar Odom,Ron Artest,1,1:52,LAL,rebound,,,,,,,,,,Andrew Bynum,,,,,,off,,
DeSagana Diop,Nazr Mohammed,Raymond Felton,Stephen Graham,Stephen Jackson,Andrew Bynum,Jordan Farmar,Kobe Bryant,Lamar Odom,Ron Artest,1,1:51,LAL,shot,,,,,,,,,,Andrew Bynum,2,,,made,,layup,25,6
DeSagana Diop,Nazr Mohammed,Raymond Felton,Stephen Graham,Stephen Jackson,Andrew Bynum,Jordan Farmar,Kobe Bryant,Lamar Odom,Ron Artest,1,1:26,CHA,shot,,,,,,,,,,Nazr Mohammed,,,,missed,,jump,31,13
DeSagana Diop,Nazr Mohammed,Raymond Felton,Stephen Graham,Stephen Jackson,Andrew Bynum,Jordan Farmar,Kobe Bryant,Lamar Odom,Ron Artest,1,1:25,CHA,rebound,,,,,,,,,,DeSagana Diop,,,,,,off,,
DeSagana Diop,Nazr Mohammed,Raymond Felton,Stephen Graham,Stephen Jackson,Andrew Bynum,Jordan Farmar,Kobe Bryant,Lamar Odom,Ron Artest,1,1:14,CHA,shot,,,,,,,,,,Stephen Jackson,,,,missed,,jump,19,14
DeSagana Diop,Nazr Mohammed,Raymond Felton,Stephen Graham,Stephen Jackson,Andrew Bynum,Jordan Farmar,Kobe Bryant,Lamar Odom,Ron Artest,1,1:13,LAL,rebound,,,,,,,,,,Andrew Bynum,,,,,,def,,
DeSagana Diop,Nazr Mohammed,Raymond Felton,Stephen Graham,Stephen Jackson,Andrew Bynum,Jordan Farmar,Kobe Bryant,Lamar Odom,Ron Artest,1,1:01,LAL,shot,Kobe Bryant,,,,,,,,,Lamar Odom,2,,,made,,driving layup,25,6
DeSagana Diop,Nazr Mohammed,Raymond Felton,Stephen Graham,Stephen Jackson,Andrew Bynum,Jordan Farmar,Kobe Bryant,Lamar Odom,Ron Artest,1,0:46,CHA,shot,,,,,,,,,,Raymond Felton,2,,,made,,floating jump,23,16
DeSagana Diop,Nazr Mohammed,Raymond Felton,Stephen Graham,Stephen Jackson,Andrew Bynum,Jordan Farmar,Kobe Bryant,Lamar Odom,Ron Artest,1,0:37,LAL,shot,,,,,,,,,,Kobe Bryant,,,,missed,,3pt,14,31
DeSagana Diop,Nazr Mohammed,Raymond Felton,Stephen Graham,Stephen Jackson,Andrew Bynum,Jordan Farmar,Kobe Bryant,Lamar Odom,Ron Artest,1,0:35,CHA,rebound,,,,,,,,,,Nazr Mohammed,,,,,,def,,
DeSagana Diop,Nazr Mohammed,Raymond Felton,Stephen Graham,Stephen Jackson,Andrew Bynum,Jordan Farmar,Kobe Bryant,Lamar Odom,Ron Artest,1,0:15,CHA,shot,,,,,,,,,,Nazr Mohammed,,,,missed,,hook,24,11
DeSagana Diop,Nazr Mohammed,Raymond Felton,Stephen Graham,Stephen Jackson,Andrew Bynum,Jordan Farmar,Kobe Bryant,Lamar Odom,Ron Artest,1,0:12,LAL,rebound,,,,,,,,,,Andrew Bynum,,,,,,def,,
DeSagana Diop,Nazr Mohammed,Raymond Felton,Stephen Graham,Stephen Jackson,Andrew Bynum,Jordan Farmar,Kobe Bryant,Lamar Odom,Ron Artest,1,0:02,LAL,shot,,,,,,,,,,Jordan Farmar,,,,missed,,jump,18,10
DeSagana Diop,Nazr Mohammed,Raymond Felton,Stephen Graham,Stephen Jackson,Andrew Bynum,Jordan Farmar,Kobe Bryant,Lamar Odom,Ron Artest,1,0:01,LAL,rebound,,,,,,,,,,Lamar Odom,,,,,,off,,
DeSagana Diop,Nazr Mohammed,Raymond Felton,Stephen Graham,Stephen Jackson,Andrew Bynum,Jordan Farmar,Kobe Bryant,Lamar Odom,Ron Artest,1,0:01,LAL,shot,,,,,,,,,,Lamar Odom,,,,missed,,tip,25,6
DeSagana Diop,Nazr Mohammed,Raymond Felton,Stephen Graham,Stephen Jackson,Andrew Bynum,Jordan Farmar,Kobe Bryant,Lamar Odom,Ron Artest,1,0:01,CHA,rebound,,,,,,,,,,Raymond Felton,,,,,,def,,
DeSagana Diop,Nazr Mohammed,Raymond Felton,Stephen Graham,Stephen Jackson,Andrew Bynum,Jordan Farmar,Kobe Bryant,Lamar Odom,Ron Artest,1,0:01,CHA,shot,,,,,,,,,,Raymond Felton,,,,missed,,3pt,27,60
DeSagana Diop,Nazr Mohammed,Raymond Felton,Stephen Graham,Stephen Jackson,Andrew Bynum,Jordan Farmar,Kobe Bryant,Lamar Odom,Ron Artest,1,0:00,CHA,rebound,,,,,,,,,,,,,,,,,,
D.J. Augustin,Derrick Brown,Nazr Mohammed,Ronald Murray,Stephen Jackson,Jordan Farmar,Kobe Bryant,Lamar Odom,Pau Gasol,Shannon Brown,2,11:43,CHA,shot,,,,,,,,,,Ronald Murray,,,,missed,,layup,25,6
D.J. Augustin,Derrick Brown,Nazr Mohammed,Ronald Murray,Stephen Jackson,Jordan Farmar,Kobe Bryant,Lamar Odom,Pau Gasol,Shannon Brown,2,11:42,LAL,rebound,,,,,,,,,,Kobe Bryant,,,,,,def,,
D.J. Augustin,Derrick Brown,Nazr Mohammed,Ronald Murray,Stephen Jackson,Jordan Farmar,Kobe Bryant,Lamar Odom,Pau Gasol,Shannon Brown,2,11:34,LAL,shot,,,,,,,,,,Kobe Bryant,,,,missed,,jump,12,19
D.J. Augustin,Derrick Brown,Nazr Mohammed,Ronald Murray,Stephen Jackson,Jordan Farmar,Kobe Bryant,Lamar Odom,Pau Gasol,Shannon Brown,2,11:32,LAL,rebound,,,,,,,,,,Pau Gasol,,,,,,off,,
D.J. Augustin,Derrick Brown,Nazr Mohammed,Ronald Murray,Stephen Jackson,Jordan Farmar,Kobe Bryant,Lamar Odom,Pau Gasol,Shannon Brown,2,11:32,LAL,shot,,,,,,,,,,Pau Gasol,2,,,made,,tip,25,6
D.J. Augustin,Derrick Brown,Nazr Mohammed,Ronald Murray,Stephen Jackson,Jordan Farmar,Kobe Bryant,Lamar Odom,Pau Gasol,Shannon Brown,2,11:14,CHA,shot,,,,,,,,,,Stephen Jackson,2,,,made,,step back jump,36,18
D.J. Augustin,Derrick Brown,Nazr Mohammed,Ronald Murray,Stephen Jackson,Jordan Farmar,Kobe Bryant,Lamar Odom,Pau Gasol,Shannon Brown,2,10:55,LAL,shot,,,,,,,,,,Shannon Brown,,,,missed,,3pt,32,31
D.J. Augustin,Derrick Brown,Nazr Mohammed,Ronald Murray,Stephen Jackson,Jordan Farmar,Kobe Bryant,Lamar Odom,Pau Gasol,Shannon Brown,2,10:54,LAL,rebound,,,,,,,,,,Shannon Brown,,,,,,off,,
D.J. Augustin,Derrick Brown,Nazr Mohammed,Ronald Murray,Stephen Jackson,Jordan Farmar,Kobe Bryant,Lamar Odom,Pau Gasol,Shannon Brown,2,10:49,LAL,shot,Shannon Brown,,,,,,,,,Pau Gasol,2,,,made,,slam dunk,25,6
D.J. Augustin,Derrick Brown,Nazr Mohammed,Ronald Murray,Stephen Jackson,Jordan Farmar,Kobe Bryant,Lamar Odom,Pau Gasol,Shannon Brown,2,10:35,CHA,turnover,,,,,,,,,,Stephen Jackson,,,bad pass,,Pau Gasol,,,
D.J. Augustin,Derrick Brown,Nazr Mohammed,Ronald Murray,Stephen Jackson,Jordan Farmar,Kobe Bryant,Lamar Odom,Pau Gasol,Shannon Brown,2,10:27,CHA,foul,,,,,,,,Kobe Bryant,,Nazr Mohammed,,,,,,personal,,
D.J. Augustin,DeSagana Diop,Derrick Brown,Ronald Murray,Stephen Jackson,Jordan Farmar,Kobe Bryant,Lamar Odom,Pau Gasol,Shannon Brown,2,10:27,CHA,sub,,,,DeSagana Diop,,Nazr Mohammed,,,,,,,,,,,,
D.J. Augustin,DeSagana Diop,Derrick Brown,Ronald Murray,Stephen Jackson,Jordan Farmar,Kobe Bryant,Lamar Odom,Pau Gasol,Shannon Brown,2,10:12,LAL,shot,,,,,,,,,,Jordan Farmar,,,,missed,,jump,42,6
D.J. Augustin,DeSagana Diop,Derrick Brown,Ronald Murray,Stephen Jackson,Jordan Farmar,Kobe Bryant,Lamar Odom,Pau Gasol,Shannon Brown,2,10:11,LAL,rebound,,,,,,,,,,Pau Gasol,,,,,,off,,
D.J. Augustin,DeSagana Diop,Derrick Brown,Ronald Murray,Stephen Jackson,Jordan Farmar,Kobe Bryant,Lamar Odom,Pau Gasol,Shannon Brown,2,10:10,LAL,shot,,,DeSagana Diop,,,,,,,Pau Gasol,,,,missed,,layup,25,6
D.J. Augustin,DeSagana Diop,Derrick Brown,Ronald Murray,Stephen Jackson,Jordan Farmar,Kobe Bryant,Lamar Odom,Pau Gasol,Shannon Brown,2,10:08,CHA,rebound,,,,,,,,,,Stephen Jackson,,,,,,def,,
D.J. Augustin,DeSagana Diop,Derrick Brown,Ronald Murray,Stephen Jackson,Jordan Farmar,Kobe Bryant,Lamar Odom,Pau Gasol,Shannon Brown,2,9:47,CHA,shot,,,,,,,,,,Derrick Brown,,,,missed,,layup,25,6
D.J. Augustin,DeSagana Diop,Derrick Brown,Ronald Murray,Stephen Jackson,Jordan Farmar,Kobe Bryant,Lamar Odom,Pau Gasol,Shannon Brown,2,9:45,CHA,rebound,,,,,,,,,,DeSagana Diop,,,,,,off,,
D.J. Augustin,DeSagana Diop,Derrick Brown,Ronald Murray,Stephen Jackson,Jordan Farmar,Kobe Bryant,Lamar Odom,Pau Gasol,Shannon Brown,2,9:32,CHA,shot,,,,,,,,,,Derrick Brown,,,,missed,,jump,27,27
D.J. Augustin,DeSagana Diop,Derrick Brown,Ronald Murray,Stephen Jackson,Jordan Farmar,Kobe Bryant,Lamar Odom,Pau Gasol,Shannon Brown,2,9:31,LAL,rebound,,,,,,,,,,Kobe Bryant,,,,,,def,,
D.J. Augustin,DeSagana Diop,Derrick Brown,Ronald Murray,Stephen Jackson,Jordan Farmar,Kobe Bryant,Lamar Odom,Pau Gasol,Shannon Brown,2,9:22,CHA,foul,,,,,,,,Pau Gasol,,Derrick Brown,,,,,,shooting,,
D.J. Augustin,DeSagana Diop,Derrick Brown,Ronald Murray,Stephen Jackson,Jordan Farmar,Kobe Bryant,Lamar Odom,Pau Gasol,Shannon Brown,2,9:22,LAL,free throw,,,,,,,1,,2,Pau Gasol,,,foul,made,,,,
D.J. Augustin,DeSagana Diop,Derrick Brown,Ronald Murray,Stephen Jackson,Jordan Farmar,Kobe Bryant,Lamar Odom,Pau Gasol,Shannon Brown,2,9:22,LAL,free throw,,,,,,,2,,2,Pau Gasol,,,foul,missed,,,,
D.J. Augustin,DeSagana Diop,Derrick Brown,Ronald Murray,Stephen Jackson,Jordan Farmar,Kobe Bryant,Lamar Odom,Pau Gasol,Shannon Brown,2,9:22,CHA,rebound,,,,,,,,,,DeSagana Diop,,,,,,def,,
D.J. Augustin,DeSagana Diop,Derrick Brown,Ronald Murray,Stephen Jackson,Jordan Farmar,Kobe Bryant,Lamar Odom,Pau Gasol,Shannon Brown,2,9:08,CHA,turnover,,,,,,,,,,Ronald Murray,,,lost ball,,Lamar Odom,,,
D.J. Augustin,DeSagana Diop,Derrick Brown,Ronald Murray,Stephen Jackson,Jordan Farmar,Kobe Bryant,Lamar Odom,Pau Gasol,Shannon Brown,2,8:54,LAL,shot,,,,,,,,,,Lamar Odom,2,,,made,,driving layup,25,6
D.J. Augustin,DeSagana Diop,Derrick Brown,Ronald Murray,Stephen Jackson,Jordan Farmar,Kobe Bryant,Lamar Odom,Pau Gasol,Shannon Brown,2,8:34,CHA,shot,Stephen Jackson,,,,,,,,,Derrick Brown,2,,,made,,slam dunk,25,6