a1,a2,a3,a4,a5,h1,h2,h3,h4,h5,period,time,team,etype,assist,away,block,entered,home,left,num,opponent,outof,player,points,possession,reason,result,steal,type,x,y
Andrew Bynum,Derek Fisher,Kobe Bryant,Pau Gasol,Ron Artest,Marc Gasol,Mike Conley,O.J. Mayo,Rudy Gay,Zach Randolph,1,12:00,OFF,jump ball,,Andrew Bynum,,,Marc Gasol,,,,,,,O.J. Mayo,,,,,,
Andrew Bynum,Derek Fisher,Kobe Bryant,Pau Gasol,Ron Artest,Marc Gasol,Mike Conley,O.J. Mayo,Rudy Gay,Zach Randolph,1,11:47,MEM,shot,,,,,,,,,,Rudy Gay,,,,missed,,layup,25,6
Andrew Bynum,Derek Fisher,Kobe Bryant,Pau Gasol,Ron Artest,Marc Gasol,Mike Conley,O.J. Mayo,Rudy Gay,Zach Randolph,1,11:45,LAL,rebound,,,,,,,,,,,,,,,,,,
Andrew Bynum,Derek Fisher,Kobe Bryant,Pau Gasol,Ron Artest,Marc Gasol,Mike Conley,O.J. Mayo,Rudy Gay,Zach Randolph,1,11:35,MEM,foul,,,,,,,,Andrew Bynum,,Rudy Gay,,,,,,shooting,,
Andrew Bynum,Derek Fisher,Kobe Bryant,Pau Gasol,Ron Artest,Marc Gasol,Mike Conley,O.J. Mayo,Rudy Gay,Zach Randolph,1,11:35,LAL,free throw,,,,,,,1,,2,Andrew Bynum,,,foul,made,,,,
Andrew Bynum,Derek Fisher,Kobe Bryant,Pau Gasol,Ron Artest,Marc Gasol,Mike Conley,O.J. Mayo,Rudy Gay,Zach Randolph,1,11:35,LAL,free throw,,,,,,,2,,2,Andrew Bynum,,,foul,missed,,,,
Andrew Bynum,Derek Fisher,Kobe Bryant,Pau Gasol,Ron Artest,Marc Gasol,Mike Conley,O.J. Mayo,Rudy Gay,Zach Randolph,1,11:33,LAL,rebound,,,,,,,,,,Pau Gasol,,,,,,off,,
Andrew Bynum,Derek Fisher,Kobe Bryant,Pau Gasol,Ron Artest,Marc Gasol,Mike Conley,O.J. Mayo,Rudy Gay,Zach Randolph,1,11:28,LAL,shot,Kobe Bryant,,,,,,,,,Ron Artest,2,,,made,,jump,5,17
Andrew Bynum,Derek Fisher,Kobe Bryant,Pau Gasol,Ron Artest,Marc Gasol,Mike Conley,O.J. Mayo,Rudy Gay,Zach Randolph,1,11:08,LAL,foul,,,,,,,,Zach Randolph,,Pau Gasol,,,,,,shooting,,
Andrew Bynum,Derek Fisher,Kobe Bryant,Pau Gasol,Ron Artest,Marc Gasol,Mike Conley,O.J. Mayo,Rudy Gay,Zach Randolph,1,11:08,MEM,free throw,,,,,,,1,,2,Zach Randolph,,,foul,made,,,,
Andrew Bynum,Derek Fisher,Kobe Bryant,Pau Gasol,Ron Artest,Marc Gasol,Mike Conley,O.J. Mayo,Rudy Gay,Zach Randolph,1,11:08,MEM,free throw,,,,,,,2,,2,Zach Randolph,,,foul,missed,,,,
Andrew Bynum,Derek Fisher,Kobe Bryant,Pau Gasol,Ron Artest,Marc Gasol,Mike Conley,O.J. Mayo,Rudy Gay,Zach Randolph,1,11:07,LAL,rebound,,,,,,,,,,Pau Gasol,,,,,,def,,
Andrew Bynum,Derek Fisher,Kobe Bryant,Pau Gasol,Ron Artest,Marc Gasol,Mike Conley,O.J. Mayo,Rudy Gay,Zach Randolph,1,10:49,LAL,shot,,,,,,,,,,Derek Fisher,,,,missed,,3pt,49,7
Andrew Bynum,Derek Fisher,Kobe Bryant,Pau Gasol,Ron Artest,Marc Gasol,Mike Conley,O.J. Mayo,Rudy Gay,Zach Randolph,1,10:47,MEM,rebound,,,,,,,,,,Rudy Gay,,,,,,def,,
Andrew Bynum,Derek Fisher,Kobe Bryant,Pau Gasol,Ron Artest,Marc Gasol,Mike Conley,O.J. Mayo,Rudy Gay,Zach Randolph,1,10:39,MEM,shot,,,,,,,,,,O.J. Mayo,,,,missed,,jump,34,22
Andrew Bynum,Derek Fisher,Kobe Bryant,Pau Gasol,Ron Artest,Marc Gasol,Mike Conley,O.J. Mayo,Rudy Gay,Zach Randolph,1,10:37,LAL,rebound,,,,,,,,,,Ron Artest,,,,,,def,,
Andrew Bynum,Derek Fisher,Kobe Bryant,Pau Gasol,Ron Artest,Marc Gasol,Mike Conley,O.J. Mayo,Rudy Gay,Zach Randolph,1,10:27,LAL,shot,Kobe Bryant,,,,,,,,,Pau Gasol,2,,,made,,jump,26,26
Andrew Bynum,Derek Fisher,Kobe Bryant,Pau Gasol,Ron Artest,Marc Gasol,Mike Conley,O.J. Mayo,Rudy Gay,Zach Randolph,1,10:10,MEM,shot,,,,,,,,,,Marc Gasol,,,,missed,,fade away jumper,35,8
Andrew Bynum,Derek Fisher,Kobe Bryant,Pau Gasol,Ron Artest,Marc Gasol,Mike Conley,O.J. Mayo,Rudy Gay,Zach Randolph,1,10:07,LAL,rebound,,,,,,,,,,Kobe Bryant,,,,,,def,,
Andrew Bynum,Derek Fisher,Kobe Bryant,Pau Gasol,Ron Artest,Marc Gasol,Mike Conley,O.J. Mayo,Rudy Gay,Zach Randolph,1,9:58,LAL,shot,,,,,,,,,,Kobe Bryant,,,,missed,,jump,25,17
Andrew Bynum,Derek Fisher,Kobe Bryant,Pau Gasol,Ron Artest,Marc Gasol,Mike Conley,O.J. Mayo,Rudy Gay,Zach Randolph,1,9:57,MEM,rebound,,,,,,,,,,Zach Randolph,,,,,,def,,
Andrew Bynum,Derek Fisher,Kobe Bryant,Pau Gasol,Ron Artest,Marc Gasol,Mike Conley,O.J. Mayo,Rudy Gay,Zach Randolph,1,9:51,LAL,foul,,,,,,,,Mike Conley,,Pau Gasol,,,,,,shooting,,
Andrew Bynum,Derek Fisher,Kobe Bryant,Pau Gasol,Ron Artest,Marc Gasol,Mike Conley,O.J. Mayo,Rudy Gay,Zach Randolph,1,9:51,MEM,free throw,,,,,,,1,,2,Mike Conley,,,foul,missed,,,,
Andrew Bynum,Derek Fisher,Kobe Bryant,Pau Gasol,Ron Artest,Marc Gasol,Mike Conley,O.J. Mayo,Rudy Gay,Zach Randolph,1,9:51,MEM,rebound,,,,,,,,,,,,,,,,,,
Andrew Bynum,Derek Fisher,Kobe Bryant,Lamar Odom,Ron Artest,Marc Gasol,Mike Conley,O.J. Mayo,Rudy Gay,Zach Randolph,1,9:51,LAL,sub,,,,Lamar Odom,,Pau Gasol,,,,,,,,,,,,
Andrew Bynum,Derek Fisher,Kobe Bryant,Lamar Odom,Ron Artest,Marc Gasol,Mike Conley,O.J. Mayo,Rudy Gay,Zach Randolph,1,9:51,MEM,free throw,,,,,,,2,,2,Mike Conley,,,foul,made,,,,
Andrew Bynum,Derek Fisher,Kobe Bryant,Lamar Odom,Ron Artest,Marc Gasol,Mike Conley,O.J. Mayo,Rudy Gay,Zach Randolph,1,9:31,LAL,shot,,,,,,,,,,Kobe Bryant,,,,missed,,jump,30,17
Andrew Bynum,Derek Fisher,Kobe Bryant,Lamar Odom,Ron Artest,Marc Gasol,Mike Conley,O.J. Mayo,Rudy Gay,Zach Randolph,1,9:30,MEM,rebound,,,,,,,,,,Zach Randolph,,,,,,def,,
Andrew Bynum,Derek Fisher,Kobe Bryant,Lamar Odom,Ron Artest,Marc Gasol,Mike Conley,O.J. Mayo,Rudy Gay,Zach Randolph,1,9:23,MEM,shot,Mike Conley,,,,,,,,,Rudy Gay,3,,,made,,3pt,41,26
Andrew Bynum,Derek Fisher,Kobe Bryant,Lamar Odom,Ron Artest,Marc Gasol,Mike Conley,O.J. Mayo,Rudy Gay,Zach Randolph,1,9:10,LAL,shot,,,,,,,,,,Kobe Bryant,,,,missed,,jump,28,25
Andrew Bynum,Derek Fisher,Kobe Bryant,Lamar Odom,Ron Artest,Marc Gasol,Mike Conley,O.J. Mayo,Rudy Gay,Zach Randolph,1,9:08,MEM,rebound,,,,,,,,,,Marc Gasol,,,,,,def,,
Andrew Bynum,Derek Fisher,Kobe Bryant,Lamar Odom,Ron Artest,Marc Gasol,Mike Conley,O.J. Mayo,Rudy Gay,Zach Randolph,1,8:59,MEM,shot,,,,,,,,,,O.J. Mayo,2,,,made,,jump,24,24
Andrew Bynum,Derek Fisher,Kobe Bryant,Lamar Odom,Ron Artest,Marc Gasol,Mike Conley,O.J. Mayo,Rudy Gay,Zach Randolph,1,8:46,MEM,foul,,,,,,,,Kobe Bryant,,Zach Randolph,,,,,,shooting,,
Andrew Bynum,Derek Fisher,Kobe Bryant,Lamar Odom,Ron Artest,Marc Gasol,Mike Conley,O.J. Mayo,Rudy Gay,Zach Randolph,1,8:46,LAL,free throw,,,,,,,1,,2,Kobe Bryant,,,foul,missed,,,,
Andrew Bynum,Derek Fisher,Kobe Bryant,Lamar Odom,Ron Artest,Marc Gasol,Mike Conley,O.J. Mayo,Rudy Gay,Zach Randolph,1,8:46,LAL,rebound,,,,,,,,,,,,,,,,,,
Andrew Bynum,Derek Fisher,Kobe Bryant,Lamar Odom,Ron Artest,Marc Gasol,Mike Conley,O.J. Mayo,Rudy Gay,Zach Randolph,1,8:46,LAL,free throw,,,,,,,2,,2,Kobe Bryant,,,foul,missed,,,,
Andrew Bynum,Derek Fisher,Kobe Bryant,Lamar Odom,Ron Artest,Marc Gasol,Mike Conley,O.J. Mayo,Rudy Gay,Zach Randolph,1,8:44,MEM,rebound,,,,,,,,,,Zach Randolph,,,,,,def,,
Andrew Bynum,Derek Fisher,Kobe Bryant,Lamar Odom,Ron Artest,Marc Gasol,Mike Conley,O.J. Mayo,Rudy Gay,Zach Randolph,1,8:28,MEM,shot,,,,,,,,,,Zach Randolph,2,,,made,,step back jump,13,8
Andrew Bynum,Derek Fisher,Kobe Bryant,Lamar Odom,Ron Artest,Marc Gasol,Mike Conley,O.J. Mayo,Rudy Gay,Zach Randolph,1,8:11,MEM,foul,,,,,,,,Andrew Bynum,,Marc Gasol,,,,,,shooting,,
Andrew Bynum,Derek Fisher,Kobe Bryant,Lamar Odom,Ron Artest,Marc Gasol,Mike Conley,O.J. Mayo,Rudy Gay,Zach Randolph,1,8:11,LAL,free throw,,,,,,,1,,2,Andrew Bynum,,,foul,made,,,,
Andrew Bynum,Derek Fisher,Kobe Bryant,Lamar Odom,Ron Artest,Marc Gasol,Mike Conley,O.J. Mayo,Rudy Gay,Zach Randolph,1,8:11,LAL,free throw,,,,,,,2,,2,Andrew Bynum,,,foul,made,,,,
Andrew Bynum,Derek Fisher,Kobe Bryant,Lamar Odom,Ron Artest,Marc Gasol,Mike Conley,O.J. Mayo,Rudy Gay,Zach Randolph,1,7:57,MEM,shot,,,,,,,,,,Rudy Gay,2,,,made,,driving layup,25,6
Andrew Bynum,Derek Fisher,Kobe Bryant,Lamar Odom,Ron Artest,Marc Gasol,Mike Conley,O.J. Mayo,Rudy Gay,Zach Randolph,1,7:48,MEM,foul,,,,,,,,Kobe Bryant,,O.J. Mayo,,,,,,personal,,
Andrew Bynum,Derek Fisher,Kobe Bryant,Lamar Odom,Ron Artest,Marc Gasol,Mike Conley,O.J. Mayo,Rudy Gay,Zach Randolph,1,7:42,LAL,shot,,,,,,,,,,Lamar Odom,2,,,made,,running jump,19,15
Andrew Bynum,Derek Fisher,Kobe Bryant,Lamar Odom,Ron Artest,Marc Gasol,Mike Conley,O.J. Mayo,Rudy Gay,Zach Randolph,1,7:27,MEM,shot,Mike Conley,,,,,,,,,Marc Gasol,2,,,made,,jump,36,9
Andrew Bynum,Derek Fisher,Kobe Bryant,Lamar Odom,Ron Artest,Marc Gasol,Mike Conley,O.J. Mayo,Rudy Gay,Zach Randolph,1,7:08,LAL,shot,,,,,,,,,,Andrew Bynum,,,,missed,,layup,25,6
Andrew Bynum,Derek Fisher,Kobe Bryant,Lamar Odom,Ron Artest,Marc Gasol,Mike Conley,O.J. Mayo,Rudy Gay,Zach Randolph,1,7:07,MEM,rebound,,,,,,,,,,Zach Randolph,,,,,,def,,
Andrew Bynum,Derek Fisher,Kobe Bryant,Lamar Odom,Ron Artest,Marc Gasol,Mike Conley,O.J. Mayo,Rudy Gay,Zach Randolph,1,6:58,MEM,shot,,,,,,,,,,O.J. Mayo,,,,missed,,3pt,8,24
Andrew Bynum,Derek Fisher,Kobe Bryant,Lamar Odom,Ron Artest,Marc Gasol,Mike Conley,O.J. Mayo,Rudy Gay,Zach Randolph,1,6:56,LAL,rebound,,,,,,,,,,Ron Artest,,,,,,def,,
Andrew Bynum,Derek Fisher,Kobe Bryant,Lamar Odom,Ron Artest,Marc Gasol,Mike Conley,O.J. Mayo,Rudy Gay,Zach Randolph,1,6:47,LAL,turnover,,,,,,,,,,Ron Artest,,,bad pass,,Rudy Gay,,,
Andrew Bynum,Derek Fisher,Kobe Bryant,Lamar Odom,Ron Artest,Marc Gasol,Mike Conley,O.J. Mayo,Rudy Gay,Zach Randolph,1,6:42,MEM,shot,,,,,,,,,,Rudy Gay,2,,,made,,jump,13,11
Andrew Bynum,Derek Fisher,Kobe Bryant,Lamar Odom,Ron Artest,Marc Gasol,Mike Conley,O.J. Mayo,Rudy Gay,Zach Randolph,1,6:24,LAL,turnover,,,,,,,,,,Andrew Bynum,,,poss lost ball turnover,,,,,
Andrew Bynum,Derek Fisher,Kobe Bryant,Lamar Odom,Ron Artest,Marc Gasol,Mike Conley,O.J. Mayo,Rudy Gay,Zach Randolph,1,6:05,MEM,shot,,,,,,,,,,O.J. Mayo,2,,,made,,driving finger roll layup,25,6
Andrew Bynum,Derek Fisher,Kobe Bryant,Lamar Odom,Ron Artest,Marc Gasol,Mike Conley,O.J. Mayo,Rudy Gay,Zach Randolph,1,5:50,LAL,shot,Lamar Odom,,,,,,,,,Ron Artest,2,,,made,,jump,37,23
Andrew Bynum,Derek Fisher,Kobe Bryant,Lamar Odom,Ron Artest,Marc Gasol,Mike Conley,O.J. Mayo,Rudy Gay,Zach Randolph,1,5:31,MEM,shot,,,,,,,,,,Mike Conley,,,,missed,,3pt,38,28
Andrew Bynum,Derek Fisher,Kobe Bryant,Lamar Odom,Ron Artest,Marc Gasol,Mike Conley,O.J. Mayo,Rudy Gay,Zach Randolph,1,5:30,LAL,rebound,,,,,,,,,,Kobe Bryant,,,,,,def,,
Andrew Bynum,Derek Fisher,Kobe Bryant,Lamar Odom,Ron Artest,Marc Gasol,Mike Conley,O.J. Mayo,Rudy Gay,Zach Randolph,1,5:20,LAL,shot,,,,,,,,,,Kobe Bryant,2,,,made,,turnaround jump,15,16
Andrew Bynum,Derek Fisher,Kobe Bryant,Lamar Odom,Ron Artest,Marc Gasol,Mike Conley,O.J. Mayo,Rudy Gay,Zach Randolph,1,5:16,MEM,timeout,,,,,,,,,,,,,,,,regular,,
Andrew Bynum,Jordan Farmar,Kobe Bryant,Lamar Odom,Ron Artest,Marc Gasol,Mike Conley,O.J. Mayo,Rudy Gay,Zach Randolph,1,5:16,LAL,sub,,,,Jordan Farmar,,Derek Fisher,,,,,,,,,,,,
Andrew Bynum,Jordan Farmar,Kobe Bryant,Lamar Odom,Ron Artest,Marc Gasol,Mike Conley,O.J. Mayo,Rudy Gay,Zach Randolph,1,5:00,MEM,shot,,,,,,,,,,Rudy Gay,,,,missed,,turnaround jump,32,8
Andrew Bynum,Jordan Farmar,Kobe Bryant,Lamar Odom,Ron Artest,Marc Gasol,Mike Conley,O.J. Mayo,Rudy Gay,Zach Randolph,1,4:57,LAL,rebound,,,,,,,,,,Lamar Odom,,,,,,def,,
Andrew Bynum,Jordan Farmar,Kobe Bryant,Lamar Odom,Ron Artest,Marc Gasol,Mike Conley,O.J. Mayo,Rudy Gay,Zach Randolph,1,4:43,LAL,shot,Ron Artest,,,,,,,,,Kobe Bryant,2,,,made,,jump,16,22
Andrew Bynum,Jordan Farmar,Kobe Bryant,Lamar Odom,Ron Artest,Marc Gasol,Mike Conley,O.J. Mayo,Rudy Gay,Zach Randolph,1,4:20,MEM,shot,,,,,,,,,,Zach Randolph,,,,missed,,turnaround jump,20,14
Andrew Bynum,Jordan Farmar,Kobe Bryant,Lamar Odom,Ron Artest,Marc Gasol,Mike Conley,O.J. Mayo,Rudy Gay,Zach Randolph,1,4:17,LAL,rebound,,,,,,,,,,Andrew Bynum,,,,,,def,,
Andrew Bynum,Jordan Farmar,Kobe Bryant,Lamar Odom,Ron Artest,Marc Gasol,Mike Conley,O.J. Mayo,Rudy Gay,Zach Randolph,1,4:09,LAL,shot,,,,,,,,,,Kobe Bryant,,,,missed,,3pt,2,8
Andrew Bynum,Jordan Farmar,Kobe Bryant,Lamar Odom,Ron Artest,Marc Gasol,Mike Conley,O.J. Mayo,Rudy Gay,Zach Randolph,1,4:08,MEM,rebound,,,,,,,,,,Marc Gasol,,,,,,def,,
Andrew Bynum,Jordan Farmar,Kobe Bryant,Lamar Odom,Ron Artest,Marc Gasol,Mike Conley,O.J. Mayo,Rudy Gay,Zach Randolph,1,4:00,MEM,shot,Rudy Gay,,,,,,,,,O.J. Mayo,3,,,made,,3pt,2,7
Andrew Bynum,Jordan Farmar,Kobe Bryant,Lamar Odom,Ron Artest,Marc Gasol,Mike Conley,O.J. Mayo,Rudy Gay,Zach Randolph,1,3:38,LAL,turnover,,,,,,,,,,Andrew Bynum,,,lost ball,,Marc Gasol,,,
Andrew Bynum,Jordan Farmar,Kobe Bryant,Lamar Odom,Ron Artest,Marc Gasol,Mike Conley,O.J. Mayo,Rudy Gay,Zach Randolph,1,3:21,MEM,shot,,,,,,,,,,O.J. Mayo,,,,missed,,step back jump,34,20
Andrew Bynum,Jordan Farmar,Kobe Bryant,Lamar Odom,Ron Artest,Marc Gasol,Mike Conley,O.J. Mayo,Rudy Gay,Zach Randolph,1,3:20,MEM,rebound,,,,,,,,,,Zach Randolph,,,,,,off,,
Andrew Bynum,Jordan Farmar,Kobe Bryant,Lamar Odom,Ron Artest,Marc Gasol,Mike Conley,O.J. Mayo,Rudy Gay,Zach Randolph,1,3:19,MEM,shot,,,,,,,,,,Zach Randolph,,,,missed,,tip,21,6
Andrew Bynum,Jordan Farmar,Kobe Bryant,Lamar Odom,Ron Artest,Marc Gasol,Mike Conley,O.J. Mayo,Rudy Gay,Zach Randolph,1,3:17,LAL,rebound,,,,,,,,,,Andrew Bynum,,,,,,def,,
Andrew Bynum,Jordan Farmar,Kobe Bryant,Lamar Odom,Ron Artest,Marc Gasol,Mike Conley,O.J. Mayo,Rudy Gay,Zach Randolph,1,3:09,LAL,shot,,,,,,,,,,Kobe Bryant,,,,missed,,jump,16,9
Andrew Bynum,Jordan Farmar,Kobe Bryant,Lamar Odom,Ron Artest,Marc Gasol,Mike Conley,O.J. Mayo,Rudy Gay,Zach Randolph,1,3:06,LAL,rebound,,,,,,,,,,Lamar Odom,,,,,,off,,
Andrew Bynum,Jordan Farmar,Kobe Bryant,Lamar Odom,Ron Artest,Marc Gasol,Mike Conley,O.J. Mayo,Rudy Gay,Zach Randolph,1,3:06,LAL,shot,,,,,,,,,,Lamar Odom,,,,missed,,tip,25,6
Andrew Bynum,Jordan Farmar,Kobe Bryant,Lamar Odom,Ron Artest,Marc Gasol,Mike Conley,O.J. Mayo,Rudy Gay,Zach Randolph,1,3:04,MEM,rebound,,,,,,,,,,Rudy Gay,,,,,,def,,
Andrew Bynum,Jordan Farmar,Kobe Bryant,Lamar Odom,Ron Artest,Marc Gasol,Mike Conley,O.J. Mayo,Rudy Gay,Zach Randolph,1,3:00,LAL,foul,,,,,,,,Marc Gasol,,Andrew Bynum,,,,,,shooting,,
Andrew Bynum,Jordan Farmar,Kobe Bryant,Lamar Odom,Ron Artest,Marc Gasol,Mike Conley,O.J. Mayo,Rudy Gay,Zach Randolph,1,3:00,MEM,free throw,,,,,,,1,,2,Marc Gasol,,,foul,missed,,,,
Andrew Bynum,Jordan Farmar,Kobe Bryant,Lamar Odom,Ron Artest,Marc Gasol,Mike Conley,O.J. Mayo,Rudy Gay,Zach Randolph,1,3:00,MEM,rebound,,,,,,,,,,,,,,,,,,
Andrew Bynum,Jordan Farmar,Kobe Bryant,Lamar Odom,Ron Artest,Marc Gasol,Mike Conley,O.J. Mayo,Rudy Gay,Zach Randolph,1,3:00,LAL,timeout,,,,,,,,,,,,,,,,regular,,
Andrew Bynum,Jordan Farmar,Kobe Bryant,Lamar Odom,Ron Artest,Marc Gasol,Mike Conley,O.J. Mayo,Rudy Gay,Zach Randolph,1,3:00,MEM,free throw,,,,,,,2,,2,Marc Gasol,,,foul,missed,,,,
Andrew Bynum,Jordan Farmar,Kobe Bryant,Lamar Odom,Ron Artest,Marc Gasol,Mike Conley,O.J. Mayo,Rudy Gay,Zach Randolph,1,2:58,LAL,rebound,,,,,,,,,,Andrew Bynum,,,,,,def,,
Andrew Bynum,Jordan Farmar,Kobe Bryant,Lamar Odom,Ron Artest,Marc Gasol,Mike Conley,O.J. Mayo,Rudy Gay,Zach Randolph,1,2:44,LAL,turnover,,,,,,,,,,Ron Artest,,,bad pass,,Mike Conley,,,
Andrew Bynum,Jordan Farmar,Kobe Bryant,Lamar Odom,Ron Artest,Marc Gasol,Mike Conley,O.J. Mayo,Rudy Gay,Zach Randolph,1,2:38,MEM,turnover,,,,,,,,,,O.J. Mayo,,,bad pass,,Lamar Odom,,,
Andrew Bynum,Jordan Farmar,Kobe Bryant,Lamar Odom,Ron Artest,Marc Gasol,Mike Conley,O.J. Mayo,Rudy Gay,Zach Randolph,1,2:33,LAL,shot,,,,,,,,,,Jordan Farmar,2,,,made,,driving layup,25,6
Andrew Bynum,Jordan Farmar,Kobe Bryant,Lamar Odom,Ron Artest,Marc Gasol,Mike Conley,O.J. Mayo,Rudy Gay,Zach Randolph,1,2:15,MEM,shot,,,,,,,,,,Mike Conley,,,,missed,,jump,12,22
Andrew Bynum,Jordan Farmar,Kobe Bryant,Lamar Odom,Ron Artest,Marc Gasol,Mike Conley,O.J. Mayo,Rudy Gay,Zach Randolph,1,2:14,MEM,rebound,,,,,,,,,,Zach Randolph,,,,,,off,,
Andrew Bynum,Jordan Farmar,Kobe Bryant,Lamar Odom,Ron Artest,Marc Gasol,Mike Conley,O.J. Mayo,Rudy Gay,Zach Randolph,1,2:12,MEM,shot,,,,,,,,,,Zach Randolph,,,,missed,,layup,25,6
Andrew Bynum,Jordan Farmar,Kobe Bryant,Lamar Odom,Ron Artest,Marc Gasol,Mike Conley,O.J. Mayo,Rudy Gay,Zach Randolph,1,2:11,MEM,rebound,,,,,,,,,,Marc Gasol,,,,,,off,,
Andrew Bynum,Jordan Farmar,Kobe Bryant,Lamar Odom,Ron Artest,Marc Gasol,Mike Conley,O.J. Mayo,Rudy Gay,Zach Randolph,1,2:07,MEM,shot,,,,,,,,,,Rudy Gay,,,,missed,,jump,37,6
Andrew Bynum,Jordan Farmar,Kobe Bryant,Lamar Odom,Ron Artest,Marc Gasol,Mike Conley,O.J. Mayo,Rudy Gay,Zach Randolph,1,2:05,LAL,rebound,,,,,,,,,,Andrew Bynum,,,,,,def,,
Andrew Bynum,Jordan Farmar,Kobe Bryant,Lamar Odom,Ron Artest,Marc Gasol,Mike Conley,O.J. Mayo,Rudy Gay,Zach Randolph,1,1:51,LAL,shot,,,,,,,,,,Jordan Farmar,,,,missed,,3pt,17,31
Andrew Bynum,Jordan Farmar,Kobe Bryant,Lamar Odom,Ron Artest,Marc Gasol,Mike Conley,O.J. Mayo,Rudy Gay,Zach Randolph,1,1:50,LAL,rebound,,,,,,,,,,Andrew Bynum,,,,,,off,,
Andrew Bynum,Jordan Farmar,Kobe Bryant,Lamar Odom,Ron Artest,Marc Gasol,Mike Conley,O.J. Mayo,Rudy Gay,Zach Randolph,1,1:44,LAL,shot,,,,,,,,,,Kobe Bryant,2,,,made,,driving finger roll layup,25,6
Andrew Bynum,Jordan Farmar,Kobe Bryant,Lamar Odom,Ron Artest,Marc Gasol,Mike Conley,O.J. Mayo,Rudy Gay,Zach Randolph,1,1:26,MEM,shot,Zach Randolph,,,,,,,,,Marc Gasol,2,,,made,,layup,25,6
Andrew Bynum,Jordan Farmar,Kobe Bryant,Lamar Odom,Ron Artest,Marc Gasol,Mike Conley,O.J. Mayo,Rudy Gay,Zach Randolph,1,1:10,MEM,foul,,,,,,,,Ron Artest,,Marc Gasol,,,,,,personal,,
Andrew Bynum,Jordan Farmar,Kobe Bryant,Lamar Odom,Ron Artest,Jamaal Tinsley,Marc Gasol,O.J. Mayo,Rudy Gay,Zach Randolph,1,1:10,MEM,sub,,,,Jamaal Tinsley,,Mike Conley,,,,,,,,,,,,
Andrew Bynum,Jordan Farmar,Kobe Bryant,Lamar Odom,Ron Artest,Hasheem Thabeet,Jamaal Tinsley,O.J. Mayo,Rudy Gay,Zach Randolph,1,1:10,MEM,sub,,,,Hasheem Thabeet,,Marc Gasol,,,,,,,,,,,,
D.J. Mbenga,Jordan Farmar,Kobe Bryant,Lamar Odom,Ron Artest,Hasheem Thabeet,Jamaal Tinsley,O.J. Mayo,Rudy Gay,Zach Randolph,1,1:10,LAL,sub,,,,D.J. Mbenga,,Andrew Bynum,,,,,,,,,,,,
D.J. Mbenga,Jordan Farmar,Kobe Bryant,Lamar Odom,Ron Artest,Hasheem Thabeet,Jamaal Tinsley,O.J. Mayo,Rudy Gay,Zach Randolph,1,1:10,LAL,free throw,,,,,,,1,,2,Ron Artest,,,foul,missed,,,,
D.J. Mbenga,Jordan Farmar,Kobe Bryant,Lamar Odom,Ron Artest,Hasheem Thabeet,Jamaal Tinsley,O.J. Mayo,Rudy Gay,Zach Randolph,1,1:10,LAL,rebound,,,,,,,,,,,,,,,,,,
D.J. Mbenga,Jordan Farmar,Kobe Bryant,Lamar Odom,Ron Artest,Hasheem Thabeet,Jamaal Tinsley,O.J. Mayo,Rudy Gay,Zach Randolph,1,1:10,LAL,free throw,,,,,,,2,,2,Ron Artest,,,foul,made,,,,
D.J. Mbenga,Jordan Farmar,Kobe Bryant,Lamar Odom,Ron Artest,Hasheem Thabeet,Jamaal Tinsley,O.J. Mayo,Rudy Gay,Zach Randolph,1,0:53,MEM,shot,,,,,,,,,,Jamaal Tinsley,,,,missed,,running jump,17,18
D.J. Mbenga,Jordan Farmar,Kobe Bryant,Lamar Odom,Ron Artest,Hasheem Thabeet,Jamaal Tinsley,O.J. Mayo,Rudy Gay,Zach Randolph,1,0:51,LAL,rebound,,,,,,,,,,Lamar Odom,,,,,,def,,
D.J. Mbenga,Jordan Farmar,Kobe Bryant,Lamar Odom,Ron Artest,Hasheem Thabeet,Jamaal Tinsley,O.J. Mayo,Rudy Gay,Zach Randolph,1,0:45,MEM,foul,,,,,,,,Kobe Bryant,,O.J. Mayo,,,,,,shooting,,
D.J. Mbenga,Jordan Farmar,Kobe Bryant,Lamar Odom,Shannon Brown,Hasheem Thabeet,Jamaal Tinsley,O.J. Mayo,Rudy Gay,Zach Randolph,1,0:45,LAL,sub,,,,Shannon Brown,,Ron Artest,,,,,,,,,,,,
D.J. Mbenga,Jordan Farmar,Kobe Bryant,Lamar Odom,Shannon Brown,Hasheem Thabeet,Jamaal Tinsley,O.J. Mayo,Rudy Gay,Zach Randolph,1,0:45,LAL,free throw,,,,,,,1,,2,Kobe Bryant,,,foul,missed,,,,
D.J. Mbenga,Jordan Farmar,Kobe Bryant,Lamar Odom,Shannon Brown,Hasheem Thabeet,Jamaal Tinsley,O.J. Mayo,Rudy Gay,Zach Randolph,1,0:45,LAL,rebound,,,,,,,,,,,,,,,,,,
D.J. Mbenga,Jordan Farmar,Kobe Bryant,Lamar Odom,Shannon Brown,DeMarre Carroll,Hasheem Thabeet,Jamaal Tinsley,Rudy Gay,Zach Randolph,1,0:45,MEM,sub,,,,DeMarre Carroll,,O.J. Mayo,,,,,,,,,,,,
D.J. Mbenga,Jordan Farmar,Kobe Bryant,Lamar Odom,Shannon Brown,DeMarre Carroll,Hasheem Thabeet,Jamaal Tinsley,Rudy Gay,Zach Randolph,1,0:45,LAL,free throw,,,,,,,2,,2,Kobe Bryant,,,foul,made,,,,
D.J. Mbenga,Jordan Farmar,Kobe Bryant,Lamar Odom,Shannon Brown,DeMarre Carroll,Hasheem Thabeet,Jamaal Tinsley,Rudy Gay,Zach Randolph,1,0:30,MEM,shot,,,,,,,,,,Zach Randolph,2,,,made,,jump,23,14
D.J. Mbenga,Jordan Farmar,Kobe Bryant,Lamar Odom,Shannon Brown,DeMarre Carroll,Hasheem Thabeet,Jamaal Tinsley,Rudy Gay,Zach Randolph,1,0:08,LAL,turnover,,,,,,,,,,Kobe Bryant,,,lost ball,,Rudy Gay,,,
D.J. Mbenga,Jordan Farmar,Kobe Bryant,Lamar Odom,Shannon Brown,DeMarre Carroll,Hasheem Thabeet,Jamaal Tinsley,Rudy Gay,Zach Randolph,1,0:02,MEM,shot,,,,,,,,,,Rudy Gay,,,,missed,,3pt,23,53
D.J. Mbenga,Jordan Farmar,Kobe Bryant,Lamar Odom,Shannon Brown,DeMarre Carroll,Hasheem Thabeet,Jamaal Tinsley,Rudy Gay,Zach Randolph,1,0:00,LAL,rebound,,,,,,,,,,Shannon Brown,,,,,,def,,
D.J. Mbenga,Jordan Farmar,Kobe Bryant,Lamar Odom,Shannon Brown,DeMarre Carroll,Hasheem Thabeet,Jamaal Tinsley,Rudy Gay,Zach Randolph,1,0:00,LAL,shot,Shannon Brown,,,,,,,,,Kobe Bryant,3,,,made,,3pt,6,22
Jordan Farmar,Lamar Odom,Luke Walton,Pau Gasol,Shannon Brown,DeMarre Carroll,Hasheem Thabeet,Jamaal Tinsley,Rudy Gay,Zach Randolph,2,11:48,LAL,shot,,,,,,,,,,Jordan Farmar,,,,missed,,3pt,29,33
Jordan Farmar,Lamar Odom,Luke Walton,Pau Gasol,Shannon Brown,DeMarre Carroll,Hasheem Thabeet,Jamaal Tinsley,Rudy Gay,Zach Randolph,2,11:47,MEM,rebound,,,,,,,,,,Zach Randolph,,,,,,def,,
Jordan Farmar,Lamar Odom,Luke Walton,Pau Gasol,Shannon Brown,DeMarre Carroll,Hasheem Thabeet,Jamaal Tinsley,Rudy Gay,Zach Randolph,2,11:32,MEM,shot,,,,,,,,,,Zach Randolph,2,,,made,,driving layup,25,6
Jordan Farmar,Lamar Odom,Luke Walton,Pau Gasol,Shannon Brown,DeMarre Carroll,Hasheem Thabeet,Jamaal Tinsley,Rudy Gay,Zach Randolph,2,11:32,LAL,foul,,,,,,,,Zach Randolph,,Lamar Odom,,,,,,shooting,,
Jordan Farmar,Lamar Odom,Luke Walton,Pau Gasol,Shannon Brown,DeMarre Carroll,Hasheem Thabeet,Jamaal Tinsley,Rudy Gay,Zach Randolph,2,11:32,MEM,free throw,,,,,,,1,,1,Zach Randolph,,,foul,made,,,,
Jordan Farmar,Lamar Odom,Luke Walton,Pau Gasol,Shannon Brown,DeMarre Carroll,Hasheem Thabeet,Jamaal Tinsley,Rudy Gay,Zach Randolph,2,11:17,LAL,shot,,,,,,,,,,Shannon Brown,,,,missed,,running layup,25,6
Jordan Farmar,Lamar Odom,Luke Walton,Pau Gasol,Shannon Brown,DeMarre Carroll,Hasheem Thabeet,Jamaal Tinsley,Rudy Gay,Zach Randolph,2,11:15,LAL,rebound,,,,,,,,,,Lamar Odom,,,,,,off,,
Jordan Farmar,Lamar Odom,Luke Walton,Pau Gasol,Shannon Brown,DeMarre Carroll,Hasheem Thabeet,Jamaal Tinsley,Rudy Gay,Zach Randolph,2,11:15,LAL,shot,,,,,,,,,,Lamar Odom,2,,,made,,tip,25,6
Jordan Farmar,Lamar Odom,Luke Walton,Pau Gasol,Shannon Brown,DeMarre Carroll,Hasheem Thabeet,Jamaal Tinsley,Rudy Gay,Zach Randolph,2,10:54,MEM,shot,,,,,,,,,,Rudy Gay,,,,missed,,jump,18,10
Jordan Farmar,Lamar Odom,Luke Walton,Pau Gasol,Shannon Brown,DeMarre Carroll,Hasheem Thabeet,Jamaal Tinsley,Rudy Gay,Zach Randolph,2,10:53,LAL,rebound,,,,,,,,,,Pau Gasol,,,,,,def,,
Jordan Farmar,Lamar Odom,Luke Walton,Pau Gasol,Shannon Brown,DeMarre Carroll,Hasheem Thabeet,Jamaal Tinsley,Rudy Gay,Zach Randolph,2,10:41,LAL,turnover,,,,,,,,,,Jordan Farmar,,,bad pass,,,,,
Jordan Farmar,Lamar Odom,Luke Walton,Pau Gasol,Shannon Brown,DeMarre Carroll,Hasheem Thabeet,Jamaal Tinsley,Rudy Gay,Zach Randolph,2,10:30,MEM,shot,,,,,,,,,,Zach Randolph,,,,missed,,running jump,23,16
Jordan Farmar,Lamar Odom,Luke Walton,Pau Gasol,Shannon Brown,DeMarre Carroll,Hasheem Thabeet,Jamaal Tinsley,Rudy Gay,Zach Randolph,2,10:27,LAL,rebound,,,,,,,,,,Jordan Farmar,,,,,,def,,
Jordan Farmar,Lamar Odom,Luke Walton,Pau Gasol,Shannon Brown,DeMarre Carroll,Hasheem Thabeet,Jamaal Tinsley,Rudy Gay,Zach Randolph,2,10:10,LAL,shot,,,,,,,,,,Shannon Brown,,,,missed,,jump,16,25
Jordan Farmar,Lamar Odom,Luke Walton,Pau Gasol,Shannon Brown,DeMarre Carroll,Hasheem Thabeet,Jamaal Tinsley,Rudy Gay,Zach Randolph,2,10:09,MEM,rebound,,,,,,,,,,Hasheem Thabeet,,,,,,def,,
Jordan Farmar,Lamar Odom,Luke Walton,Pau Gasol,Shannon Brown,DeMarre Carroll,Hasheem Thabeet,Jamaal Tinsley,Rudy Gay,Zach Randolph,2,10:01,MEM,shot,,,,,,,,,,Jamaal Tinsley,,,,missed,,layup,25,6
Jordan Farmar,Lamar Odom,Luke Walton,Pau Gasol,Shannon Brown,DeMarre Carroll,Hasheem Thabeet,Jamaal Tinsley,Rudy Gay,Zach Randolph,2,10:00,LAL,rebound,,,,,,,,,,Lamar Odom,,,,,,def,,
Jordan Farmar,Lamar Odom,Luke Walton,Pau Gasol,Shannon Brown,DeMarre Carroll,Hasheem Thabeet,Jamaal Tinsley,Rudy Gay,Zach Randolph,2,9:51,LAL,shot,Jordan Farmar,,,,,,,,,Pau Gasol,2,,,made,,jump,16,15