a1,a2,a3,a4,a5,h1,h2,h3,h4,h5,period,time,team,etype,assist,away,block,entered,home,left,num,opponent,outof,player,points,possession,reason,result,steal,type,x,y
Dwight Howard,Jameer Nelson,Matt Barnes,Rashard Lewis,Vince Carter,Marc Gasol,Mike Conley,O.J. Mayo,Rudy Gay,Zach Randolph,1,12:00,OFF,jump ball,,Dwight Howard,,,Marc Gasol,,,,,,,Zach Randolph,,,,,,
Dwight Howard,Jameer Nelson,Matt Barnes,Rashard Lewis,Vince Carter,Marc Gasol,Mike Conley,O.J. Mayo,Rudy Gay,Zach Randolph,1,11:47,MEM,shot,Marc Gasol,,,,,,,,,Rudy Gay,2,,,made,,jump bank,17,8
Dwight Howard,Jameer Nelson,Matt Barnes,Rashard Lewis,Vince Carter,Marc Gasol,Mike Conley,O.J. Mayo,Rudy Gay,Zach Randolph,1,11:33,ORL,shot,,,,,,,,,,Vince Carter,2,,,made,,reverse slam dunk,25,6
Dwight Howard,Jameer Nelson,Matt Barnes,Rashard Lewis,Vince Carter,Marc Gasol,Mike Conley,O.J. Mayo,Rudy Gay,Zach Randolph,1,11:04,MEM,shot,,,,,,,,,,Rudy Gay,,,,missed,,jump,10,22
Dwight Howard,Jameer Nelson,Matt Barnes,Rashard Lewis,Vince Carter,Marc Gasol,Mike Conley,O.J. Mayo,Rudy Gay,Zach Randolph,1,11:03,ORL,rebound,,,,,,,,,,Dwight Howard,,,,,,def,,
Dwight Howard,Jameer Nelson,Matt Barnes,Rashard Lewis,Vince Carter,Marc Gasol,Mike Conley,O.J. Mayo,Rudy Gay,Zach Randolph,1,10:56,ORL,turnover,,,,,,,,,,Jameer Nelson,,,lost ball,,Mike Conley,,,
Dwight Howard,Jameer Nelson,Matt Barnes,Rashard Lewis,Vince Carter,Marc Gasol,Mike Conley,O.J. Mayo,Rudy Gay,Zach Randolph,1,10:49,MEM,turnover,,,,,,,,,,Mike Conley,,,step out of bounds turnover,,,,,
Dwight Howard,Jameer Nelson,Matt Barnes,Rashard Lewis,Vince Carter,Marc Gasol,Mike Conley,O.J. Mayo,Rudy Gay,Zach Randolph,1,10:30,ORL,shot,,,,,,,,,,Dwight Howard,,,,missed,,jump,29,9
Dwight Howard,Jameer Nelson,Matt Barnes,Rashard Lewis,Vince Carter,Marc Gasol,Mike Conley,O.J. Mayo,Rudy Gay,Zach Randolph,1,10:28,MEM,rebound,,,,,,,,,,Zach Randolph,,,,,,def,,
Dwight Howard,Jameer Nelson,Matt Barnes,Rashard Lewis,Vince Carter,Marc Gasol,Mike Conley,O.J. Mayo,Rudy Gay,Zach Randolph,1,10:17,MEM,shot,,,,,,,,,,Marc Gasol,,,,missed,,jump,11,12
Dwight Howard,Jameer Nelson,Matt Barnes,Rashard Lewis,Vince Carter,Marc Gasol,Mike Conley,O.J. Mayo,Rudy Gay,Zach Randolph,1,10:16,ORL,rebound,,,,,,,,,,Matt Barnes,,,,,,def,,
Dwight Howard,Jameer Nelson,Matt Barnes,Rashard Lewis,Vince Carter,Marc Gasol,Mike Conley,O.J. Mayo,Rudy Gay,Zach Randolph,1,10:05,ORL,turnover,,,,,,,,,,Rashard Lewis,,,lost ball,,Marc Gasol,,,
Dwight Howard,Jameer Nelson,Matt Barnes,Rashard Lewis,Vince Carter,Marc Gasol,Mike Conley,O.J. Mayo,Rudy Gay,Zach Randolph,1,9:53,MEM,jump ball,,Vince Carter,,,Mike Conley,,,,,,,Jameer Nelson,,,,,,
Dwight Howard,Jameer Nelson,Matt Barnes,Rashard Lewis,Vince Carter,Marc Gasol,Mike Conley,O.J. Mayo,Rudy Gay,Zach Randolph,1,9:53,MEM,turnover,,,,,,,,,,Mike Conley,,,lost ball,,Vince Carter,,,
Dwight Howard,Jameer Nelson,Matt Barnes,Rashard Lewis,Vince Carter,Marc Gasol,Mike Conley,O.J. Mayo,Rudy Gay,Zach Randolph,1,9:39,ORL,shot,,,,,,,,,,Matt Barnes,,,,missed,,turnaround jump,23,13
Dwight Howard,Jameer Nelson,Matt Barnes,Rashard Lewis,Vince Carter,Marc Gasol,Mike Conley,O.J. Mayo,Rudy Gay,Zach Randolph,1,9:37,MEM,rebound,,,,,,,,,,Marc Gasol,,,,,,def,,
Dwight Howard,Jameer Nelson,Matt Barnes,Rashard Lewis,Vince Carter,Marc Gasol,Mike Conley,O.J. Mayo,Rudy Gay,Zach Randolph,1,9:29,MEM,shot,,,Vince Carter,,,,,,,Marc Gasol,,,,missed,,layup,25,6
Dwight Howard,Jameer Nelson,Matt Barnes,Rashard Lewis,Vince Carter,Marc Gasol,Mike Conley,O.J. Mayo,Rudy Gay,Zach Randolph,1,9:29,MEM,rebound,,,,,,,,,,,,,,,,,,
Dwight Howard,Jameer Nelson,Matt Barnes,Rashard Lewis,Vince Carter,Marc Gasol,Mike Conley,O.J. Mayo,Rudy Gay,Zach Randolph,1,9:29,MEM,turnover,,,,,,,,,,,,,backcourt turnover,,,,,
Dwight Howard,Jameer Nelson,Matt Barnes,Rashard Lewis,Vince Carter,Marc Gasol,Mike Conley,O.J. Mayo,Rudy Gay,Zach Randolph,1,9:14,ORL,shot,,,,,,,,,,Rashard Lewis,,,,missed,,3pt,43,24
Dwight Howard,Jameer Nelson,Matt Barnes,Rashard Lewis,Vince Carter,Marc Gasol,Mike Conley,O.J. Mayo,Rudy Gay,Zach Randolph,1,9:12,ORL,rebound,,,,,,,,,,Vince Carter,,,,,,off,,
Dwight Howard,Jameer Nelson,Matt Barnes,Rashard Lewis,Vince Carter,Marc Gasol,Mike Conley,O.J. Mayo,Rudy Gay,Zach Randolph,1,9:01,ORL,shot,Rashard Lewis,,,,,,,,,Dwight Howard,2,,,made,,slam dunk,25,6
Dwight Howard,Jameer Nelson,Matt Barnes,Rashard Lewis,Vince Carter,Marc Gasol,Mike Conley,O.J. Mayo,Rudy Gay,Zach Randolph,1,8:44,MEM,shot,,,,,,,,,,Zach Randolph,,,,missed,,layup,25,6
Dwight Howard,Jameer Nelson,Matt Barnes,Rashard Lewis,Vince Carter,Marc Gasol,Mike Conley,O.J. Mayo,Rudy Gay,Zach Randolph,1,8:44,MEM,rebound,,,,,,,,,,,,,,,,,,
Dwight Howard,Jameer Nelson,Matt Barnes,Rashard Lewis,Vince Carter,Marc Gasol,Mike Conley,O.J. Mayo,Rudy Gay,Zach Randolph,1,8:44,ORL,foul,,,,,,,,Zach Randolph,,Rashard Lewis,,,,,,loose ball,,
Dwight Howard,Jameer Nelson,Matt Barnes,Rashard Lewis,Vince Carter,Marc Gasol,Mike Conley,O.J. Mayo,Rudy Gay,Zach Randolph,1,8:24,MEM,shot,,,,,,,,,,O.J. Mayo,,,,missed,,3pt,13,28
Dwight Howard,Jameer Nelson,Matt Barnes,Rashard Lewis,Vince Carter,Marc Gasol,Mike Conley,O.J. Mayo,Rudy Gay,Zach Randolph,1,8:22,MEM,rebound,,,,,,,,,,Rudy Gay,,,,,,off,,
Dwight Howard,Jameer Nelson,Matt Barnes,Rashard Lewis,Vince Carter,Marc Gasol,Mike Conley,O.J. Mayo,Rudy Gay,Zach Randolph,1,8:19,MEM,shot,,,,,,,,,,Rudy Gay,2,,,made,,jump,34,14
Dwight Howard,Jameer Nelson,Matt Barnes,Rashard Lewis,Vince Carter,Marc Gasol,Mike Conley,O.J. Mayo,Rudy Gay,Zach Randolph,1,8:06,ORL,shot,,,,,,,,,,Jameer Nelson,,,,missed,,3pt,26,31
Dwight Howard,Jameer Nelson,Matt Barnes,Rashard Lewis,Vince Carter,Marc Gasol,Mike Conley,O.J. Mayo,Rudy Gay,Zach Randolph,1,8:05,ORL,rebound,,,,,,,,,,Rashard Lewis,,,,,,off,,
Dwight Howard,Jameer Nelson,Matt Barnes,Rashard Lewis,Vince Carter,Marc Gasol,Mike Conley,O.J. Mayo,Rudy Gay,Zach Randolph,1,7:53,ORL,shot,,,,,,,,,,Jameer Nelson,2,,,made,,layup,25,6
Dwight Howard,Jameer Nelson,Matt Barnes,Rashard Lewis,Vince Carter,Marc Gasol,Mike Conley,O.J. Mayo,Rudy Gay,Zach Randolph,1,7:53,MEM,foul,,,,,,,,Jameer Nelson,,Mike Conley,,,,,,shooting,,
Dwight Howard,Jameer Nelson,Matt Barnes,Rashard Lewis,Vince Carter,Marc Gasol,Mike Conley,O.J. Mayo,Rudy Gay,Zach Randolph,1,7:53,ORL,free throw,,,,,,,1,,1,Jameer Nelson,,,foul,made,,,,
Dwight Howard,Jameer Nelson,Matt Barnes,Rashard Lewis,Vince Carter,Marc Gasol,Mike Conley,O.J. Mayo,Rudy Gay,Zach Randolph,1,7:31,MEM,shot,,,,,,,,,,Zach Randolph,,,,missed,,layup,25,6
Dwight Howard,Jameer Nelson,Matt Barnes,Rashard Lewis,Vince Carter,Marc Gasol,Mike Conley,O.J. Mayo,Rudy Gay,Zach Randolph,1,7:31,MEM,rebound,,,,,,,,,,Zach Randolph,,,,,,off,,
Dwight Howard,Jameer Nelson,Matt Barnes,Rashard Lewis,Vince Carter,Marc Gasol,Mike Conley,O.J. Mayo,Rudy Gay,Zach Randolph,1,7:31,MEM,shot,,,,,,,,,,Zach Randolph,,,,missed,,tip,25,6
Dwight Howard,Jameer Nelson,Matt Barnes,Rashard Lewis,Vince Carter,Marc Gasol,Mike Conley,O.J. Mayo,Rudy Gay,Zach Randolph,1,7:31,MEM,rebound,,,,,,,,,,,,,,,,,,
Dwight Howard,Jameer Nelson,Matt Barnes,Rashard Lewis,Vince Carter,Marc Gasol,Mike Conley,O.J. Mayo,Rudy Gay,Zach Randolph,1,7:22,MEM,shot,,,,,,,,,,Mike Conley,2,,,made,,jump,9,14
Dwight Howard,Jameer Nelson,Matt Barnes,Rashard Lewis,Vince Carter,Marc Gasol,Mike Conley,O.J. Mayo,Rudy Gay,Zach Randolph,1,7:11,ORL,shot,Rashard Lewis,,,,,,,,,Dwight Howard,2,,,made,,layup,25,6
Dwight Howard,Jameer Nelson,Matt Barnes,Rashard Lewis,Vince Carter,Marc Gasol,Mike Conley,O.J. Mayo,Rudy Gay,Zach Randolph,1,6:52,MEM,turnover,,,,,,,,,,Marc Gasol,,,lost ball,,Jameer Nelson,,,
Dwight Howard,Jameer Nelson,Matt Barnes,Rashard Lewis,Vince Carter,Marc Gasol,Mike Conley,O.J. Mayo,Rudy Gay,Zach Randolph,1,6:46,ORL,shot,Matt Barnes,,,,,,,,,Rashard Lewis,2,,,made,,layup,25,6
Dwight Howard,Jameer Nelson,Matt Barnes,Rashard Lewis,Vince Carter,Marc Gasol,Mike Conley,O.J. Mayo,Rudy Gay,Zach Randolph,1,6:37,MEM,timeout,,,,,,,,,,,,,,,,regular,,
Dwight Howard,Jameer Nelson,Matt Barnes,Rashard Lewis,Vince Carter,Marc Gasol,Mike Conley,O.J. Mayo,Rudy Gay,Zach Randolph,1,6:26,MEM,shot,,,,,,,,,,O.J. Mayo,2,,,made,,running bank,14,10
Dwight Howard,Jameer Nelson,Matt Barnes,Rashard Lewis,Vince Carter,Marc Gasol,Mike Conley,O.J. Mayo,Rudy Gay,Zach Randolph,1,6:00,ORL,turnover,,,,,,,,,,Rashard Lewis,,,out of bounds lost ball turnover,,,,,
Dwight Howard,Jameer Nelson,Matt Barnes,Rashard Lewis,Vince Carter,Marc Gasol,Mike Conley,O.J. Mayo,Rudy Gay,Zach Randolph,1,5:52,ORL,foul,,,,,,,,Marc Gasol,,Matt Barnes,,,,,,personal,,
Dwight Howard,Jameer Nelson,Matt Barnes,Rashard Lewis,Vince Carter,Marc Gasol,Mike Conley,O.J. Mayo,Rudy Gay,Zach Randolph,1,5:38,MEM,shot,,,,,,,,,,Mike Conley,,,,missed,,jump,6,9
Dwight Howard,Jameer Nelson,Matt Barnes,Rashard Lewis,Vince Carter,Marc Gasol,Mike Conley,O.J. Mayo,Rudy Gay,Zach Randolph,1,5:37,ORL,rebound,,,,,,,,,,Matt Barnes,,,,,,def,,
Dwight Howard,Jameer Nelson,Matt Barnes,Rashard Lewis,Vince Carter,Marc Gasol,Mike Conley,O.J. Mayo,Rudy Gay,Zach Randolph,1,5:30,ORL,shot,,,Marc Gasol,,,,,,,Rashard Lewis,,,,missed,,layup,25,6
Dwight Howard,Jameer Nelson,Matt Barnes,Rashard Lewis,Vince Carter,Marc Gasol,Mike Conley,O.J. Mayo,Rudy Gay,Zach Randolph,1,5:28,ORL,rebound,,,,,,,,,,Dwight Howard,,,,,,off,,
Dwight Howard,Jameer Nelson,Matt Barnes,Rashard Lewis,Vince Carter,Marc Gasol,Mike Conley,O.J. Mayo,Rudy Gay,Zach Randolph,1,5:27,ORL,shot,,,,,,,,,,Dwight Howard,,,,missed,,layup,25,6
Dwight Howard,Jameer Nelson,Matt Barnes,Rashard Lewis,Vince Carter,Marc Gasol,Mike Conley,O.J. Mayo,Rudy Gay,Zach Randolph,1,5:24,ORL,rebound,,,,,,,,,,Rashard Lewis,,,,,,off,,
Dwight Howard,Jameer Nelson,Matt Barnes,Rashard Lewis,Vince Carter,Marc Gasol,Mike Conley,O.J. Mayo,Rudy Gay,Zach Randolph,1,5:12,ORL,turnover,,,,,,,,,,Matt Barnes,,,out of bounds lost ball turnover,,,,,
Dwight Howard,Jameer Nelson,Matt Barnes,Rashard Lewis,Vince Carter,Marc Gasol,Mike Conley,O.J. Mayo,Rudy Gay,Zach Randolph,1,4:55,MEM,shot,,,Dwight Howard,,,,,,,Rudy Gay,,,,missed,,layup,25,6
Dwight Howard,Jameer Nelson,Matt Barnes,Rashard Lewis,Vince Carter,Marc Gasol,Mike Conley,O.J. Mayo,Rudy Gay,Zach Randolph,1,4:53,ORL,rebound,,,,,,,,,,Matt Barnes,,,,,,def,,
Dwight Howard,Jameer Nelson,Matt Barnes,Rashard Lewis,Vince Carter,Marc Gasol,Mike Conley,O.J. Mayo,Rudy Gay,Zach Randolph,1,4:47,ORL,turnover,,,,,,,,,,Jameer Nelson,,,bad pass,,Marc Gasol,,,
Dwight Howard,Jameer Nelson,Matt Barnes,Rashard Lewis,Vince Carter,Marc Gasol,Mike Conley,O.J. Mayo,Rudy Gay,Zach Randolph,1,4:42,MEM,shot,,,,,,,,,,O.J. Mayo,,,,missed,,layup,25,6
Dwight Howard,Jameer Nelson,Matt Barnes,Rashard Lewis,Vince Carter,Marc Gasol,Mike Conley,O.J. Mayo,Rudy Gay,Zach Randolph,1,4:40,MEM,rebound,,,,,,,,,,O.J. Mayo,,,,,,off,,
Dwight Howard,Jameer Nelson,Matt Barnes,Rashard Lewis,Vince Carter,Marc Gasol,Mike Conley,O.J. Mayo,Rudy Gay,Zach Randolph,1,4:39,MEM,shot,,,,,,,,,,O.J. Mayo,2,,,made,,putback layup,25,6
Dwight Howard,Jameer Nelson,Matt Barnes,Rashard Lewis,Vince Carter,Marc Gasol,Mike Conley,O.J. Mayo,Rudy Gay,Zach Randolph,1,4:24,ORL,foul,,,,,,,,Marc Gasol,,Dwight Howard,,,,,,offensive,,
Dwight Howard,Jameer Nelson,Matt Barnes,Rashard Lewis,Vince Carter,Marc Gasol,Mike Conley,O.J. Mayo,Rudy Gay,Zach Randolph,1,4:24,ORL,turnover,,,,,,,,,,Dwight Howard,,,foul,,,,,
Dwight Howard,Jameer Nelson,Matt Barnes,Rashard Lewis,Vince Carter,Marc Gasol,Mike Conley,O.J. Mayo,Rudy Gay,Zach Randolph,1,4:11,MEM,shot,,,,,,,,,,Mike Conley,2,,,made,,pullup jump,24,21
Dwight Howard,Jameer Nelson,Matt Barnes,Rashard Lewis,Vince Carter,Marc Gasol,Mike Conley,O.J. Mayo,Rudy Gay,Zach Randolph,1,3:55,ORL,shot,,,,,,,,,,Vince Carter,2,,,made,,driving layup,25,6
Dwight Howard,Jameer Nelson,Matt Barnes,Rashard Lewis,Vince Carter,Marc Gasol,Mike Conley,O.J. Mayo,Rudy Gay,Zach Randolph,1,3:47,MEM,shot,Mike Conley,,,,,,,,,O.J. Mayo,3,,,made,,3pt,4,20
Dwight Howard,Jameer Nelson,Matt Barnes,Rashard Lewis,Vince Carter,Marc Gasol,Mike Conley,O.J. Mayo,Rudy Gay,Zach Randolph,1,3:23,ORL,shot,,,,,,,,,,Vince Carter,2,,,made,,driving layup,25,6
Dwight Howard,Jameer Nelson,Matt Barnes,Rashard Lewis,Vince Carter,Marc Gasol,Mike Conley,O.J. Mayo,Rudy Gay,Zach Randolph,1,3:06,ORL,foul,,,,,,,,Marc Gasol,,Jameer Nelson,,,,,,shooting,,
Dwight Howard,Jameer Nelson,Matt Barnes,Rashard Lewis,Vince Carter,Marc Gasol,Mike Conley,O.J. Mayo,Rudy Gay,Zach Randolph,1,3:06,MEM,free throw,,,,,,,1,,2,Marc Gasol,,,foul,made,,,,
Dwight Howard,J.J. Redick,Jameer Nelson,Matt Barnes,Rashard Lewis,Marc Gasol,Mike Conley,O.J. Mayo,Rudy Gay,Zach Randolph,1,3:06,ORL,sub,,,,J.J. Redick,,Vince Carter,,,,,,,,,,,,
Dwight Howard,J.J. Redick,Jason Williams,Matt Barnes,Rashard Lewis,Marc Gasol,Mike Conley,O.J. Mayo,Rudy Gay,Zach Randolph,1,3:06,ORL,sub,,,,Jason Williams,,Jameer Nelson,,,,,,,,,,,,
Dwight Howard,J.J. Redick,Jason Williams,Matt Barnes,Rashard Lewis,Marc Gasol,Mike Conley,O.J. Mayo,Rudy Gay,Zach Randolph,1,3:06,MEM,free throw,,,,,,,2,,2,Marc Gasol,,,foul,missed,,,,
Dwight Howard,J.J. Redick,Jason Williams,Matt Barnes,Rashard Lewis,Marc Gasol,Mike Conley,O.J. Mayo,Rudy Gay,Zach Randolph,1,3:06,MEM,rebound,,,,,,,,,,,,,,,,,,
Dwight Howard,J.J. Redick,Jason Williams,Matt Barnes,Rashard Lewis,Marc Gasol,Mike Conley,O.J. Mayo,Rudy Gay,Zach Randolph,1,3:00,MEM,shot,,,,,,,,,,Mike Conley,,,,missed,,jump,35,11
Dwight Howard,J.J. Redick,Jason Williams,Matt Barnes,Rashard Lewis,Marc Gasol,Mike Conley,O.J. Mayo,Rudy Gay,Zach Randolph,1,2:58,ORL,rebound,,,,,,,,,,,,,,,,,,
Dwight Howard,J.J. Redick,Jason Williams,Matt Barnes,Rashard Lewis,Marc Gasol,Mike Conley,O.J. Mayo,Rudy Gay,Zach Randolph,1,2:58,ORL,timeout,,,,,,,,,,,,,,,,regular,,
Dwight Howard,J.J. Redick,Jason Williams,Matt Barnes,Rashard Lewis,Marc Gasol,Mike Conley,O.J. Mayo,Rudy Gay,Zach Randolph,1,2:38,ORL,shot,Matt Barnes,,,,,,,,,J.J. Redick,3,,,made,,3pt,10,25
Dwight Howard,J.J. Redick,Jason Williams,Matt Barnes,Rashard Lewis,Marc Gasol,Mike Conley,O.J. Mayo,Rudy Gay,Zach Randolph,1,2:27,MEM,shot,,,Dwight Howard,,,,,,,O.J. Mayo,,,,missed,,layup,25,6
Dwight Howard,J.J. Redick,Jason Williams,Matt Barnes,Rashard Lewis,Marc Gasol,Mike Conley,O.J. Mayo,Rudy Gay,Zach Randolph,1,2:24,ORL,rebound,,,,,,,,,,Dwight Howard,,,,,,def,,
Dwight Howard,J.J. Redick,Jason Williams,Matt Barnes,Rashard Lewis,Marc Gasol,Mike Conley,O.J. Mayo,Rudy Gay,Zach Randolph,1,2:19,ORL,shot,Jason Williams,,,,,,,,,J.J. Redick,2,,,made,,jump,42,21
Dwight Howard,J.J. Redick,Jason Williams,Matt Barnes,Rashard Lewis,Marc Gasol,Mike Conley,O.J. Mayo,Rudy Gay,Zach Randolph,1,2:01,MEM,shot,,,,,,,,,,Mike Conley,,,,missed,,3pt,13,28
Dwight Howard,J.J. Redick,Jason Williams,Matt Barnes,Rashard Lewis,Marc Gasol,Mike Conley,O.J. Mayo,Rudy Gay,Zach Randolph,1,2:00,MEM,rebound,,,,,,,,,,Zach Randolph,,,,,,off,,
Dwight Howard,J.J. Redick,Jason Williams,Matt Barnes,Rashard Lewis,Marc Gasol,Mike Conley,O.J. Mayo,Rudy Gay,Zach Randolph,1,1:56,MEM,shot,,,,,,,,,,Zach Randolph,2,,,made,,hook,17,9
Dwight Howard,J.J. Redick,Jason Williams,Matt Barnes,Rashard Lewis,Marc Gasol,Mike Conley,O.J. Mayo,Rudy Gay,Zach Randolph,1,1:43,ORL,shot,,,,,,,,,,Jason Williams,,,,missed,,3pt,2,9
Dwight Howard,J.J. Redick,Jason Williams,Matt Barnes,Rashard Lewis,Marc Gasol,Mike Conley,O.J. Mayo,Rudy Gay,Zach Randolph,1,1:40,MEM,rebound,,,,,,,,,,Zach Randolph,,,,,,def,,
Dwight Howard,J.J. Redick,Jason Williams,Matt Barnes,Rashard Lewis,Marc Gasol,Mike Conley,O.J. Mayo,Rudy Gay,Zach Randolph,1,1:36,MEM,shot,Mike Conley,,,,,,,,,Marc Gasol,2,,,made,,dunk,25,6
Dwight Howard,J.J. Redick,Jason Williams,Matt Barnes,Rashard Lewis,Marc Gasol,Mike Conley,O.J. Mayo,Rudy Gay,Zach Randolph,1,1:19,ORL,shot,J.J. Redick,,,,,,,,,Rashard Lewis,3,,,made,,3pt,15,28
Dwight Howard,J.J. Redick,Jason Williams,Matt Barnes,Rashard Lewis,Marc Gasol,Mike Conley,O.J. Mayo,Rudy Gay,Zach Randolph,1,0:59,MEM,turnover,,,,,,,,,,Rudy Gay,,,bad pass,,Rashard Lewis,,,
Dwight Howard,J.J. Redick,Jason Williams,Matt Barnes,Rashard Lewis,Marc Gasol,Mike Conley,O.J. Mayo,Rudy Gay,Zach Randolph,1,0:54,ORL,turnover,,,,,,,,,,Jason Williams,,,bad pass,,,,,
Dwight Howard,J.J. Redick,Jason Williams,Matt Barnes,Rashard Lewis,Jamaal Tinsley,Marc Gasol,O.J. Mayo,Rudy Gay,Zach Randolph,1,0:54,MEM,sub,,,,Jamaal Tinsley,,Mike Conley,,,,,,,,,,,,
Dwight Howard,J.J. Redick,Jason Williams,Matt Barnes,Rashard Lewis,DeMarre Carroll,Jamaal Tinsley,Marc Gasol,O.J. Mayo,Rudy Gay,1,0:54,MEM,sub,,,,DeMarre Carroll,,Zach Randolph,,,,,,,,,,,,
Dwight Howard,J.J. Redick,Jason Williams,Matt Barnes,Rashard Lewis,DeMarre Carroll,Jamaal Tinsley,Marc Gasol,O.J. Mayo,Rudy Gay,1,0:36,MEM,shot,,,,,,,,,,Rudy Gay,2,,,made,,running bank,26,11
Dwight Howard,J.J. Redick,Jason Williams,Matt Barnes,Rashard Lewis,DeMarre Carroll,Jamaal Tinsley,Marc Gasol,O.J. Mayo,Rudy Gay,1,0:21,ORL,shot,,,,,,,,,,J.J. Redick,,,,missed,,3pt,43,22
Dwight Howard,J.J. Redick,Jason Williams,Matt Barnes,Rashard Lewis,DeMarre Carroll,Jamaal Tinsley,Marc Gasol,O.J. Mayo,Rudy Gay,1,0:19,ORL,rebound,,,,,,,,,,Matt Barnes,,,,,,off,,
Dwight Howard,J.J. Redick,Jason Williams,Matt Barnes,Rashard Lewis,DeMarre Carroll,Jamaal Tinsley,Marc Gasol,O.J. Mayo,Rudy Gay,1,0:05,MEM,foul,,,,,,,,Jason Williams,,Jamaal Tinsley,,,,,,personal,,
Dwight Howard,J.J. Redick,Jason Williams,Matt Barnes,Rashard Lewis,DeMarre Carroll,Jamaal Tinsley,Marc Gasol,O.J. Mayo,Rudy Gay,1,0:02,ORL,turnover,,,,,,,,,,Rashard Lewis,,,bad pass,,Marc Gasol,,,
Dwight Howard,J.J. Redick,Jason Williams,Matt Barnes,Rashard Lewis,DeMarre Carroll,Jamaal Tinsley,Marc Gasol,O.J. Mayo,Rudy Gay,1,0:00,MEM,shot,,,,,,,,,,Rudy Gay,,,,missed,,3pt,23,32
Dwight Howard,J.J. Redick,Jason Williams,Matt Barnes,Rashard Lewis,DeMarre Carroll,Jamaal Tinsley,Marc Gasol,O.J. Mayo,Rudy Gay,1,0:00,MEM,rebound,,,,,,,,,,,,,,,,,,
Dwight Howard,J.J. Redick,Jason Williams,Mickael Pietrus,Ryan Anderson,DeMarre Carroll,Jamaal Tinsley,Marc Gasol,Rudy Gay,Sam Young,2,11:46,ORL,shot,J.J. Redick,,,,,,,,,Dwight Howard,2,,,made,,layup,25,6
Dwight Howard,J.J. Redick,Jason Williams,Mickael Pietrus,Ryan Anderson,DeMarre Carroll,Hasheem Thabeet,Jamaal Tinsley,Rudy Gay,Sam Young,2,11:30,MEM,sub,,,,Hasheem Thabeet,,Marc Gasol,,,,,,,,,,,,
Dwight Howard,J.J. Redick,Jason Williams,Mickael Pietrus,Ryan Anderson,DeMarre Carroll,Hasheem Thabeet,Jamaal Tinsley,Rudy Gay,Sam Young,2,11:22,MEM,shot,,,,,,,,,,Jamaal Tinsley,,,,missed,,jump,19,24
Dwight Howard,J.J. Redick,Jason Williams,Mickael Pietrus,Ryan Anderson,DeMarre Carroll,Hasheem Thabeet,Jamaal Tinsley,Rudy Gay,Sam Young,2,11:21,MEM,rebound,,,,,,,,,,Sam Young,,,,,,off,,
Dwight Howard,J.J. Redick,Jason Williams,Mickael Pietrus,Ryan Anderson,DeMarre Carroll,Hasheem Thabeet,Jamaal Tinsley,Rudy Gay,Sam Young,2,11:16,MEM,turnover,,,,,,,,,,Sam Young,,,bad pass,,Mickael Pietrus,,,
Dwight Howard,J.J. Redick,Jason Williams,Mickael Pietrus,Ryan Anderson,DeMarre Carroll,Hasheem Thabeet,Jamaal Tinsley,Rudy Gay,Sam Young,2,11:12,ORL,shot,Jason Williams,,,,,,,,,Dwight Howard,2,,,made,,dunk,25,6
Dwight Howard,J.J. Redick,Jason Williams,Mickael Pietrus,Ryan Anderson,DeMarre Carroll,Hasheem Thabeet,Jamaal Tinsley,Rudy Gay,Sam Young,2,11:12,MEM,foul,,,,,,,,Dwight Howard,,Hasheem Thabeet,,,,,,shooting,,
Dwight Howard,J.J. Redick,Jason Williams,Mickael Pietrus,Ryan Anderson,DeMarre Carroll,Hasheem Thabeet,Jamaal Tinsley,Rudy Gay,Sam Young,2,11:12,ORL,free throw,,,,,,,1,,1,Dwight Howard,,,foul,made,,,,
Dwight Howard,J.J. Redick,Jason Williams,Mickael Pietrus,Ryan Anderson,DeMarre Carroll,Hasheem Thabeet,Jamaal Tinsley,Rudy Gay,Sam Young,2,10:56,MEM,turnover,,,,,,,,,,Rudy Gay,,,out of bounds lost ball turnover,,,,,
Dwight Howard,J.J. Redick,Jason Williams,Mickael Pietrus,Ryan Anderson,DeMarre Carroll,Hasheem Thabeet,Jamaal Tinsley,Rudy Gay,Sam Young,2,10:40,ORL,shot,,,,,,,,,,Mickael Pietrus,,,,missed,,3pt,2,9
Dwight Howard,J.J. Redick,Jason Williams,Mickael Pietrus,Ryan Anderson,DeMarre Carroll,Hasheem Thabeet,Jamaal Tinsley,Rudy Gay,Sam Young,2,10:39,ORL,rebound,,,,,,,,,,Ryan Anderson,,,,,,off,,
Dwight Howard,J.J. Redick,Jason Williams,Mickael Pietrus,Ryan Anderson,DeMarre Carroll,Hasheem Thabeet,Jamaal Tinsley,Rudy Gay,Sam Young,2,10:32,ORL,shot,,,,,,,,,,Jason Williams,,,,missed,,3pt,41,26
Dwight Howard,J.J. Redick,Jason Williams,Mickael Pietrus,Ryan Anderson,DeMarre Carroll,Hasheem Thabeet,Jamaal Tinsley,Rudy Gay,Sam Young,2,10:30,MEM,rebound,,,,,,,,,,Hasheem Thabeet,,,,,,def,,
Dwight Howard,J.J. Redick,Jason Williams,Mickael Pietrus,Ryan Anderson,DeMarre Carroll,Hasheem Thabeet,Jamaal Tinsley,Rudy Gay,Sam Young,2,10:16,MEM,shot,,,Dwight Howard,,,,,,,DeMarre Carroll,,,,missed,,layup,25,6
Dwight Howard,J.J. Redick,Jason Williams,Mickael Pietrus,Ryan Anderson,DeMarre Carroll,Hasheem Thabeet,Jamaal Tinsley,Rudy Gay,Sam Young,2,10:16,MEM,rebound,,,,,,,,,,,,,,,,,,
Dwight Howard,J.J. Redick,Jason Williams,Mickael Pietrus,Ryan Anderson,DeMarre Carroll,Hasheem Thabeet,Jamaal Tinsley,Rudy Gay,Sam Young,2,10:10,MEM,shot,,,Dwight Howard,,,,,,,Sam Young,,,,missed,,layup,25,6
Dwight Howard,J.J. Redick,Jason Williams,Mickael Pietrus,Ryan Anderson,DeMarre Carroll,Hasheem Thabeet,Jamaal Tinsley,Rudy Gay,Sam Young,2,10:10,MEM,rebound,,,,,,,,,,,,,,,,,,
Dwight Howard,J.J. Redick,Jason Williams,Mickael Pietrus,Ryan Anderson,DeMarre Carroll,Hasheem Thabeet,Jamaal Tinsley,Rudy Gay,Sam Young,2,10:07,MEM,turnover,,,,,,,,,,,,,shot clock turnover,,,,,
Dwight Howard,J.J. Redick,Jason Williams,Mickael Pietrus,Ryan Anderson,DeMarre Carroll,Hasheem Thabeet,Jamaal Tinsley,Rudy Gay,Sam Young,2,9:58,ORL,shot,,,,,,,,,,Jason Williams,2,,,made,,driving layup,25,6
Dwight Howard,J.J. Redick,Jason Williams,Mickael Pietrus,Ryan Anderson,DeMarre Carroll,Hasheem Thabeet,Jamaal Tinsley,Rudy Gay,Sam Young,2,9:45,ORL,foul,,,,,,,,Jamaal Tinsley,,Jason Williams,,,,,,personal,,
Dwight Howard,J.J. Redick,Jason Williams,Mickael Pietrus,Ryan Anderson,Hasheem Thabeet,Jamaal Tinsley,Rudy Gay,Sam Young,Zach Randolph,2,9:45,MEM,sub,,,,Zach Randolph,,DeMarre Carroll,,,,,,,,,,,,
Dwight Howard,J.J. Redick,Jason Williams,Mickael Pietrus,Ryan Anderson,Hasheem Thabeet,Jamaal Tinsley,O.J. Mayo,Sam Young,Zach Randolph,2,9:45,MEM,sub,,,,O.J. Mayo,,Rudy Gay,,,,,,,,,,,,
Dwight Howard,J.J. Redick,Jason Williams,Mickael Pietrus,Ryan Anderson,Hasheem Thabeet,Jamaal Tinsley,O.J. Mayo,Sam Young,Zach Randolph,2,9:41,MEM,turnover,,,,,,,,,,Jamaal Tinsley,,,traveling,,,,,
Dwight Howard,J.J. Redick,Jason Williams,Mickael Pietrus,Ryan Anderson,Hasheem Thabeet,Jamaal Tinsley,O.J. Mayo,Sam Young,Zach Randolph,2,9:21,ORL,shot,Dwight Howard,,,,,,,,,Ryan Anderson,3,,,made,,3pt,46,21
Dwight Howard,J.J. Redick,Jason Williams,Mickael Pietrus,Ryan Anderson,Hasheem Thabeet,Jamaal Tinsley,O.J. Mayo,Sam Young,Zach Randolph,2,9:02,MEM,shot,,,,,,,,,,Sam Young,2,,,made,,driving bank,18,9
Dwight Howard,J.J. Redick,Jason Williams,Mickael Pietrus,Ryan Anderson,Hasheem Thabeet,Jamaal Tinsley,O.J. Mayo,Sam Young,Zach Randolph,2,8:52,MEM,foul,,,,,,,,Dwight Howard,,Hasheem Thabeet,,,,,,shooting,,
Dwight Howard,J.J. Redick,Jason Williams,Mickael Pietrus,Ryan Anderson,Hasheem Thabeet,Jamaal Tinsley,O.J. Mayo,Sam Young,Zach Randolph,2,8:52,ORL,timeout,,,,,,,,,,,,,,,,official,,
Dwight Howard,J.J. Redick,Jason Williams,Mickael Pietrus,Ryan Anderson,Hasheem Thabeet,Jamaal Tinsley,O.J. Mayo,Sam Young,Zach Randolph,2,8:52,ORL,free throw,,,,,,,1,,2,Dwight Howard,,,foul,made,,,,
Dwight Howard,J.J. Redick,Jason Williams,Mickael Pietrus,Ryan Anderson,Hasheem Thabeet,Jamaal Tinsley,O.J. Mayo,Sam Young,Zach Randolph,2,8:52,ORL,free throw,,,,,,,2,,2,Dwight Howard,,,foul,made,,,,
Dwight Howard,J.J. Redick,Jason Williams,Mickael Pietrus,Ryan Anderson,Hasheem Thabeet,Jamaal Tinsley,O.J. Mayo,Sam Young,Zach Randolph,2,8:39,MEM,shot,,,,,,,,,,Sam Young,,,,missed,,jump,25,13
Dwight Howard,J.J. Redick,Jason Williams,Mickael Pietrus,Ryan Anderson,Hasheem Thabeet,Jamaal Tinsley,O.J. Mayo,Sam Young,Zach Randolph,2,8:37,ORL,rebound,,,,,,,,,,Dwight Howard,,,,,,def,,
Dwight Howard,J.J. Redick,Jason Williams,Mickael Pietrus,Ryan Anderson,Hasheem Thabeet,Jamaal Tinsley,O.J. Mayo,Sam Young,Zach Randolph,2,8:29,ORL,shot,Mickael Pietrus,,,,,,,,,J.J. Redick,3,,,made,,3pt,9,26