a1,a2,a3,a4,a5,h1,h2,h3,h4,h5,period,time,team,etype,assist,away,block,entered,home,left,num,opponent,outof,player,points,possession,reason,result,steal,type,x,y
Andrew Bynum,Derek Fisher,Kobe Bryant,Pau Gasol,Ron Artest,Andrea Bargnani,Chris Bosh,DeMar DeRozan,Hedo Turkoglu,Jarrett Jack,1,12:00,OFF,jump ball,,Andrew Bynum,,,Chris Bosh,,,,,,,Andrew Bynum,,,,,,
Andrew Bynum,Derek Fisher,Kobe Bryant,Pau Gasol,Ron Artest,Andrea Bargnani,Chris Bosh,DeMar DeRozan,Hedo Turkoglu,Jarrett Jack,1,11:44,LAL,shot,Ron Artest,,,,,,,,,Pau Gasol,2,,,made,,running bank,18,9
Andrew Bynum,Derek Fisher,Kobe Bryant,Pau Gasol,Ron Artest,Andrea Bargnani,Chris Bosh,DeMar DeRozan,Hedo Turkoglu,Jarrett Jack,1,11:25,TOR,shot,,,,,,,,,,DeMar DeRozan,,,,missed,,turnaround bank,28,10
Andrew Bynum,Derek Fisher,Kobe Bryant,Pau Gasol,Ron Artest,Andrea Bargnani,Chris Bosh,DeMar DeRozan,Hedo Turkoglu,Jarrett Jack,1,11:23,LAL,rebound,,,,,,,,,,Kobe Bryant,,,,,,def,,
Andrew Bynum,Derek Fisher,Kobe Bryant,Pau Gasol,Ron Artest,Andrea Bargnani,Chris Bosh,DeMar DeRozan,Hedo Turkoglu,Jarrett Jack,1,11:14,LAL,shot,,,,,,,,,,Kobe Bryant,2,,,made,,driving layup,23,7
Andrew Bynum,Derek Fisher,Kobe Bryant,Pau Gasol,Ron Artest,Andrea Bargnani,Chris Bosh,DeMar DeRozan,Hedo Turkoglu,Jarrett Jack,1,10:58,TOR,shot,,,,,,,,,,Jarrett Jack,2,,,made,,pullup jump,12,12
Andrew Bynum,Derek Fisher,Kobe Bryant,Pau Gasol,Ron Artest,Andrea Bargnani,Chris Bosh,DeMar DeRozan,Hedo Turkoglu,Jarrett Jack,1,10:42,LAL,shot,,,,,,,,,,Pau Gasol,,,,missed,,turnaround jump,19,15
Andrew Bynum,Derek Fisher,Kobe Bryant,Pau Gasol,Ron Artest,Andrea Bargnani,Chris Bosh,DeMar DeRozan,Hedo Turkoglu,Jarrett Jack,1,10:40,TOR,rebound,,,,,,,,,,Andrea Bargnani,,,,,,def,,
Andrew Bynum,Derek Fisher,Kobe Bryant,Pau Gasol,Ron Artest,Andrea Bargnani,Chris Bosh,DeMar DeRozan,Hedo Turkoglu,Jarrett Jack,1,10:33,TOR,turnover,,,,,,,,,,,,,backcourt turnover,,,,,
Andrew Bynum,Derek Fisher,Kobe Bryant,Pau Gasol,Ron Artest,Andrea Bargnani,Chris Bosh,DeMar DeRozan,Hedo Turkoglu,Jarrett Jack,1,10:20,LAL,shot,,,,,,,,,,Pau Gasol,,,,missed,,jump,24,20
Andrew Bynum,Derek Fisher,Kobe Bryant,Pau Gasol,Ron Artest,Andrea Bargnani,Chris Bosh,DeMar DeRozan,Hedo Turkoglu,Jarrett Jack,1,10:19,TOR,rebound,,,,,,,,,,Chris Bosh,,,,,,def,,
Andrew Bynum,Derek Fisher,Kobe Bryant,Pau Gasol,Ron Artest,Andrea Bargnani,Chris Bosh,DeMar DeRozan,Hedo Turkoglu,Jarrett Jack,1,10:08,TOR,turnover,,,,,,,,,,DeMar DeRozan,,,step out of bounds turnover,,,,,
Andrew Bynum,Derek Fisher,Kobe Bryant,Pau Gasol,Ron Artest,Andrea Bargnani,Chris Bosh,DeMar DeRozan,Hedo Turkoglu,Jarrett Jack,1,9:55,LAL,shot,,,,,,,,,,Derek Fisher,,,,missed,,jump,37,25
Andrew Bynum,Derek Fisher,Kobe Bryant,Pau Gasol,Ron Artest,Andrea Bargnani,Chris Bosh,DeMar DeRozan,Hedo Turkoglu,Jarrett Jack,1,9:54,TOR,rebound,,,,,,,,,,DeMar DeRozan,,,,,,def,,
Andrew Bynum,Derek Fisher,Kobe Bryant,Pau Gasol,Ron Artest,Andrea Bargnani,Chris Bosh,DeMar DeRozan,Hedo Turkoglu,Jarrett Jack,1,9:43,TOR,shot,,,,,,,,,,Chris Bosh,,,,missed,,jump,15,23
Andrew Bynum,Derek Fisher,Kobe Bryant,Pau Gasol,Ron Artest,Andrea Bargnani,Chris Bosh,DeMar DeRozan,Hedo Turkoglu,Jarrett Jack,1,9:42,LAL,rebound,,,,,,,,,,Kobe Bryant,,,,,,def,,
Andrew Bynum,Derek Fisher,Kobe Bryant,Pau Gasol,Ron Artest,Andrea Bargnani,Chris Bosh,DeMar DeRozan,Hedo Turkoglu,Jarrett Jack,1,9:31,LAL,shot,,,Chris Bosh,,,,,,,Andrew Bynum,,,,missed,,layup,27,6
Andrew Bynum,Derek Fisher,Kobe Bryant,Pau Gasol,Ron Artest,Andrea Bargnani,Chris Bosh,DeMar DeRozan,Hedo Turkoglu,Jarrett Jack,1,9:31,LAL,rebound,,,,,,,,,,,,,,,,,,
Andrew Bynum,Derek Fisher,Kobe Bryant,Pau Gasol,Ron Artest,Andrea Bargnani,Chris Bosh,DeMar DeRozan,Hedo Turkoglu,Jarrett Jack,1,9:22,LAL,shot,,,,,,,,,,Ron Artest,,,,missed,,3pt,48,7
Andrew Bynum,Derek Fisher,Kobe Bryant,Pau Gasol,Ron Artest,Andrea Bargnani,Chris Bosh,DeMar DeRozan,Hedo Turkoglu,Jarrett Jack,1,9:21,TOR,rebound,,,,,,,,,,Andrea Bargnani,,,,,,def,,
Andrew Bynum,Derek Fisher,Kobe Bryant,Pau Gasol,Ron Artest,Andrea Bargnani,Chris Bosh,DeMar DeRozan,Hedo Turkoglu,Jarrett Jack,1,9:14,TOR,shot,,,,,,,,,,DeMar DeRozan,,,,missed,,jump bank,32,10
Andrew Bynum,Derek Fisher,Kobe Bryant,Pau Gasol,Ron Artest,Andrea Bargnani,Chris Bosh,DeMar DeRozan,Hedo Turkoglu,Jarrett Jack,1,9:12,LAL,rebound,,,,,,,,,,Pau Gasol,,,,,,def,,
Andrew Bynum,Derek Fisher,Kobe Bryant,Pau Gasol,Ron Artest,Andrea Bargnani,Chris Bosh,DeMar DeRozan,Hedo Turkoglu,Jarrett Jack,1,8:57,LAL,shot,,,,,,,,,,Pau Gasol,2,,,made,,layup,27,6
Andrew Bynum,Derek Fisher,Kobe Bryant,Pau Gasol,Ron Artest,Andrea Bargnani,Chris Bosh,DeMar DeRozan,Hedo Turkoglu,Jarrett Jack,1,8:38,LAL,foul,,,,,,,,DeMar DeRozan,,Andrew Bynum,,,,,,shooting,,
Andrew Bynum,Derek Fisher,Kobe Bryant,Pau Gasol,Ron Artest,Andrea Bargnani,Chris Bosh,DeMar DeRozan,Hedo Turkoglu,Jarrett Jack,1,8:38,TOR,free throw,,,,,,,1,,2,DeMar DeRozan,,,foul,made,,,,
Andrew Bynum,Derek Fisher,Kobe Bryant,Pau Gasol,Ron Artest,Andrea Bargnani,Chris Bosh,DeMar DeRozan,Hedo Turkoglu,Jarrett Jack,1,8:38,TOR,free throw,,,,,,,2,,2,DeMar DeRozan,,,foul,missed,,,,
Andrew Bynum,Derek Fisher,Kobe Bryant,Pau Gasol,Ron Artest,Andrea Bargnani,Chris Bosh,DeMar DeRozan,Hedo Turkoglu,Jarrett Jack,1,8:37,LAL,rebound,,,,,,,,,,Andrew Bynum,,,,,,def,,
Andrew Bynum,Derek Fisher,Kobe Bryant,Pau Gasol,Ron Artest,Andrea Bargnani,Chris Bosh,DeMar DeRozan,Hedo Turkoglu,Jarrett Jack,1,8:26,TOR,foul,,,,,,,,Pau Gasol,,Chris Bosh,,,,,,personal,,
Andrew Bynum,Derek Fisher,Kobe Bryant,Pau Gasol,Ron Artest,Andrea Bargnani,Chris Bosh,DeMar DeRozan,Hedo Turkoglu,Jarrett Jack,1,8:12,LAL,shot,,,,,,,,,,Kobe Bryant,,,,missed,,fade away jumper,33,6
Andrew Bynum,Derek Fisher,Kobe Bryant,Pau Gasol,Ron Artest,Andrea Bargnani,Chris Bosh,DeMar DeRozan,Hedo Turkoglu,Jarrett Jack,1,8:12,LAL,rebound,,,,,,,,,,,,,,,,,,
Andrew Bynum,Derek Fisher,Kobe Bryant,Pau Gasol,Ron Artest,Andrea Bargnani,Chris Bosh,DeMar DeRozan,Hedo Turkoglu,Jarrett Jack,1,8:12,LAL,turnover,,,,,,,,,,,,,shot clock turnover,,,,,
Andrew Bynum,Derek Fisher,Kobe Bryant,Pau Gasol,Ron Artest,Andrea Bargnani,Chris Bosh,DeMar DeRozan,Hedo Turkoglu,Jarrett Jack,1,7:53,TOR,shot,,,,,,,,,,Chris Bosh,2,,,made,,jump bank hook,33,8
Andrew Bynum,Derek Fisher,Kobe Bryant,Pau Gasol,Ron Artest,Andrea Bargnani,Chris Bosh,DeMar DeRozan,Hedo Turkoglu,Jarrett Jack,1,7:36,LAL,shot,,,,,,,,,,Pau Gasol,,,,missed,,jump,25,18
Andrew Bynum,Derek Fisher,Kobe Bryant,Pau Gasol,Ron Artest,Andrea Bargnani,Chris Bosh,DeMar DeRozan,Hedo Turkoglu,Jarrett Jack,1,7:35,TOR,rebound,,,,,,,,,,Hedo Turkoglu,,,,,,def,,
Andrew Bynum,Derek Fisher,Kobe Bryant,Pau Gasol,Ron Artest,Andrea Bargnani,Chris Bosh,DeMar DeRozan,Hedo Turkoglu,Jarrett Jack,1,7:24,TOR,shot,,,,,,,,,,Andrea Bargnani,,,,missed,,driving jump,20,14
Andrew Bynum,Derek Fisher,Kobe Bryant,Pau Gasol,Ron Artest,Andrea Bargnani,Chris Bosh,DeMar DeRozan,Hedo Turkoglu,Jarrett Jack,1,7:23,LAL,rebound,,,,,,,,,,Kobe Bryant,,,,,,def,,
Andrew Bynum,Derek Fisher,Kobe Bryant,Pau Gasol,Ron Artest,Andrea Bargnani,Chris Bosh,DeMar DeRozan,Hedo Turkoglu,Jarrett Jack,1,7:10,LAL,shot,,,,,,,,,,Ron Artest,,,,missed,,jump,13,21
Andrew Bynum,Derek Fisher,Kobe Bryant,Pau Gasol,Ron Artest,Andrea Bargnani,Chris Bosh,DeMar DeRozan,Hedo Turkoglu,Jarrett Jack,1,7:09,TOR,rebound,,,,,,,,,,Chris Bosh,,,,,,def,,
Andrew Bynum,Derek Fisher,Kobe Bryant,Pau Gasol,Ron Artest,Andrea Bargnani,Chris Bosh,DeMar DeRozan,Hedo Turkoglu,Jarrett Jack,1,7:04,LAL,foul,,,,,,,,Jarrett Jack,,Derek Fisher,,,,,,personal,,
Andrew Bynum,Derek Fisher,Kobe Bryant,Pau Gasol,Ron Artest,Andrea Bargnani,Chris Bosh,DeMar DeRozan,Hedo Turkoglu,Jarrett Jack,1,6:56,TOR,shot,,,,,,,,,,Andrea Bargnani,,,,missed,,pullup jump,29,21
Andrew Bynum,Derek Fisher,Kobe Bryant,Pau Gasol,Ron Artest,Andrea Bargnani,Chris Bosh,DeMar DeRozan,Hedo Turkoglu,Jarrett Jack,1,6:55,LAL,rebound,,,,,,,,,,Kobe Bryant,,,,,,def,,
Andrew Bynum,Derek Fisher,Kobe Bryant,Pau Gasol,Ron Artest,Andrea Bargnani,Chris Bosh,DeMar DeRozan,Hedo Turkoglu,Jarrett Jack,1,6:49,LAL,shot,,,Hedo Turkoglu,,,,,,,Derek Fisher,,,,missed,,jump,22,6
Andrew Bynum,Derek Fisher,Kobe Bryant,Pau Gasol,Ron Artest,Andrea Bargnani,Chris Bosh,DeMar DeRozan,Hedo Turkoglu,Jarrett Jack,1,6:46,TOR,rebound,,,,,,,,,,Andrea Bargnani,,,,,,def,,
Andrew Bynum,Derek Fisher,Kobe Bryant,Pau Gasol,Ron Artest,Andrea Bargnani,Chris Bosh,DeMar DeRozan,Hedo Turkoglu,Jarrett Jack,1,6:41,TOR,shot,,,,,,,,,,Hedo Turkoglu,,,,missed,,driving finger roll layup,24,6
Andrew Bynum,Derek Fisher,Kobe Bryant,Pau Gasol,Ron Artest,Andrea Bargnani,Chris Bosh,DeMar DeRozan,Hedo Turkoglu,Jarrett Jack,1,6:39,LAL,rebound,,,,,,,,,,Derek Fisher,,,,,,def,,
Andrew Bynum,Derek Fisher,Kobe Bryant,Pau Gasol,Ron Artest,Andrea Bargnani,Chris Bosh,DeMar DeRozan,Hedo Turkoglu,Jarrett Jack,1,6:35,LAL,shot,,,,,,,,,,Ron Artest,,,,missed,,driving layup,25,6
Andrew Bynum,Derek Fisher,Kobe Bryant,Pau Gasol,Ron Artest,Andrea Bargnani,Chris Bosh,DeMar DeRozan,Hedo Turkoglu,Jarrett Jack,1,6:33,LAL,rebound,,,,,,,,,,Kobe Bryant,,,,,,off,,
Andrew Bynum,Derek Fisher,Kobe Bryant,Pau Gasol,Ron Artest,Andrea Bargnani,Chris Bosh,DeMar DeRozan,Hedo Turkoglu,Jarrett Jack,1,6:31,LAL,shot,,,,,,,,,,Kobe Bryant,2,,,made,,putback dunk,25,6
Andrew Bynum,Derek Fisher,Kobe Bryant,Pau Gasol,Ron Artest,Andrea Bargnani,Chris Bosh,DeMar DeRozan,Hedo Turkoglu,Jarrett Jack,1,6:18,TOR,shot,,,Andrew Bynum,,,,,,,Chris Bosh,,,,missed,,fade away jumper,34,8
Andrew Bynum,Derek Fisher,Kobe Bryant,Pau Gasol,Ron Artest,Andrea Bargnani,Chris Bosh,DeMar DeRozan,Hedo Turkoglu,Jarrett Jack,1,6:16,LAL,rebound,,,,,,,,,,Kobe Bryant,,,,,,def,,
Andrew Bynum,Derek Fisher,Kobe Bryant,Pau Gasol,Ron Artest,Andrea Bargnani,Chris Bosh,DeMar DeRozan,Hedo Turkoglu,Jarrett Jack,1,6:10,LAL,shot,Kobe Bryant,,,,,,,,,Pau Gasol,2,,,made,,layup,25,6
Andrew Bynum,Derek Fisher,Kobe Bryant,Pau Gasol,Ron Artest,Andrea Bargnani,Chris Bosh,DeMar DeRozan,Hedo Turkoglu,Jarrett Jack,1,6:00,TOR,timeout,,,,,,,,,,,,,,,,regular,,
Andrew Bynum,Derek Fisher,Kobe Bryant,Pau Gasol,Ron Artest,Andrea Bargnani,Chris Bosh,DeMar DeRozan,Hedo Turkoglu,Jarrett Jack,1,5:49,TOR,shot,,,,,,,,,,Andrea Bargnani,,,,missed,,3pt,26,31
Andrew Bynum,Derek Fisher,Kobe Bryant,Pau Gasol,Ron Artest,Andrea Bargnani,Chris Bosh,DeMar DeRozan,Hedo Turkoglu,Jarrett Jack,1,5:48,LAL,rebound,,,,,,,,,,Kobe Bryant,,,,,,def,,
Andrew Bynum,Derek Fisher,Kobe Bryant,Pau Gasol,Ron Artest,Andrea Bargnani,Chris Bosh,DeMar DeRozan,Hedo Turkoglu,Jarrett Jack,1,5:41,TOR,foul,,,,,,,,Andrew Bynum,,Hedo Turkoglu,,,,,,personal,,
Andrew Bynum,Derek Fisher,Kobe Bryant,Pau Gasol,Ron Artest,Andrea Bargnani,Chris Bosh,DeMar DeRozan,Hedo Turkoglu,Jarrett Jack,1,5:33,LAL,shot,,,,,,,,,,Pau Gasol,,,,missed,,jump hook,28,11
Andrew Bynum,Derek Fisher,Kobe Bryant,Pau Gasol,Ron Artest,Andrea Bargnani,Chris Bosh,DeMar DeRozan,Hedo Turkoglu,Jarrett Jack,1,5:28,LAL,rebound,,,,,,,,,,Andrew Bynum,,,,,,off,,
Andrew Bynum,Derek Fisher,Kobe Bryant,Pau Gasol,Ron Artest,Andrea Bargnani,Chris Bosh,DeMar DeRozan,Hedo Turkoglu,Jarrett Jack,1,5:26,LAL,shot,,,,,,,,,,Andrew Bynum,2,,,made,,layup,25,6
Andrew Bynum,Derek Fisher,Kobe Bryant,Pau Gasol,Ron Artest,Andrea Bargnani,Chris Bosh,DeMar DeRozan,Hedo Turkoglu,Jarrett Jack,1,5:14,TOR,shot,,,,,,,,,,DeMar DeRozan,,,,missed,,jump,5,6
Andrew Bynum,Derek Fisher,Kobe Bryant,Pau Gasol,Ron Artest,Andrea Bargnani,Chris Bosh,DeMar DeRozan,Hedo Turkoglu,Jarrett Jack,1,5:12,LAL,rebound,,,,,,,,,,Derek Fisher,,,,,,def,,
Andrew Bynum,Derek Fisher,Kobe Bryant,Pau Gasol,Ron Artest,Andrea Bargnani,Chris Bosh,DeMar DeRozan,Hedo Turkoglu,Jarrett Jack,1,5:07,LAL,shot,Derek Fisher,,,,,,,,,Pau Gasol,2,,,made,,driving dunk,25,6
Andrew Bynum,Derek Fisher,Kobe Bryant,Pau Gasol,Ron Artest,Andrea Bargnani,Chris Bosh,DeMar DeRozan,Hedo Turkoglu,Jarrett Jack,1,4:47,TOR,shot,Jarrett Jack,,,,,,,,,Chris Bosh,2,,,made,,jump,11,18
Andrew Bynum,Derek Fisher,Kobe Bryant,Pau Gasol,Ron Artest,Andrea Bargnani,Chris Bosh,DeMar DeRozan,Hedo Turkoglu,Jarrett Jack,1,4:32,LAL,shot,,,,,,,,,,Ron Artest,,,,missed,,3pt,2,6
Andrew Bynum,Derek Fisher,Kobe Bryant,Pau Gasol,Ron Artest,Andrea Bargnani,Chris Bosh,DeMar DeRozan,Hedo Turkoglu,Jarrett Jack,1,4:31,TOR,rebound,,,,,,,,,,DeMar DeRozan,,,,,,def,,
Andrew Bynum,Derek Fisher,Kobe Bryant,Pau Gasol,Ron Artest,Andrea Bargnani,Chris Bosh,DeMar DeRozan,Hedo Turkoglu,Jarrett Jack,1,4:18,TOR,shot,,,,,,,,,,DeMar DeRozan,2,,,made,,pullup jump,11,19
Andrew Bynum,Derek Fisher,Kobe Bryant,Pau Gasol,Ron Artest,Andrea Bargnani,Chris Bosh,DeMar DeRozan,Hedo Turkoglu,Jarrett Jack,1,4:02,LAL,shot,,,,,,,,,,Andrew Bynum,2,,,made,,jump hook,23,11
Andrew Bynum,Derek Fisher,Kobe Bryant,Pau Gasol,Ron Artest,Andrea Bargnani,Chris Bosh,DeMar DeRozan,Hedo Turkoglu,Jarrett Jack,1,3:52,TOR,shot,Jarrett Jack,,,,,,,,,Andrea Bargnani,2,,,made,,reverse dunk,25,7
Andrew Bynum,Derek Fisher,Kobe Bryant,Pau Gasol,Ron Artest,Andrea Bargnani,Chris Bosh,DeMar DeRozan,Hedo Turkoglu,Jarrett Jack,1,3:33,LAL,turnover,,,,,,,,,,Kobe Bryant,,,bad pass,,,,,
Andrew Bynum,Derek Fisher,Kobe Bryant,Pau Gasol,Ron Artest,Andrea Bargnani,Chris Bosh,Hedo Turkoglu,Jarrett Jack,Marco Belinelli,1,3:33,TOR,sub,,,,Marco Belinelli,,DeMar DeRozan,,,,,,,,,,,,
Andrew Bynum,Derek Fisher,Kobe Bryant,Pau Gasol,Ron Artest,Andrea Bargnani,Chris Bosh,Hedo Turkoglu,Jarrett Jack,Marco Belinelli,1,3:21,TOR,turnover,,,,,,,,,,Chris Bosh,,,traveling,,,,,
Andrew Bynum,Derek Fisher,Kobe Bryant,Pau Gasol,Ron Artest,Andrea Bargnani,Chris Bosh,Hedo Turkoglu,Jarrett Jack,Marco Belinelli,1,3:08,LAL,shot,,,Andrea Bargnani,,,,,,,Andrew Bynum,,,,missed,,jump,30,7
Andrew Bynum,Derek Fisher,Kobe Bryant,Pau Gasol,Ron Artest,Andrea Bargnani,Chris Bosh,Hedo Turkoglu,Jarrett Jack,Marco Belinelli,1,3:06,TOR,rebound,,,,,,,,,,Andrea Bargnani,,,,,,def,,
Andrew Bynum,Derek Fisher,Kobe Bryant,Pau Gasol,Ron Artest,Andrea Bargnani,Chris Bosh,Hedo Turkoglu,Jarrett Jack,Marco Belinelli,1,3:02,TOR,shot,Hedo Turkoglu,,,,,,,,,Chris Bosh,2,,,made,,slam dunk,24,7
Andrew Bynum,Derek Fisher,Kobe Bryant,Pau Gasol,Ron Artest,Andrea Bargnani,Chris Bosh,Hedo Turkoglu,Jarrett Jack,Marco Belinelli,1,2:43,LAL,timeout,,,,,,,,,,,,,,,,regular,,
Andrew Bynum,Derek Fisher,Kobe Bryant,Pau Gasol,Ron Artest,Andrea Bargnani,Chris Bosh,Hedo Turkoglu,Jose Calderon,Marco Belinelli,1,2:43,TOR,sub,,,,Jose Calderon,,Jarrett Jack,,,,,,,,,,,,
Derek Fisher,Jordan Farmar,Kobe Bryant,Pau Gasol,Ron Artest,Andrea Bargnani,Chris Bosh,Hedo Turkoglu,Jose Calderon,Marco Belinelli,1,2:43,LAL,sub,,,,Jordan Farmar,,Andrew Bynum,,,,,,,,,,,,
Jordan Farmar,Kobe Bryant,Lamar Odom,Pau Gasol,Ron Artest,Andrea Bargnani,Chris Bosh,Hedo Turkoglu,Jose Calderon,Marco Belinelli,1,2:43,LAL,sub,,,,Lamar Odom,,Derek Fisher,,,,,,,,,,,,
Jordan Farmar,Kobe Bryant,Lamar Odom,Pau Gasol,Ron Artest,Andrea Bargnani,Chris Bosh,Hedo Turkoglu,Jose Calderon,Marco Belinelli,1,2:40,LAL,shot,Ron Artest,,,,,,,,,Kobe Bryant,2,,,made,,jump,40,8
Jordan Farmar,Kobe Bryant,Lamar Odom,Pau Gasol,Ron Artest,Andrea Bargnani,Chris Bosh,Hedo Turkoglu,Jose Calderon,Marco Belinelli,1,2:24,TOR,shot,,,,,,,,,,Andrea Bargnani,,,,missed,,driving jump,26,13
Jordan Farmar,Kobe Bryant,Lamar Odom,Pau Gasol,Ron Artest,Andrea Bargnani,Chris Bosh,Hedo Turkoglu,Jose Calderon,Marco Belinelli,1,2:22,LAL,rebound,,,,,,,,,,Jordan Farmar,,,,,,def,,
Jordan Farmar,Kobe Bryant,Lamar Odom,Pau Gasol,Ron Artest,Andrea Bargnani,Chris Bosh,Hedo Turkoglu,Jose Calderon,Marco Belinelli,1,2:07,LAL,shot,,,,,,,,,,Ron Artest,,,,missed,,turnaround fade away,33,14
Jordan Farmar,Kobe Bryant,Lamar Odom,Pau Gasol,Ron Artest,Andrea Bargnani,Chris Bosh,Hedo Turkoglu,Jose Calderon,Marco Belinelli,1,2:05,TOR,rebound,,,,,,,,,,Andrea Bargnani,,,,,,def,,
Jordan Farmar,Kobe Bryant,Lamar Odom,Pau Gasol,Ron Artest,Andrea Bargnani,Chris Bosh,Hedo Turkoglu,Jose Calderon,Marco Belinelli,1,1:57,TOR,shot,,,,,,,,,,Jose Calderon,,,,missed,,pullup jump,39,22
Jordan Farmar,Kobe Bryant,Lamar Odom,Pau Gasol,Ron Artest,Andrea Bargnani,Chris Bosh,Hedo Turkoglu,Jose Calderon,Marco Belinelli,1,1:56,LAL,rebound,,,,,,,,,,Lamar Odom,,,,,,def,,
Jordan Farmar,Kobe Bryant,Lamar Odom,Pau Gasol,Ron Artest,Andrea Bargnani,Chris Bosh,Hedo Turkoglu,Jose Calderon,Marco Belinelli,1,1:44,LAL,shot,,,,,,,,,,Jordan Farmar,2,,,made,,pullup jump,30,15
Jordan Farmar,Kobe Bryant,Lamar Odom,Pau Gasol,Ron Artest,Andrea Bargnani,Chris Bosh,Hedo Turkoglu,Jose Calderon,Marco Belinelli,1,1:26,LAL,foul,,,,,,,,Hedo Turkoglu,,Pau Gasol,,,,,,shooting,,
Jordan Farmar,Kobe Bryant,Lamar Odom,Pau Gasol,Ron Artest,Amir Johnson,Chris Bosh,Hedo Turkoglu,Jose Calderon,Marco Belinelli,1,1:26,TOR,sub,,,,Amir Johnson,,Andrea Bargnani,,,,,,,,,,,,
Jordan Farmar,Kobe Bryant,Lamar Odom,Pau Gasol,Ron Artest,Amir Johnson,Chris Bosh,Hedo Turkoglu,Jose Calderon,Marco Belinelli,1,1:26,TOR,free throw,,,,,,,1,,2,Hedo Turkoglu,,,foul,made,,,,
Jordan Farmar,Kobe Bryant,Lamar Odom,Pau Gasol,Ron Artest,Amir Johnson,Chris Bosh,Hedo Turkoglu,Jose Calderon,Marco Belinelli,1,1:26,TOR,free throw,,,,,,,2,,2,Hedo Turkoglu,,,foul,made,,,,
Jordan Farmar,Kobe Bryant,Lamar Odom,Pau Gasol,Ron Artest,Amir Johnson,Chris Bosh,Hedo Turkoglu,Jose Calderon,Marco Belinelli,1,1:05,LAL,shot,,,,,,,,,,Lamar Odom,,,,missed,,jump,33,20
Jordan Farmar,Kobe Bryant,Lamar Odom,Pau Gasol,Ron Artest,Amir Johnson,Chris Bosh,Hedo Turkoglu,Jose Calderon,Marco Belinelli,1,1:04,TOR,rebound,,,,,,,,,,Marco Belinelli,,,,,,def,,
Jordan Farmar,Kobe Bryant,Lamar Odom,Pau Gasol,Ron Artest,Amir Johnson,Chris Bosh,Hedo Turkoglu,Jose Calderon,Marco Belinelli,1,0:58,LAL,foul,,,,,,,,Amir Johnson,,Lamar Odom,,,,,,shooting,,
Jordan Farmar,Kobe Bryant,Lamar Odom,Pau Gasol,Ron Artest,Amir Johnson,Chris Bosh,Hedo Turkoglu,Jose Calderon,Marco Belinelli,1,0:58,TOR,free throw,,,,,,,1,,2,Amir Johnson,,,foul,made,,,,
Jordan Farmar,Kobe Bryant,Lamar Odom,Pau Gasol,Ron Artest,Amir Johnson,Antoine Wright,Chris Bosh,Jose Calderon,Marco Belinelli,1,0:58,TOR,sub,,,,Antoine Wright,,Hedo Turkoglu,,,,,,,,,,,,
Jordan Farmar,Kobe Bryant,Lamar Odom,Pau Gasol,Ron Artest,Amir Johnson,Antoine Wright,Chris Bosh,Jose Calderon,Marco Belinelli,1,0:58,TOR,free throw,,,,,,,2,,2,Amir Johnson,,,foul,missed,,,,
Jordan Farmar,Kobe Bryant,Lamar Odom,Pau Gasol,Ron Artest,Amir Johnson,Antoine Wright,Chris Bosh,Jose Calderon,Marco Belinelli,1,0:57,LAL,rebound,,,,,,,,,,Lamar Odom,,,,,,def,,
Jordan Farmar,Kobe Bryant,Lamar Odom,Pau Gasol,Ron Artest,Amir Johnson,Antoine Wright,Chris Bosh,Jose Calderon,Marco Belinelli,1,0:42,LAL,shot,Ron Artest,,,,,,,,,Lamar Odom,2,,,made,,layup,28,7
Jordan Farmar,Kobe Bryant,Lamar Odom,Pau Gasol,Ron Artest,Amir Johnson,Antoine Wright,Chris Bosh,Jose Calderon,Marco Belinelli,1,0:30,TOR,shot,,,,,,,,,,Chris Bosh,2,,,made,,driving hook,22,8
Jordan Farmar,Kobe Bryant,Lamar Odom,Pau Gasol,Ron Artest,Amir Johnson,Antoine Wright,Chris Bosh,Jose Calderon,Marco Belinelli,1,0:21,LAL,shot,,,,,,,,,,Pau Gasol,2,,,made,,turnaround jump,21,7
Jordan Farmar,Kobe Bryant,Lamar Odom,Pau Gasol,Ron Artest,Amir Johnson,Antoine Wright,Chris Bosh,Jose Calderon,Marco Belinelli,1,0:02,TOR,shot,Jose Calderon,,,,,,,,,Marco Belinelli,3,,,made,,3pt,40,25
Jordan Farmar,Kobe Bryant,Lamar Odom,Pau Gasol,Ron Artest,Amir Johnson,Antoine Wright,Chris Bosh,Jose Calderon,Marco Belinelli,1,0:00,LAL,shot,,,,,,,,,,Kobe Bryant,,,,missed,,3pt,16,47
Jordan Farmar,Kobe Bryant,Lamar Odom,Pau Gasol,Ron Artest,Amir Johnson,Antoine Wright,Chris Bosh,Jose Calderon,Marco Belinelli,1,0:00,LAL,rebound,,,,,,,,,,,,,,,,,,
Andrew Bynum,Jordan Farmar,Kobe Bryant,Lamar Odom,Shannon Brown,Amir Johnson,Andrea Bargnani,Antoine Wright,Jose Calderon,Marco Belinelli,2,11:50,TOR,shot,,,,,,,,,,Jose Calderon,,,,missed,,3pt,41,26
Andrew Bynum,Jordan Farmar,Kobe Bryant,Lamar Odom,Shannon Brown,Amir Johnson,Andrea Bargnani,Antoine Wright,Jose Calderon,Marco Belinelli,2,11:49,LAL,rebound,,,,,,,,,,Kobe Bryant,,,,,,def,,
Andrew Bynum,Jordan Farmar,Kobe Bryant,Lamar Odom,Shannon Brown,Amir Johnson,Andrea Bargnani,Antoine Wright,Jose Calderon,Marco Belinelli,2,11:34,LAL,shot,,,,,,,,,,Andrew Bynum,,,,missed,,jump,18,14
Andrew Bynum,Jordan Farmar,Kobe Bryant,Lamar Odom,Shannon Brown,Amir Johnson,Andrea Bargnani,Antoine Wright,Jose Calderon,Marco Belinelli,2,11:33,LAL,rebound,,,,,,,,,,Jordan Farmar,,,,,,off,,
Andrew Bynum,Jordan Farmar,Kobe Bryant,Lamar Odom,Shannon Brown,Amir Johnson,Andrea Bargnani,Antoine Wright,Jose Calderon,Marco Belinelli,2,11:31,LAL,shot,,,,,,,,,,Jordan Farmar,,,,missed,,tip,25,6
Andrew Bynum,Jordan Farmar,Kobe Bryant,Lamar Odom,Shannon Brown,Amir Johnson,Andrea Bargnani,Antoine Wright,Jose Calderon,Marco Belinelli,2,11:29,TOR,rebound,,,,,,,,,,Antoine Wright,,,,,,def,,
Andrew Bynum,Jordan Farmar,Kobe Bryant,Lamar Odom,Shannon Brown,Amir Johnson,Andrea Bargnani,Antoine Wright,Jose Calderon,Marco Belinelli,2,11:15,TOR,shot,,,,,,,,,,Jose Calderon,2,,,made,,pullup jump,44,9
Andrew Bynum,Jordan Farmar,Kobe Bryant,Lamar Odom,Shannon Brown,Amir Johnson,Andrea Bargnani,Antoine Wright,Jose Calderon,Marco Belinelli,2,10:59,LAL,shot,Kobe Bryant,,,,,,,,,Andrew Bynum,2,,,made,,alley oop dunk,26,6
Andrew Bynum,Jordan Farmar,Kobe Bryant,Lamar Odom,Shannon Brown,Amir Johnson,Andrea Bargnani,Antoine Wright,Jose Calderon,Marco Belinelli,2,10:40,TOR,shot,,,,,,,,,,Amir Johnson,,,,missed,,hook,29,10
Andrew Bynum,Jordan Farmar,Kobe Bryant,Lamar Odom,Shannon Brown,Amir Johnson,Andrea Bargnani,Antoine Wright,Jose Calderon,Marco Belinelli,2,10:38,LAL,rebound,,,,,,,,,,Andrew Bynum,,,,,,def,,
Andrew Bynum,Jordan Farmar,Kobe Bryant,Lamar Odom,Shannon Brown,Amir Johnson,Andrea Bargnani,Antoine Wright,Jose Calderon,Marco Belinelli,2,10:30,LAL,shot,,,,,,,,,,Kobe Bryant,,,,missed,,3pt,28,30
Andrew Bynum,Jordan Farmar,Kobe Bryant,Lamar Odom,Shannon Brown,Amir Johnson,Andrea Bargnani,Antoine Wright,Jose Calderon,Marco Belinelli,2,10:28,TOR,rebound,,,,,,,,,,Jose Calderon,,,,,,def,,
Andrew Bynum,Jordan Farmar,Kobe Bryant,Lamar Odom,Shannon Brown,Amir Johnson,Andrea Bargnani,Antoine Wright,Jose Calderon,Marco Belinelli,2,10:23,LAL,foul,,,,,,,,Andrea Bargnani,,Jordan Farmar,,,,,,shooting,,
Andrew Bynum,Jordan Farmar,Kobe Bryant,Lamar Odom,Shannon Brown,Amir Johnson,Andrea Bargnani,Antoine Wright,Jose Calderon,Marco Belinelli,2,10:23,TOR,free throw,,,,,,,1,,2,Andrea Bargnani,,,foul,made,,,,
Andrew Bynum,Jordan Farmar,Kobe Bryant,Lamar Odom,Shannon Brown,Amir Johnson,Andrea Bargnani,Antoine Wright,Jose Calderon,Marco Belinelli,2,10:23,TOR,free throw,,,,,,,2,,2,Andrea Bargnani,,,foul,made,,,,
Andrew Bynum,Jordan Farmar,Kobe Bryant,Lamar Odom,Shannon Brown,Amir Johnson,Andrea Bargnani,Antoine Wright,Jose Calderon,Marco Belinelli,2,10:13,LAL,shot,,,,,,,,,,Jordan Farmar,,,,missed,,pullup jump,9,7
Andrew Bynum,Jordan Farmar,Kobe Bryant,Lamar Odom,Shannon Brown,Amir Johnson,Andrea Bargnani,Antoine Wright,Jose Calderon,Marco Belinelli,2,10:12,LAL,rebound,,,,,,,,,,Lamar Odom,,,,,,off,,
Andrew Bynum,Jordan Farmar,Kobe Bryant,Lamar Odom,Shannon Brown,Amir Johnson,Andrea Bargnani,Antoine Wright,Jose Calderon,Marco Belinelli,2,10:06,LAL,shot,,,,,,,,,,Jordan Farmar,2,,,made,,driving layup,24,7
Andrew Bynum,Jordan Farmar,Kobe Bryant,Lamar Odom,Shannon Brown,Amir Johnson,Andrea Bargnani,Antoine Wright,Jose Calderon,Marco Belinelli,2,9:56,LAL,foul,,,,,,,,Jose Calderon,,Jordan Farmar,,,,,,personal,,
Andrew Bynum,Jordan Farmar,Kobe Bryant,Lamar Odom,Shannon Brown,Amir Johnson,Andrea Bargnani,Antoine Wright,Jose Calderon,Marco Belinelli,2,9:52,TOR,shot,Jose Calderon,,,,,,,,,Amir Johnson,2,,,made,,alley oop dunk,25,7
Andrew Bynum,Jordan Farmar,Kobe Bryant,Lamar Odom,Shannon Brown,Amir Johnson,Andrea Bargnani,Antoine Wright,Jose Calderon,Marco Belinelli,2,9:37,TOR,foul,,,,,,,,Lamar Odom,,Amir Johnson,,,,,,personal,,
Andrew Bynum,Jordan Farmar,Kobe Bryant,Lamar Odom,Shannon Brown,Amir Johnson,Andrea Bargnani,Antoine Wright,Jose Calderon,Marco Belinelli,2,9:32,LAL,shot,Lamar Odom,,,,,,,,,Kobe Bryant,2,,,made,,jump,33,20
Andrew Bynum,Jordan Farmar,Kobe Bryant,Lamar Odom,Shannon Brown,Amir Johnson,Andrea Bargnani,Antoine Wright,Jose Calderon,Marco Belinelli,2,9:12,TOR,shot,,,,,,,,,,Marco Belinelli,,,,missed,,driving layup,23,7