a1,a2,a3,a4,a5,h1,h2,h3,h4,h5,period,time,team,etype,assist,away,block,entered,home,left,num,opponent,outof,player,points,possession,reason,result,steal,type,x,y
Baron Davis,DeAndre Jordan,Eric Gordon,Marcus Camby,Rasual Butler,Marc Gasol,Mike Conley,O.J. Mayo,Rudy Gay,Zach Randolph,1,12:00,OFF,jump ball,,DeAndre Jordan,,,Marc Gasol,,,,,,,Mike Conley,,,,,,
Baron Davis,DeAndre Jordan,Eric Gordon,Marcus Camby,Rasual Butler,Marc Gasol,Mike Conley,O.J. Mayo,Rudy Gay,Zach Randolph,1,11:45,MEM,shot,,,,,,,,,,Marc Gasol,,,,missed,,jump,19,11
Baron Davis,DeAndre Jordan,Eric Gordon,Marcus Camby,Rasual Butler,Marc Gasol,Mike Conley,O.J. Mayo,Rudy Gay,Zach Randolph,1,11:44,LAC,rebound,,,,,,,,,,Marcus Camby,,,,,,def,,
Baron Davis,DeAndre Jordan,Eric Gordon,Marcus Camby,Rasual Butler,Marc Gasol,Mike Conley,O.J. Mayo,Rudy Gay,Zach Randolph,1,11:39,LAC,shot,,,,,,,,,,Baron Davis,2,,,made,,layup,25,6
Baron Davis,DeAndre Jordan,Eric Gordon,Marcus Camby,Rasual Butler,Marc Gasol,Mike Conley,O.J. Mayo,Rudy Gay,Zach Randolph,1,11:25,MEM,foul,,,,,,,,Baron Davis,,Marc Gasol,,,,,,offensive,,
Baron Davis,DeAndre Jordan,Eric Gordon,Marcus Camby,Rasual Butler,Marc Gasol,Mike Conley,O.J. Mayo,Rudy Gay,Zach Randolph,1,11:25,MEM,turnover,,,,,,,,,,Marc Gasol,,,foul,,,,,
Baron Davis,DeAndre Jordan,Eric Gordon,Marcus Camby,Rasual Butler,Marc Gasol,Mike Conley,O.J. Mayo,Rudy Gay,Zach Randolph,1,11:11,LAC,shot,Eric Gordon,,,,,,,,,DeAndre Jordan,2,,,made,,layup,25,6
Baron Davis,DeAndre Jordan,Eric Gordon,Marcus Camby,Rasual Butler,Marc Gasol,Mike Conley,O.J. Mayo,Rudy Gay,Zach Randolph,1,10:52,LAC,foul,,,,,,,,O.J. Mayo,,Eric Gordon,,,,,,shooting,,
Baron Davis,DeAndre Jordan,Eric Gordon,Marcus Camby,Rasual Butler,Marc Gasol,Mike Conley,O.J. Mayo,Rudy Gay,Zach Randolph,1,10:52,MEM,free throw,,,,,,,1,,2,O.J. Mayo,,,foul,made,,,,
Baron Davis,DeAndre Jordan,Eric Gordon,Marcus Camby,Rasual Butler,Marc Gasol,Mike Conley,O.J. Mayo,Rudy Gay,Zach Randolph,1,10:52,MEM,free throw,,,,,,,2,,2,O.J. Mayo,,,foul,missed,,,,
Baron Davis,DeAndre Jordan,Eric Gordon,Marcus Camby,Rasual Butler,Marc Gasol,Mike Conley,O.J. Mayo,Rudy Gay,Zach Randolph,1,10:50,LAC,rebound,,,,,,,,,,Baron Davis,,,,,,def,,
Baron Davis,DeAndre Jordan,Eric Gordon,Marcus Camby,Rasual Butler,Marc Gasol,Mike Conley,O.J. Mayo,Rudy Gay,Zach Randolph,1,10:45,LAC,shot,,,,,,,,,,Eric Gordon,2,,,made,,running jump,23,12
Baron Davis,DeAndre Jordan,Eric Gordon,Marcus Camby,Rasual Butler,Marc Gasol,Mike Conley,O.J. Mayo,Rudy Gay,Zach Randolph,1,10:29,MEM,turnover,,,,,,,,,,O.J. Mayo,,,lost ball,,Baron Davis,,,
Baron Davis,DeAndre Jordan,Eric Gordon,Marcus Camby,Rasual Butler,Marc Gasol,Mike Conley,O.J. Mayo,Rudy Gay,Zach Randolph,1,10:20,LAC,shot,Eric Gordon,,,,,,,,,Rasual Butler,3,,,made,,3pt,49,7
Baron Davis,DeAndre Jordan,Eric Gordon,Marcus Camby,Rasual Butler,Marc Gasol,Mike Conley,O.J. Mayo,Rudy Gay,Zach Randolph,1,10:06,MEM,shot,,,,,,,,,,Rudy Gay,,,,missed,,jump,7,19
Baron Davis,DeAndre Jordan,Eric Gordon,Marcus Camby,Rasual Butler,Marc Gasol,Mike Conley,O.J. Mayo,Rudy Gay,Zach Randolph,1,10:04,MEM,rebound,,,,,,,,,,Mike Conley,,,,,,off,,
Baron Davis,DeAndre Jordan,Eric Gordon,Marcus Camby,Rasual Butler,Marc Gasol,Mike Conley,O.J. Mayo,Rudy Gay,Zach Randolph,1,10:02,MEM,shot,O.J. Mayo,,,,,,,,,Rudy Gay,2,,,made,,alley oop dunk,25,6
Baron Davis,DeAndre Jordan,Eric Gordon,Marcus Camby,Rasual Butler,Marc Gasol,Mike Conley,O.J. Mayo,Rudy Gay,Zach Randolph,1,9:48,LAC,shot,Eric Gordon,,,,,,,,,Marcus Camby,2,,,made,,jump,26,16
Baron Davis,DeAndre Jordan,Eric Gordon,Marcus Camby,Rasual Butler,Marc Gasol,Mike Conley,O.J. Mayo,Rudy Gay,Zach Randolph,1,9:26,MEM,shot,,,DeAndre Jordan,,,,,,,Zach Randolph,,,,missed,,jump,15,10
Baron Davis,DeAndre Jordan,Eric Gordon,Marcus Camby,Rasual Butler,Marc Gasol,Mike Conley,O.J. Mayo,Rudy Gay,Zach Randolph,1,9:25,MEM,rebound,,,,,,,,,,,,,,,,,,
Baron Davis,DeAndre Jordan,Eric Gordon,Marcus Camby,Rasual Butler,Marc Gasol,Mike Conley,O.J. Mayo,Rudy Gay,Zach Randolph,1,9:20,MEM,shot,,,,,,,,,,O.J. Mayo,,,,missed,,fade away jumper,13,19
Baron Davis,DeAndre Jordan,Eric Gordon,Marcus Camby,Rasual Butler,Marc Gasol,Mike Conley,O.J. Mayo,Rudy Gay,Zach Randolph,1,9:16,LAC,rebound,,,,,,,,,,Baron Davis,,,,,,def,,
Baron Davis,DeAndre Jordan,Eric Gordon,Marcus Camby,Rasual Butler,Marc Gasol,Mike Conley,O.J. Mayo,Rudy Gay,Zach Randolph,1,9:10,LAC,shot,Baron Davis,,,,,,,,,DeAndre Jordan,2,,,made,,alley oop dunk,25,6
Baron Davis,DeAndre Jordan,Eric Gordon,Marcus Camby,Rasual Butler,Marc Gasol,Mike Conley,O.J. Mayo,Rudy Gay,Zach Randolph,1,8:50,MEM,turnover,,,,,,,,,,Mike Conley,,,bad pass,,Marcus Camby,,,
Baron Davis,DeAndre Jordan,Eric Gordon,Marcus Camby,Rasual Butler,Marc Gasol,Mike Conley,O.J. Mayo,Rudy Gay,Zach Randolph,1,8:46,LAC,shot,Baron Davis,,,,,,,,,Eric Gordon,2,,,made,,layup,25,6
Baron Davis,DeAndre Jordan,Eric Gordon,Marcus Camby,Rasual Butler,Marc Gasol,Mike Conley,O.J. Mayo,Rudy Gay,Zach Randolph,1,8:46,MEM,timeout,,,,,,,,,,,,,,,,regular,,
Baron Davis,DeAndre Jordan,Eric Gordon,Marcus Camby,Rasual Butler,Marc Gasol,Mike Conley,O.J. Mayo,Rudy Gay,Zach Randolph,1,8:32,MEM,shot,,,Marcus Camby,,,,,,,Zach Randolph,,,,missed,,layup,25,6
Baron Davis,DeAndre Jordan,Eric Gordon,Marcus Camby,Rasual Butler,Marc Gasol,Mike Conley,O.J. Mayo,Rudy Gay,Zach Randolph,1,8:30,LAC,rebound,,,,,,,,,,Baron Davis,,,,,,def,,
Baron Davis,DeAndre Jordan,Eric Gordon,Marcus Camby,Rasual Butler,Marc Gasol,Mike Conley,O.J. Mayo,Rudy Gay,Zach Randolph,1,8:25,LAC,turnover,,,,,,,,,,Baron Davis,,,bad pass,,Marc Gasol,,,
Baron Davis,DeAndre Jordan,Eric Gordon,Marcus Camby,Rasual Butler,Marc Gasol,Mike Conley,O.J. Mayo,Rudy Gay,Zach Randolph,1,8:21,MEM,shot,O.J. Mayo,,,,,,,,,Rudy Gay,2,,,made,,layup,25,6
Baron Davis,DeAndre Jordan,Eric Gordon,Marcus Camby,Rasual Butler,Marc Gasol,Mike Conley,O.J. Mayo,Rudy Gay,Zach Randolph,1,8:09,LAC,shot,,,,,,,,,,Marcus Camby,,,,missed,,jump,15,24
Baron Davis,DeAndre Jordan,Eric Gordon,Marcus Camby,Rasual Butler,Marc Gasol,Mike Conley,O.J. Mayo,Rudy Gay,Zach Randolph,1,8:07,MEM,rebound,,,,,,,,,,Marc Gasol,,,,,,def,,
Baron Davis,DeAndre Jordan,Eric Gordon,Marcus Camby,Rasual Butler,Marc Gasol,Mike Conley,O.J. Mayo,Rudy Gay,Zach Randolph,1,7:56,MEM,shot,,,,,,,,,,Mike Conley,2,,,made,,jump,10,21
Baron Davis,DeAndre Jordan,Eric Gordon,Marcus Camby,Rasual Butler,Marc Gasol,Mike Conley,O.J. Mayo,Rudy Gay,Zach Randolph,1,7:39,LAC,shot,,,,,,,,,,Baron Davis,,,,missed,,jump,15,12
Baron Davis,DeAndre Jordan,Eric Gordon,Marcus Camby,Rasual Butler,Marc Gasol,Mike Conley,O.J. Mayo,Rudy Gay,Zach Randolph,1,7:38,LAC,rebound,,,,,,,,,,Baron Davis,,,,,,off,,
Baron Davis,DeAndre Jordan,Eric Gordon,Marcus Camby,Rasual Butler,Marc Gasol,Mike Conley,O.J. Mayo,Rudy Gay,Zach Randolph,1,7:38,LAC,shot,,,,,,,,,,Baron Davis,,,,missed,,layup,25,6
Baron Davis,DeAndre Jordan,Eric Gordon,Marcus Camby,Rasual Butler,Marc Gasol,Mike Conley,O.J. Mayo,Rudy Gay,Zach Randolph,1,7:35,LAC,rebound,,,,,,,,,,Baron Davis,,,,,,off,,
Baron Davis,DeAndre Jordan,Eric Gordon,Marcus Camby,Rasual Butler,Marc Gasol,Mike Conley,O.J. Mayo,Rudy Gay,Zach Randolph,1,7:34,LAC,shot,,,Marc Gasol,,,,,,,Baron Davis,,,,missed,,tip,25,6
Baron Davis,DeAndre Jordan,Eric Gordon,Marcus Camby,Rasual Butler,Marc Gasol,Mike Conley,O.J. Mayo,Rudy Gay,Zach Randolph,1,7:33,MEM,rebound,,,,,,,,,,Marc Gasol,,,,,,def,,
Baron Davis,DeAndre Jordan,Eric Gordon,Marcus Camby,Rasual Butler,Marc Gasol,Mike Conley,O.J. Mayo,Rudy Gay,Zach Randolph,1,7:25,MEM,shot,Mike Conley,,,,,,,,,Marc Gasol,2,,,made,,jump,25,17
Baron Davis,DeAndre Jordan,Eric Gordon,Marcus Camby,Rasual Butler,Marc Gasol,Mike Conley,O.J. Mayo,Rudy Gay,Zach Randolph,1,7:03,MEM,foul,,,,,,,,DeAndre Jordan,,Mike Conley,,,,,,shooting,,
Baron Davis,DeAndre Jordan,Eric Gordon,Marcus Camby,Rasual Butler,Marc Gasol,Mike Conley,O.J. Mayo,Rudy Gay,Zach Randolph,1,7:03,LAC,free throw,,,,,,,1,,2,DeAndre Jordan,,,foul,made,,,,
Baron Davis,DeAndre Jordan,Eric Gordon,Marcus Camby,Rasual Butler,Marc Gasol,Mike Conley,O.J. Mayo,Rudy Gay,Zach Randolph,1,7:03,LAC,free throw,,,,,,,2,,2,DeAndre Jordan,,,foul,made,,,,
Baron Davis,DeAndre Jordan,Eric Gordon,Marcus Camby,Rasual Butler,Marc Gasol,Mike Conley,O.J. Mayo,Rudy Gay,Zach Randolph,1,6:43,MEM,shot,,,Baron Davis,,,,,,,Rudy Gay,,,,missed,,layup,25,6
Baron Davis,DeAndre Jordan,Eric Gordon,Marcus Camby,Rasual Butler,Marc Gasol,Mike Conley,O.J. Mayo,Rudy Gay,Zach Randolph,1,6:43,LAC,rebound,,,,,,,,,,Baron Davis,,,,,,def,,
Baron Davis,DeAndre Jordan,Eric Gordon,Marcus Camby,Rasual Butler,Marc Gasol,Mike Conley,O.J. Mayo,Rudy Gay,Zach Randolph,1,6:38,LAC,shot,,,,,,,,,,Rasual Butler,,,,missed,,3pt,47,17
Baron Davis,DeAndre Jordan,Eric Gordon,Marcus Camby,Rasual Butler,Marc Gasol,Mike Conley,O.J. Mayo,Rudy Gay,Zach Randolph,1,6:36,MEM,rebound,,,,,,,,,,Marc Gasol,,,,,,def,,
Baron Davis,DeAndre Jordan,Eric Gordon,Marcus Camby,Rasual Butler,Marc Gasol,Mike Conley,O.J. Mayo,Rudy Gay,Zach Randolph,1,6:22,MEM,shot,,,,,,,,,,Zach Randolph,,,,missed,,jump,36,8
Baron Davis,DeAndre Jordan,Eric Gordon,Marcus Camby,Rasual Butler,Marc Gasol,Mike Conley,O.J. Mayo,Rudy Gay,Zach Randolph,1,6:20,LAC,rebound,,,,,,,,,,Baron Davis,,,,,,def,,
Baron Davis,DeAndre Jordan,Eric Gordon,Marcus Camby,Rasual Butler,Marc Gasol,Mike Conley,O.J. Mayo,Rudy Gay,Zach Randolph,1,6:06,LAC,turnover,,,,,,,,,,DeAndre Jordan,,,traveling,,,,,
Baron Davis,DeAndre Jordan,Eric Gordon,Marcus Camby,Rasual Butler,Marc Gasol,Mike Conley,O.J. Mayo,Rudy Gay,Zach Randolph,1,5:51,MEM,shot,O.J. Mayo,,,,,,,,,Marc Gasol,2,,,made,,jump,36,8
Baron Davis,DeAndre Jordan,Eric Gordon,Marcus Camby,Rasual Butler,Marc Gasol,Mike Conley,O.J. Mayo,Rudy Gay,Zach Randolph,1,5:31,LAC,shot,,,,,,,,,,Baron Davis,2,,,made,,driving layup,25,6
Baron Davis,DeAndre Jordan,Eric Gordon,Marcus Camby,Rasual Butler,Marc Gasol,Mike Conley,O.J. Mayo,Rudy Gay,Zach Randolph,1,5:13,MEM,shot,,,Marcus Camby,,,,,,,Rudy Gay,,,,missed,,layup,25,6
Baron Davis,DeAndre Jordan,Eric Gordon,Marcus Camby,Rasual Butler,Marc Gasol,Mike Conley,O.J. Mayo,Rudy Gay,Zach Randolph,1,5:13,MEM,rebound,,,,,,,,,,Marc Gasol,,,,,,off,,
Baron Davis,DeAndre Jordan,Eric Gordon,Marcus Camby,Rasual Butler,Marc Gasol,Mike Conley,O.J. Mayo,Rudy Gay,Zach Randolph,1,5:13,LAC,foul,,,,,,,,Marc Gasol,,DeAndre Jordan,,,,,,personal,,
Baron Davis,DeAndre Jordan,Eric Gordon,Marcus Camby,Rasual Butler,Jamaal Tinsley,Marc Gasol,O.J. Mayo,Rudy Gay,Zach Randolph,1,5:13,MEM,sub,,,,Jamaal Tinsley,,Mike Conley,,,,,,,,,,,,
Baron Davis,DeAndre Jordan,Eric Gordon,Marcus Camby,Rasual Butler,Jamaal Tinsley,Marc Gasol,O.J. Mayo,Rudy Gay,Zach Randolph,1,5:06,MEM,shot,,,DeAndre Jordan,,,,,,,Jamaal Tinsley,,,,missed,,jump,27,14
Baron Davis,DeAndre Jordan,Eric Gordon,Marcus Camby,Rasual Butler,Jamaal Tinsley,Marc Gasol,O.J. Mayo,Rudy Gay,Zach Randolph,1,5:03,MEM,rebound,,,,,,,,,,O.J. Mayo,,,,,,off,,
Baron Davis,DeAndre Jordan,Eric Gordon,Marcus Camby,Rasual Butler,Jamaal Tinsley,Marc Gasol,O.J. Mayo,Rudy Gay,Zach Randolph,1,4:59,MEM,shot,,,,,,,,,,Marc Gasol,2,,,made,,running hook,19,14
Baron Davis,DeAndre Jordan,Eric Gordon,Marcus Camby,Rasual Butler,Jamaal Tinsley,Marc Gasol,O.J. Mayo,Rudy Gay,Zach Randolph,1,4:52,LAC,shot,,,,,,,,,,Baron Davis,2,,,made,,driving layup,25,6
Baron Davis,DeAndre Jordan,Eric Gordon,Marcus Camby,Rasual Butler,Jamaal Tinsley,Marc Gasol,O.J. Mayo,Rudy Gay,Zach Randolph,1,4:38,LAC,foul,,,,,,,,Zach Randolph,,Marcus Camby,,,,,,shooting,,
Baron Davis,DeAndre Jordan,Eric Gordon,Marcus Camby,Rasual Butler,Jamaal Tinsley,Marc Gasol,O.J. Mayo,Rudy Gay,Zach Randolph,1,4:38,MEM,free throw,,,,,,,1,,2,Zach Randolph,,,foul,made,,,,
Baron Davis,DeAndre Jordan,Eric Gordon,Marcus Camby,Rasual Butler,Jamaal Tinsley,Marc Gasol,O.J. Mayo,Rudy Gay,Zach Randolph,1,4:38,MEM,free throw,,,,,,,2,,2,Zach Randolph,,,foul,made,,,,
Baron Davis,DeAndre Jordan,Eric Gordon,Marcus Camby,Rasual Butler,Jamaal Tinsley,Marc Gasol,O.J. Mayo,Rudy Gay,Zach Randolph,1,4:20,LAC,shot,Marcus Camby,,,,,,,,,DeAndre Jordan,2,,,made,,dunk,25,6
Baron Davis,DeAndre Jordan,Eric Gordon,Marcus Camby,Rasual Butler,Jamaal Tinsley,Marc Gasol,O.J. Mayo,Rudy Gay,Zach Randolph,1,4:06,MEM,turnover,,,,,,,,,,O.J. Mayo,,,traveling,,,,,
Baron Davis,DeAndre Jordan,Eric Gordon,Marcus Camby,Rasual Butler,Jamaal Tinsley,Marc Gasol,O.J. Mayo,Rudy Gay,Zach Randolph,1,3:46,LAC,shot,,,,,,,,,,DeAndre Jordan,2,,,made,,turnaround jump,32,11
Baron Davis,DeAndre Jordan,Eric Gordon,Marcus Camby,Rasual Butler,Jamaal Tinsley,Marc Gasol,O.J. Mayo,Rudy Gay,Zach Randolph,1,3:38,MEM,turnover,,,,,,,,,,Zach Randolph,,,bad pass,,Marcus Camby,,,
Baron Davis,DeAndre Jordan,Eric Gordon,Marcus Camby,Rasual Butler,Jamaal Tinsley,Marc Gasol,O.J. Mayo,Rudy Gay,Zach Randolph,1,3:33,LAC,shot,,,,,,,,,,Baron Davis,2,,,made,,layup,25,6
Baron Davis,DeAndre Jordan,Eric Gordon,Marcus Camby,Rasual Butler,Jamaal Tinsley,Marc Gasol,O.J. Mayo,Rudy Gay,Zach Randolph,1,3:29,MEM,timeout,,,,,,,,,,,,,,,,short,,
Baron Davis,DeAndre Jordan,Eric Gordon,Marcus Camby,Rasual Butler,Jamaal Tinsley,Marc Gasol,O.J. Mayo,Rudy Gay,Zach Randolph,1,3:16,MEM,shot,Zach Randolph,,,,,,,,,Marc Gasol,2,,,made,,jump,36,12
Baron Davis,DeAndre Jordan,Eric Gordon,Marcus Camby,Rasual Butler,Jamaal Tinsley,Marc Gasol,O.J. Mayo,Rudy Gay,Zach Randolph,1,2:55,LAC,shot,Marcus Camby,,,,,,,,,DeAndre Jordan,2,,,made,,layup,25,6
Baron Davis,DeAndre Jordan,Eric Gordon,Marcus Camby,Rasual Butler,Jamaal Tinsley,Marc Gasol,O.J. Mayo,Rudy Gay,Zach Randolph,1,2:55,MEM,foul,,,,,,,,DeAndre Jordan,,Marc Gasol,,,,,,shooting,,
Baron Davis,DeAndre Jordan,Eric Gordon,Marcus Camby,Rasual Butler,Jamaal Tinsley,Marc Gasol,O.J. Mayo,Rudy Gay,Zach Randolph,1,2:55,LAC,timeout,,,,,,,,,,,,,,,,regular,,
Baron Davis,DeAndre Jordan,Eric Gordon,Marcus Camby,Rasual Butler,Hasheem Thabeet,Jamaal Tinsley,O.J. Mayo,Rudy Gay,Zach Randolph,1,2:55,MEM,sub,,,,Hasheem Thabeet,,Marc Gasol,,,,,,,,,,,,
Baron Davis,DeAndre Jordan,Eric Gordon,Marcus Camby,Rasual Butler,Hasheem Thabeet,Jamaal Tinsley,O.J. Mayo,Rudy Gay,Zach Randolph,1,2:55,LAC,free throw,,,,,,,1,,1,DeAndre Jordan,,,foul,made,,,,
Baron Davis,DeAndre Jordan,Eric Gordon,Marcus Camby,Rasual Butler,Hasheem Thabeet,Jamaal Tinsley,O.J. Mayo,Rudy Gay,Zach Randolph,1,2:46,LAC,foul,,,,,,,,O.J. Mayo,,Baron Davis,,,,,,shooting,,
Baron Davis,DeAndre Jordan,Eric Gordon,Marcus Camby,Rasual Butler,Hasheem Thabeet,Jamaal Tinsley,O.J. Mayo,Rudy Gay,Zach Randolph,1,2:46,MEM,free throw,,,,,,,1,,2,O.J. Mayo,,,foul,made,,,,
Baron Davis,Craig Smith,Eric Gordon,Marcus Camby,Rasual Butler,Hasheem Thabeet,Jamaal Tinsley,O.J. Mayo,Rudy Gay,Zach Randolph,1,2:46,LAC,sub,,,,Craig Smith,,DeAndre Jordan,,,,,,,,,,,,
Baron Davis,Craig Smith,Eric Gordon,Marcus Camby,Rasual Butler,Hasheem Thabeet,Jamaal Tinsley,O.J. Mayo,Rudy Gay,Zach Randolph,1,2:46,MEM,free throw,,,,,,,2,,2,O.J. Mayo,,,foul,made,,,,
Baron Davis,Craig Smith,Eric Gordon,Marcus Camby,Rasual Butler,Hasheem Thabeet,Jamaal Tinsley,O.J. Mayo,Rudy Gay,Zach Randolph,1,2:35,LAC,shot,,,Hasheem Thabeet,,,,,,,Eric Gordon,,,,missed,,layup,25,6
Baron Davis,Craig Smith,Eric Gordon,Marcus Camby,Rasual Butler,Hasheem Thabeet,Jamaal Tinsley,O.J. Mayo,Rudy Gay,Zach Randolph,1,2:34,MEM,rebound,,,,,,,,,,,,,,,,,,
Baron Davis,Craig Smith,Eric Gordon,Marcus Camby,Rasual Butler,Hasheem Thabeet,Jamaal Tinsley,O.J. Mayo,Rudy Gay,Zach Randolph,1,2:25,MEM,shot,,,,,,,,,,Zach Randolph,,,,missed,,jump,34,26
Baron Davis,Craig Smith,Eric Gordon,Marcus Camby,Rasual Butler,Hasheem Thabeet,Jamaal Tinsley,O.J. Mayo,Rudy Gay,Zach Randolph,1,2:24,MEM,rebound,,,,,,,,,,Jamaal Tinsley,,,,,,off,,
Baron Davis,Craig Smith,Eric Gordon,Marcus Camby,Rasual Butler,Hasheem Thabeet,Jamaal Tinsley,O.J. Mayo,Rudy Gay,Zach Randolph,1,2:21,MEM,turnover,,,,,,,,,,Jamaal Tinsley,,,bad pass,,Rasual Butler,,,
Baron Davis,Craig Smith,Eric Gordon,Marcus Camby,Rasual Butler,Hasheem Thabeet,Jamaal Tinsley,O.J. Mayo,Rudy Gay,Zach Randolph,1,2:18,LAC,foul,,,,,,,,Jamaal Tinsley,,Craig Smith,,,,,,offensive,,
Baron Davis,Craig Smith,Eric Gordon,Marcus Camby,Rasual Butler,Hasheem Thabeet,Jamaal Tinsley,O.J. Mayo,Rudy Gay,Zach Randolph,1,2:18,LAC,turnover,,,,,,,,,,Craig Smith,,,foul,,,,,
Baron Davis,Craig Smith,Eric Gordon,Marcus Camby,Rasual Butler,Hasheem Thabeet,Jamaal Tinsley,O.J. Mayo,Rudy Gay,Zach Randolph,1,2:09,MEM,shot,,,,,,,,,,O.J. Mayo,3,,,made,,3pt,25,32
Baron Davis,Craig Smith,Eric Gordon,Marcus Camby,Rasual Butler,Hasheem Thabeet,Jamaal Tinsley,O.J. Mayo,Rudy Gay,Zach Randolph,1,1:52,LAC,shot,,,,,,,,,,Marcus Camby,,,,missed,,fade away jumper,14,9
Baron Davis,Craig Smith,Eric Gordon,Marcus Camby,Rasual Butler,Hasheem Thabeet,Jamaal Tinsley,O.J. Mayo,Rudy Gay,Zach Randolph,1,1:51,LAC,rebound,,,,,,,,,,Craig Smith,,,,,,off,,
Baron Davis,Craig Smith,Eric Gordon,Marcus Camby,Rasual Butler,Hasheem Thabeet,Jamaal Tinsley,O.J. Mayo,Rudy Gay,Zach Randolph,1,1:42,LAC,shot,Baron Davis,,,,,,,,,Marcus Camby,2,,,made,,alley oop layup,25,6
Baron Davis,Craig Smith,Eric Gordon,Marcus Camby,Rasual Butler,Hasheem Thabeet,Jamaal Tinsley,O.J. Mayo,Rudy Gay,Zach Randolph,1,1:25,MEM,shot,,,,,,,,,,Rudy Gay,2,,,made,,turnaround jump,25,13
Baron Davis,Craig Smith,Eric Gordon,Marcus Camby,Rasual Butler,Hasheem Thabeet,Jamaal Tinsley,O.J. Mayo,Rudy Gay,Zach Randolph,1,1:03,LAC,shot,Eric Gordon,,,,,,,,,Craig Smith,2,,,made,,layup,25,6
Baron Davis,Craig Smith,Eric Gordon,Marcus Camby,Rasual Butler,Hasheem Thabeet,Jamaal Tinsley,O.J. Mayo,Rudy Gay,Zach Randolph,1,0:48,MEM,shot,,,,,,,,,,O.J. Mayo,,,,missed,,driving jump,25,12
Baron Davis,Craig Smith,Eric Gordon,Marcus Camby,Rasual Butler,Hasheem Thabeet,Jamaal Tinsley,O.J. Mayo,Rudy Gay,Zach Randolph,1,0:48,MEM,rebound,,,,,,,,,,Zach Randolph,,,,,,off,,
Baron Davis,Craig Smith,Eric Gordon,Marcus Camby,Rasual Butler,Hasheem Thabeet,Jamaal Tinsley,O.J. Mayo,Rudy Gay,Zach Randolph,1,0:48,MEM,shot,,,,,,,,,,Zach Randolph,2,,,made,,tip,25,6
Baron Davis,Craig Smith,Eric Gordon,Marcus Camby,Rasual Butler,Hasheem Thabeet,Jamaal Tinsley,O.J. Mayo,Rudy Gay,Zach Randolph,1,0:34,MEM,foul,,,,,,,,Baron Davis,,Rudy Gay,,,,,,personal,,
Baron Davis,Craig Smith,Eric Gordon,Marcus Camby,Rasual Butler,Hasheem Thabeet,Jamaal Tinsley,O.J. Mayo,Rudy Gay,Zach Randolph,1,0:29,LAC,shot,Baron Davis,,,,,,,,,Eric Gordon,3,,,made,,3pt,10,26
Baron Davis,Craig Smith,Eric Gordon,Marcus Camby,Rasual Butler,Hasheem Thabeet,Jamaal Tinsley,O.J. Mayo,Rudy Gay,Zach Randolph,1,0:12,MEM,shot,,,,,,,,,,Jamaal Tinsley,,,,missed,,jump,15,11
Baron Davis,Craig Smith,Eric Gordon,Marcus Camby,Rasual Butler,Hasheem Thabeet,Jamaal Tinsley,O.J. Mayo,Rudy Gay,Zach Randolph,1,0:11,LAC,rebound,,,,,,,,,,Rasual Butler,,,,,,def,,
Baron Davis,Craig Smith,Eric Gordon,Marcus Camby,Rasual Butler,Hasheem Thabeet,Jamaal Tinsley,O.J. Mayo,Rudy Gay,Zach Randolph,1,0:11,LAC,turnover,,,,,,,,,,Rasual Butler,,,out of bounds lost ball turnover,,,,,
Baron Davis,Craig Smith,Marcus Camby,Rasual Butler,Ricky Davis,Hasheem Thabeet,Jamaal Tinsley,O.J. Mayo,Rudy Gay,Zach Randolph,1,0:11,LAC,sub,,,,Ricky Davis,,Eric Gordon,,,,,,,,,,,,
Baron Davis,Craig Smith,Marcus Camby,Rasual Butler,Ricky Davis,Hasheem Thabeet,Jamaal Tinsley,O.J. Mayo,Rudy Gay,Zach Randolph,1,0:11,MEM,turnover,,,,,,,,,,,,,,,,,,
Baron Davis,Craig Smith,Eric Gordon,Rasual Butler,Ricky Davis,Hasheem Thabeet,Jamaal Tinsley,O.J. Mayo,Rudy Gay,Zach Randolph,1,0:11,LAC,sub,,,,Eric Gordon,,Marcus Camby,,,,,,,,,,,,
Baron Davis,Craig Smith,Eric Gordon,Rasual Butler,Ricky Davis,DeMarre Carroll,Hasheem Thabeet,Jamaal Tinsley,O.J. Mayo,Rudy Gay,1,0:11,MEM,sub,,,,DeMarre Carroll,,Zach Randolph,,,,,,,,,,,,
Baron Davis,Craig Smith,Eric Gordon,Rasual Butler,Ricky Davis,DeMarre Carroll,Hasheem Thabeet,Jamaal Tinsley,O.J. Mayo,Rudy Gay,1,0:01,LAC,shot,,,,,,,,,,Baron Davis,,,,missed,,jump,39,21
Baron Davis,Craig Smith,Eric Gordon,Rasual Butler,Ricky Davis,DeMarre Carroll,Hasheem Thabeet,Jamaal Tinsley,O.J. Mayo,Rudy Gay,1,0:00,MEM,rebound,,,,,,,,,,DeMarre Carroll,,,,,,def,,
Al Thornton,Craig Smith,DeAndre Jordan,Mardy Collins,Ricky Davis,DeMarre Carroll,Hasheem Thabeet,Jamaal Tinsley,O.J. Mayo,Sam Young,2,11:37,LAC,shot,,,,,,,,,,Craig Smith,,,,missed,,turnaround jump,38,8
Al Thornton,Craig Smith,DeAndre Jordan,Mardy Collins,Ricky Davis,DeMarre Carroll,Hasheem Thabeet,Jamaal Tinsley,O.J. Mayo,Sam Young,2,11:36,MEM,rebound,,,,,,,,,,Hasheem Thabeet,,,,,,def,,
Al Thornton,Craig Smith,DeAndre Jordan,Mardy Collins,Ricky Davis,DeMarre Carroll,Hasheem Thabeet,Jamaal Tinsley,O.J. Mayo,Sam Young,2,11:27,MEM,shot,Jamaal Tinsley,,,,,,,,,O.J. Mayo,2,,,made,,jump,41,20
Al Thornton,Craig Smith,DeAndre Jordan,Mardy Collins,Ricky Davis,DeMarre Carroll,Hasheem Thabeet,Jamaal Tinsley,O.J. Mayo,Sam Young,2,11:14,LAC,turnover,,,,,,,,,,Mardy Collins,,,bad pass,,O.J. Mayo,,,
Al Thornton,Craig Smith,DeAndre Jordan,Mardy Collins,Ricky Davis,DeMarre Carroll,Hasheem Thabeet,Jamaal Tinsley,O.J. Mayo,Sam Young,2,11:14,LAC,foul,,,,,,,,O.J. Mayo,,Mardy Collins,,,,,,clear path,,
Al Thornton,Craig Smith,DeAndre Jordan,Mardy Collins,Ricky Davis,DeMarre Carroll,Hasheem Thabeet,Jamaal Tinsley,O.J. Mayo,Sam Young,2,11:14,MEM,free throw,,,,,,,1,,2,O.J. Mayo,,,foul,made,,,,
Al Thornton,Craig Smith,DeAndre Jordan,Mardy Collins,Ricky Davis,DeMarre Carroll,Hasheem Thabeet,Jamaal Tinsley,O.J. Mayo,Sam Young,2,11:14,MEM,free throw,,,,,,,2,,2,O.J. Mayo,,,foul,made,,,,
Al Thornton,Craig Smith,DeAndre Jordan,Mardy Collins,Ricky Davis,DeMarre Carroll,Hasheem Thabeet,Jamaal Tinsley,O.J. Mayo,Sam Young,2,11:03,MEM,shot,,,,,,,,,,DeMarre Carroll,,,,missed,,jump,12,19
Al Thornton,Craig Smith,DeAndre Jordan,Mardy Collins,Ricky Davis,DeMarre Carroll,Hasheem Thabeet,Jamaal Tinsley,O.J. Mayo,Sam Young,2,11:02,LAC,rebound,,,,,,,,,,Mardy Collins,,,,,,def,,
Al Thornton,Craig Smith,DeAndre Jordan,Mardy Collins,Ricky Davis,DeMarre Carroll,Hasheem Thabeet,Jamaal Tinsley,O.J. Mayo,Sam Young,2,10:46,LAC,shot,,,,,,,,,,Ricky Davis,,,,missed,,jump,29,28
Al Thornton,Craig Smith,DeAndre Jordan,Mardy Collins,Ricky Davis,DeMarre Carroll,Hasheem Thabeet,Jamaal Tinsley,O.J. Mayo,Sam Young,2,10:44,LAC,rebound,,,,,,,,,,Mardy Collins,,,,,,off,,
Al Thornton,Craig Smith,DeAndre Jordan,Mardy Collins,Ricky Davis,DeMarre Carroll,Hasheem Thabeet,Jamaal Tinsley,O.J. Mayo,Sam Young,2,10:27,MEM,foul,,,,,,,,DeAndre Jordan,,Hasheem Thabeet,,,,,,shooting,,
Al Thornton,Craig Smith,DeAndre Jordan,Mardy Collins,Ricky Davis,DeMarre Carroll,Hasheem Thabeet,Jamaal Tinsley,O.J. Mayo,Sam Young,2,10:27,LAC,free throw,,,,,,,1,,2,DeAndre Jordan,,,foul,made,,,,
Al Thornton,Craig Smith,DeAndre Jordan,Mardy Collins,Ricky Davis,DeMarre Carroll,Jamaal Tinsley,O.J. Mayo,Sam Young,Zach Randolph,2,10:27,MEM,sub,,,,Zach Randolph,,Hasheem Thabeet,,,,,,,,,,,,
Al Thornton,Craig Smith,DeAndre Jordan,Mardy Collins,Ricky Davis,DeMarre Carroll,Jamaal Tinsley,O.J. Mayo,Sam Young,Zach Randolph,2,10:27,LAC,free throw,,,,,,,2,,2,DeAndre Jordan,,,foul,made,,,,
Al Thornton,Craig Smith,DeAndre Jordan,Mardy Collins,Ricky Davis,DeMarre Carroll,Jamaal Tinsley,O.J. Mayo,Sam Young,Zach Randolph,2,10:19,MEM,shot,,,DeAndre Jordan,,,,,,,Zach Randolph,,,,missed,,jump,23,14
Al Thornton,Craig Smith,DeAndre Jordan,Mardy Collins,Ricky Davis,DeMarre Carroll,Jamaal Tinsley,O.J. Mayo,Sam Young,Zach Randolph,2,10:16,MEM,rebound,,,,,,,,,,O.J. Mayo,,,,,,off,,
Al Thornton,Craig Smith,DeAndre Jordan,Mardy Collins,Ricky Davis,DeMarre Carroll,Jamaal Tinsley,O.J. Mayo,Sam Young,Zach Randolph,2,10:16,MEM,shot,,,,,,,,,,O.J. Mayo,2,,,made,,putback layup,25,6
Al Thornton,Craig Smith,DeAndre Jordan,Mardy Collins,Ricky Davis,DeMarre Carroll,Jamaal Tinsley,O.J. Mayo,Sam Young,Zach Randolph,2,9:54,LAC,turnover,,,,,,,,,,Ricky Davis,,,lost ball,,Sam Young,,,
Al Thornton,Craig Smith,DeAndre Jordan,Mardy Collins,Ricky Davis,DeMarre Carroll,Jamaal Tinsley,O.J. Mayo,Sam Young,Zach Randolph,2,9:50,LAC,foul,,,,,,,,DeMarre Carroll,,Mardy Collins,,,,,,shooting,,
Al Thornton,Craig Smith,DeAndre Jordan,Mardy Collins,Ricky Davis,DeMarre Carroll,Jamaal Tinsley,O.J. Mayo,Sam Young,Zach Randolph,2,9:50,MEM,free throw,,,,,,,1,,2,DeMarre Carroll,,,foul,missed,,,,