a1,a2,a3,a4,a5,h1,h2,h3,h4,h5,period,time,team,etype,assist,away,block,entered,home,left,num,opponent,outof,player,points,possession,reason,result,steal,type,x,y
Beno Udrih,Donte Greene,Jason Thompson,Omri Casspi,Spencer Hawes,Andrew Bynum,Derek Fisher,Kobe Bryant,Lamar Odom,Pau Gasol,1,12:00,OFF,jump ball,,Spencer Hawes,,,Andrew Bynum,,,,,,,Derek Fisher,,,,,,
Beno Udrih,Donte Greene,Jason Thompson,Omri Casspi,Spencer Hawes,Andrew Bynum,Derek Fisher,Kobe Bryant,Lamar Odom,Pau Gasol,1,11:48,LAL,shot,,,,,,,,,,Kobe Bryant,,,,missed,,jump,16,22
Beno Udrih,Donte Greene,Jason Thompson,Omri Casspi,Spencer Hawes,Andrew Bynum,Derek Fisher,Kobe Bryant,Lamar Odom,Pau Gasol,1,11:47,SAC,rebound,,,,,,,,,,Omri Casspi,,,,,,def,,
Beno Udrih,Donte Greene,Jason Thompson,Omri Casspi,Spencer Hawes,Andrew Bynum,Derek Fisher,Kobe Bryant,Lamar Odom,Pau Gasol,1,11:31,SAC,shot,,,,,,,,,,Beno Udrih,,,,missed,,jump,41,17
Beno Udrih,Donte Greene,Jason Thompson,Omri Casspi,Spencer Hawes,Andrew Bynum,Derek Fisher,Kobe Bryant,Lamar Odom,Pau Gasol,1,11:30,LAL,rebound,,,,,,,,,,Lamar Odom,,,,,,def,,
Beno Udrih,Donte Greene,Jason Thompson,Omri Casspi,Spencer Hawes,Andrew Bynum,Derek Fisher,Kobe Bryant,Lamar Odom,Pau Gasol,1,11:18,LAL,shot,Andrew Bynum,,,,,,,,,Kobe Bryant,2,,,made,,jump,29,22
Beno Udrih,Donte Greene,Jason Thompson,Omri Casspi,Spencer Hawes,Andrew Bynum,Derek Fisher,Kobe Bryant,Lamar Odom,Pau Gasol,1,10:59,SAC,shot,Spencer Hawes,,,,,,,,,Beno Udrih,2,,,made,,driving layup,25,6
Beno Udrih,Donte Greene,Jason Thompson,Omri Casspi,Spencer Hawes,Andrew Bynum,Derek Fisher,Kobe Bryant,Lamar Odom,Pau Gasol,1,10:50,LAL,shot,,,,,,,,,,Derek Fisher,,,,missed,,jump,7,20
Beno Udrih,Donte Greene,Jason Thompson,Omri Casspi,Spencer Hawes,Andrew Bynum,Derek Fisher,Kobe Bryant,Lamar Odom,Pau Gasol,1,10:49,SAC,rebound,,,,,,,,,,Jason Thompson,,,,,,def,,
Beno Udrih,Donte Greene,Jason Thompson,Omri Casspi,Spencer Hawes,Andrew Bynum,Derek Fisher,Kobe Bryant,Lamar Odom,Pau Gasol,1,10:41,SAC,shot,,,Andrew Bynum,,,,,,,Omri Casspi,,,,missed,,layup,25,6
Beno Udrih,Donte Greene,Jason Thompson,Omri Casspi,Spencer Hawes,Andrew Bynum,Derek Fisher,Kobe Bryant,Lamar Odom,Pau Gasol,1,10:37,LAL,rebound,,,,,,,,,,Lamar Odom,,,,,,def,,
Beno Udrih,Donte Greene,Jason Thompson,Omri Casspi,Spencer Hawes,Andrew Bynum,Derek Fisher,Kobe Bryant,Lamar Odom,Pau Gasol,1,10:35,LAL,shot,,,,,,,,,,Lamar Odom,,,,missed,,layup,25,6
Beno Udrih,Donte Greene,Jason Thompson,Omri Casspi,Spencer Hawes,Andrew Bynum,Derek Fisher,Kobe Bryant,Lamar Odom,Pau Gasol,1,10:33,LAL,rebound,,,,,,,,,,Pau Gasol,,,,,,off,,
Beno Udrih,Donte Greene,Jason Thompson,Omri Casspi,Spencer Hawes,Andrew Bynum,Derek Fisher,Kobe Bryant,Lamar Odom,Pau Gasol,1,10:33,LAL,shot,,,,,,,,,,Pau Gasol,2,,,made,,putback dunk,25,6
Beno Udrih,Donte Greene,Jason Thompson,Omri Casspi,Spencer Hawes,Andrew Bynum,Derek Fisher,Kobe Bryant,Lamar Odom,Pau Gasol,1,10:12,SAC,shot,,,,,,,,,,Omri Casspi,,,,missed,,jump,44,6
Beno Udrih,Donte Greene,Jason Thompson,Omri Casspi,Spencer Hawes,Andrew Bynum,Derek Fisher,Kobe Bryant,Lamar Odom,Pau Gasol,1,10:10,LAL,rebound,,,,,,,,,,Kobe Bryant,,,,,,def,,
Beno Udrih,Donte Greene,Jason Thompson,Omri Casspi,Spencer Hawes,Andrew Bynum,Derek Fisher,Kobe Bryant,Lamar Odom,Pau Gasol,1,10:03,LAL,shot,,,,,,,,,,Derek Fisher,,,,missed,,jump,41,22
Beno Udrih,Donte Greene,Jason Thompson,Omri Casspi,Spencer Hawes,Andrew Bynum,Derek Fisher,Kobe Bryant,Lamar Odom,Pau Gasol,1,10:02,SAC,rebound,,,,,,,,,,Omri Casspi,,,,,,def,,
Beno Udrih,Donte Greene,Jason Thompson,Omri Casspi,Spencer Hawes,Andrew Bynum,Derek Fisher,Kobe Bryant,Lamar Odom,Pau Gasol,1,9:59,SAC,shot,Omri Casspi,,,,,,,,,Donte Greene,2,,,made,,slam dunk,25,6
Beno Udrih,Donte Greene,Jason Thompson,Omri Casspi,Spencer Hawes,Andrew Bynum,Derek Fisher,Kobe Bryant,Lamar Odom,Pau Gasol,1,9:40,LAL,shot,,,,,,,,,,Derek Fisher,,,,missed,,3pt,2,7
Beno Udrih,Donte Greene,Jason Thompson,Omri Casspi,Spencer Hawes,Andrew Bynum,Derek Fisher,Kobe Bryant,Lamar Odom,Pau Gasol,1,9:39,SAC,rebound,,,,,,,,,,Omri Casspi,,,,,,def,,
Beno Udrih,Donte Greene,Jason Thompson,Omri Casspi,Spencer Hawes,Andrew Bynum,Derek Fisher,Kobe Bryant,Lamar Odom,Pau Gasol,1,9:32,SAC,turnover,,,,,,,,,,Spencer Hawes,,,bad pass,,Derek Fisher,,,
Beno Udrih,Donte Greene,Jason Thompson,Omri Casspi,Spencer Hawes,Andrew Bynum,Derek Fisher,Kobe Bryant,Lamar Odom,Pau Gasol,1,9:27,SAC,foul,,,,,,,,Derek Fisher,,Spencer Hawes,,,,,,shooting,,
Beno Udrih,Donte Greene,Jason Thompson,Omri Casspi,Spencer Hawes,Andrew Bynum,Derek Fisher,Kobe Bryant,Lamar Odom,Pau Gasol,1,9:27,LAL,free throw,,,,,,,1,,2,Derek Fisher,,,foul,made,,,,
Beno Udrih,Donte Greene,Jason Thompson,Omri Casspi,Spencer Hawes,Andrew Bynum,Derek Fisher,Kobe Bryant,Lamar Odom,Pau Gasol,1,9:27,LAL,free throw,,,,,,,2,,2,Derek Fisher,,,foul,made,,,,
Beno Udrih,Donte Greene,Jason Thompson,Omri Casspi,Spencer Hawes,Andrew Bynum,Derek Fisher,Kobe Bryant,Lamar Odom,Pau Gasol,1,9:13,SAC,shot,Omri Casspi,,,,,,,,,Spencer Hawes,2,,,made,,jump,36,4
Beno Udrih,Donte Greene,Jason Thompson,Omri Casspi,Spencer Hawes,Andrew Bynum,Derek Fisher,Kobe Bryant,Lamar Odom,Pau Gasol,1,9:00,SAC,foul,,,,,,,,Pau Gasol,,Jason Thompson,,,,,,personal,,
Beno Udrih,Donte Greene,Jason Thompson,Omri Casspi,Spencer Hawes,Andrew Bynum,Derek Fisher,Kobe Bryant,Lamar Odom,Pau Gasol,1,8:56,LAL,turnover,,,,,,,,,,Kobe Bryant,,,bad pass,,Beno Udrih,,,
Beno Udrih,Donte Greene,Jason Thompson,Omri Casspi,Spencer Hawes,Andrew Bynum,Derek Fisher,Kobe Bryant,Lamar Odom,Pau Gasol,1,8:51,SAC,shot,Beno Udrih,,,,,,,,,Omri Casspi,2,,,made,,driving layup,25,6
Beno Udrih,Donte Greene,Jason Thompson,Omri Casspi,Spencer Hawes,Andrew Bynum,Derek Fisher,Kobe Bryant,Lamar Odom,Pau Gasol,1,8:31,LAL,shot,Lamar Odom,,,,,,,,,Pau Gasol,2,,,made,,jump,41,10
Beno Udrih,Donte Greene,Jason Thompson,Omri Casspi,Spencer Hawes,Andrew Bynum,Derek Fisher,Kobe Bryant,Lamar Odom,Pau Gasol,1,8:16,SAC,shot,,,,,,,,,,Beno Udrih,,,,missed,,3pt,2,8
Beno Udrih,Donte Greene,Jason Thompson,Omri Casspi,Spencer Hawes,Andrew Bynum,Derek Fisher,Kobe Bryant,Lamar Odom,Pau Gasol,1,8:15,LAL,rebound,,,,,,,,,,,,,,,,,,
Beno Udrih,Donte Greene,Jason Thompson,Omri Casspi,Spencer Hawes,Andrew Bynum,Derek Fisher,Kobe Bryant,Lamar Odom,Pau Gasol,1,8:04,LAL,turnover,,,,,,,,,,Andrew Bynum,,,traveling,,,,,
Beno Udrih,Donte Greene,Jason Thompson,Omri Casspi,Spencer Hawes,Andrew Bynum,Derek Fisher,Kobe Bryant,Lamar Odom,Pau Gasol,1,7:53,SAC,shot,,,,,,,,,,Donte Greene,,,,missed,,layup,25,6
Beno Udrih,Donte Greene,Jason Thompson,Omri Casspi,Spencer Hawes,Andrew Bynum,Derek Fisher,Kobe Bryant,Lamar Odom,Pau Gasol,1,7:52,LAL,rebound,,,,,,,,,,Lamar Odom,,,,,,def,,
Beno Udrih,Donte Greene,Jason Thompson,Omri Casspi,Spencer Hawes,Andrew Bynum,Derek Fisher,Kobe Bryant,Lamar Odom,Pau Gasol,1,7:43,LAL,shot,,,,,,,,,,Derek Fisher,,,,missed,,3pt,6,25
Beno Udrih,Donte Greene,Jason Thompson,Omri Casspi,Spencer Hawes,Andrew Bynum,Derek Fisher,Kobe Bryant,Lamar Odom,Pau Gasol,1,7:42,SAC,rebound,,,,,,,,,,Spencer Hawes,,,,,,def,,
Beno Udrih,Donte Greene,Jason Thompson,Omri Casspi,Spencer Hawes,Andrew Bynum,Derek Fisher,Kobe Bryant,Lamar Odom,Pau Gasol,1,7:29,SAC,shot,,,Lamar Odom,,,,,,,Jason Thompson,,,,missed,,layup,25,6
Beno Udrih,Donte Greene,Jason Thompson,Omri Casspi,Spencer Hawes,Andrew Bynum,Derek Fisher,Kobe Bryant,Lamar Odom,Pau Gasol,1,7:27,LAL,rebound,,,,,,,,,,Pau Gasol,,,,,,def,,
Beno Udrih,Donte Greene,Jason Thompson,Omri Casspi,Spencer Hawes,Andrew Bynum,Derek Fisher,Kobe Bryant,Lamar Odom,Pau Gasol,1,7:23,LAL,shot,,,,,,,,,,Pau Gasol,2,,,made,,driving layup,25,6
Beno Udrih,Donte Greene,Jason Thompson,Omri Casspi,Spencer Hawes,Andrew Bynum,Derek Fisher,Kobe Bryant,Lamar Odom,Pau Gasol,1,7:10,SAC,shot,Beno Udrih,,,,,,,,,Omri Casspi,3,,,made,,3pt,9,28
Beno Udrih,Donte Greene,Jason Thompson,Omri Casspi,Spencer Hawes,Andrew Bynum,Derek Fisher,Kobe Bryant,Lamar Odom,Pau Gasol,1,6:58,LAL,shot,,,,,,,,,,Andrew Bynum,,,,missed,,turnaround jump,17,5
Beno Udrih,Donte Greene,Jason Thompson,Omri Casspi,Spencer Hawes,Andrew Bynum,Derek Fisher,Kobe Bryant,Lamar Odom,Pau Gasol,1,6:54,SAC,rebound,,,,,,,,,,Jason Thompson,,,,,,def,,
Beno Udrih,Donte Greene,Jason Thompson,Omri Casspi,Spencer Hawes,Andrew Bynum,Derek Fisher,Kobe Bryant,Lamar Odom,Pau Gasol,1,6:49,SAC,turnover,,,,,,,,,,Omri Casspi,,,bad pass,,,,,
Beno Udrih,Donte Greene,Jason Thompson,Omri Casspi,Spencer Hawes,Andrew Bynum,Derek Fisher,Kobe Bryant,Lamar Odom,Pau Gasol,1,6:38,LAL,shot,,,,,,,,,,Kobe Bryant,,,,missed,,jump,18,14
Beno Udrih,Donte Greene,Jason Thompson,Omri Casspi,Spencer Hawes,Andrew Bynum,Derek Fisher,Kobe Bryant,Lamar Odom,Pau Gasol,1,6:36,SAC,rebound,,,,,,,,,,Spencer Hawes,,,,,,def,,
Beno Udrih,Donte Greene,Jason Thompson,Omri Casspi,Spencer Hawes,Andrew Bynum,Derek Fisher,Kobe Bryant,Lamar Odom,Pau Gasol,1,6:24,SAC,shot,Jason Thompson,,,,,,,,,Donte Greene,2,,,made,,driving layup,25,6
Beno Udrih,Donte Greene,Jason Thompson,Omri Casspi,Spencer Hawes,Andrew Bynum,Derek Fisher,Kobe Bryant,Lamar Odom,Pau Gasol,1,6:10,LAL,shot,Kobe Bryant,,,,,,,,,Andrew Bynum,2,,,made,,dunk,25,6
Beno Udrih,Donte Greene,Jason Thompson,Omri Casspi,Spencer Hawes,Andrew Bynum,Derek Fisher,Kobe Bryant,Lamar Odom,Pau Gasol,1,5:51,SAC,shot,Spencer Hawes,,,,,,,,,Donte Greene,2,,,made,,jump,39,14
Beno Udrih,Donte Greene,Jason Thompson,Omri Casspi,Spencer Hawes,Andrew Bynum,Derek Fisher,Kobe Bryant,Lamar Odom,Pau Gasol,1,5:38,LAL,shot,,,,,,,,,,Kobe Bryant,,,,missed,,jump,11,16
Beno Udrih,Donte Greene,Jason Thompson,Omri Casspi,Spencer Hawes,Andrew Bynum,Derek Fisher,Kobe Bryant,Lamar Odom,Pau Gasol,1,5:36,SAC,rebound,,,,,,,,,,Spencer Hawes,,,,,,def,,
Beno Udrih,Donte Greene,Jason Thompson,Omri Casspi,Spencer Hawes,Andrew Bynum,Derek Fisher,Kobe Bryant,Lamar Odom,Pau Gasol,1,5:32,SAC,turnover,,,,,,,,,,Spencer Hawes,,,bad pass,,,,,
Beno Udrih,Donte Greene,Jason Thompson,Omri Casspi,Spencer Hawes,Andrew Bynum,Derek Fisher,Kobe Bryant,Lamar Odom,Pau Gasol,1,5:32,LAL,timeout,,,,,,,,,,,,,,,,regular,,
Beno Udrih,Donte Greene,Jason Thompson,Omri Casspi,Spencer Hawes,Andrew Bynum,Derek Fisher,Kobe Bryant,Lamar Odom,Pau Gasol,1,5:21,SAC,foul,,,,,,,,Pau Gasol,,Omri Casspi,,,,,,shooting,,
Beno Udrih,Donte Greene,Jason Thompson,Omri Casspi,Spencer Hawes,Andrew Bynum,Derek Fisher,Kobe Bryant,Lamar Odom,Pau Gasol,1,5:21,LAL,free throw,,,,,,,1,,2,Pau Gasol,,,foul,made,,,,
Beno Udrih,Donte Greene,Jason Thompson,Omri Casspi,Spencer Hawes,Andrew Bynum,Derek Fisher,Kobe Bryant,Lamar Odom,Pau Gasol,1,5:21,LAL,free throw,,,,,,,2,,2,Pau Gasol,,,foul,made,,,,
Beno Udrih,Donte Greene,Jason Thompson,Omri Casspi,Spencer Hawes,Andrew Bynum,Derek Fisher,Kobe Bryant,Lamar Odom,Pau Gasol,1,5:03,SAC,shot,,,,,,,,,,Jason Thompson,,,,missed,,hook,32,10
Beno Udrih,Donte Greene,Jason Thompson,Omri Casspi,Spencer Hawes,Andrew Bynum,Derek Fisher,Kobe Bryant,Lamar Odom,Pau Gasol,1,5:02,LAL,rebound,,,,,,,,,,Pau Gasol,,,,,,def,,
Beno Udrih,Donte Greene,Jason Thompson,Omri Casspi,Spencer Hawes,Andrew Bynum,Derek Fisher,Kobe Bryant,Lamar Odom,Pau Gasol,1,4:53,SAC,foul,,,,,,,,Andrew Bynum,,Donte Greene,,,,,,personal,,
Beno Udrih,Donte Greene,Jason Thompson,Omri Casspi,Spencer Hawes,Andrew Bynum,Derek Fisher,Kobe Bryant,Lamar Odom,Pau Gasol,1,4:42,LAL,turnover,,,,,,,,,,Lamar Odom,,,bad pass,,,,,
Beno Udrih,Donte Greene,Jason Thompson,Omri Casspi,Spencer Hawes,Andrew Bynum,Derek Fisher,Kobe Bryant,Lamar Odom,Pau Gasol,1,4:32,SAC,shot,Spencer Hawes,,,,,,,,,Omri Casspi,2,,,made,,alley oop dunk,25,6
Beno Udrih,Donte Greene,Jason Thompson,Omri Casspi,Spencer Hawes,Andrew Bynum,Derek Fisher,Kobe Bryant,Lamar Odom,Pau Gasol,1,4:15,LAL,shot,Andrew Bynum,,,,,,,,,Derek Fisher,3,,,made,,3pt,15,31
Beno Udrih,Donte Greene,Jason Thompson,Omri Casspi,Spencer Hawes,Andrew Bynum,Derek Fisher,Kobe Bryant,Lamar Odom,Pau Gasol,1,3:54,SAC,shot,,,,,,,,,,Beno Udrih,2,,,made,,jump,36,11
Beno Udrih,Donte Greene,Jason Thompson,Omri Casspi,Spencer Hawes,Andrew Bynum,Derek Fisher,Kobe Bryant,Lamar Odom,Pau Gasol,1,3:54,LAL,foul,,,,,,,,Beno Udrih,,Derek Fisher,,,,,,shooting,,
Beno Udrih,Donte Greene,Jason Thompson,Omri Casspi,Spencer Hawes,Andrew Bynum,Derek Fisher,Kobe Bryant,Lamar Odom,Pau Gasol,1,3:54,SAC,free throw,,,,,,,1,,1,Beno Udrih,,,foul,made,,,,
Beno Udrih,Donte Greene,Jason Thompson,Omri Casspi,Spencer Hawes,Andrew Bynum,Derek Fisher,Kobe Bryant,Lamar Odom,Pau Gasol,1,3:31,LAL,shot,,,,,,,,,,Derek Fisher,,,,missed,,layup,25,6
Beno Udrih,Donte Greene,Jason Thompson,Omri Casspi,Spencer Hawes,Andrew Bynum,Derek Fisher,Kobe Bryant,Lamar Odom,Pau Gasol,1,3:30,LAL,rebound,,,,,,,,,,Derek Fisher,,,,,,off,,
Beno Udrih,Donte Greene,Jason Thompson,Omri Casspi,Spencer Hawes,Andrew Bynum,Derek Fisher,Kobe Bryant,Lamar Odom,Pau Gasol,1,3:25,LAL,shot,,,,,,,,,,Derek Fisher,,,,missed,,3pt,48,11
Beno Udrih,Donte Greene,Jason Thompson,Omri Casspi,Spencer Hawes,Andrew Bynum,Derek Fisher,Kobe Bryant,Lamar Odom,Pau Gasol,1,3:24,LAL,rebound,,,,,,,,,,Andrew Bynum,,,,,,off,,
Beno Udrih,Donte Greene,Jason Thompson,Omri Casspi,Spencer Hawes,Andrew Bynum,Derek Fisher,Kobe Bryant,Lamar Odom,Pau Gasol,1,3:22,LAL,shot,,,,,,,,,,Andrew Bynum,2,,,made,,dunk,25,6
Beno Udrih,Donte Greene,Jason Thompson,Omri Casspi,Spencer Hawes,Andrew Bynum,Derek Fisher,Kobe Bryant,Lamar Odom,Pau Gasol,1,3:09,SAC,timeout,,,,,,,,,,,,,,,,regular,,
Beno Udrih,Donte Greene,Jason Thompson,Omri Casspi,Spencer Hawes,Andrew Bynum,Jordan Farmar,Kobe Bryant,Lamar Odom,Pau Gasol,1,3:09,LAL,sub,,,,Jordan Farmar,,Derek Fisher,,,,,,,,,,,,
Beno Udrih,Donte Greene,Jason Thompson,Omri Casspi,Spencer Hawes,Adam Morrison,Jordan Farmar,Kobe Bryant,Lamar Odom,Pau Gasol,1,3:09,LAL,sub,,,,Adam Morrison,,Andrew Bynum,,,,,,,,,,,,
Beno Udrih,Donte Greene,Ime Udoka,Omri Casspi,Spencer Hawes,Adam Morrison,Jordan Farmar,Kobe Bryant,Lamar Odom,Pau Gasol,1,3:09,SAC,sub,,,,Ime Udoka,,Jason Thompson,,,,,,,,,,,,
Beno Udrih,Donte Greene,Ime Udoka,Omri Casspi,Spencer Hawes,Adam Morrison,Jordan Farmar,Kobe Bryant,Lamar Odom,Pau Gasol,1,3:02,SAC,shot,Beno Udrih,,,,,,,,,Omri Casspi,2,,,made,,jump,44,17
Beno Udrih,Donte Greene,Ime Udoka,Omri Casspi,Spencer Hawes,Adam Morrison,Jordan Farmar,Kobe Bryant,Lamar Odom,Pau Gasol,1,2:43,LAL,shot,,,,,,,,,,Pau Gasol,2,,,made,,turnaround fade away,38,13
Beno Udrih,Donte Greene,Ime Udoka,Omri Casspi,Spencer Hawes,Adam Morrison,Jordan Farmar,Kobe Bryant,Lamar Odom,Pau Gasol,1,2:24,SAC,shot,,,,,,,,,,Spencer Hawes,,,,missed,,jump,35,24
Beno Udrih,Donte Greene,Ime Udoka,Omri Casspi,Spencer Hawes,Adam Morrison,Jordan Farmar,Kobe Bryant,Lamar Odom,Pau Gasol,1,2:23,LAL,rebound,,,,,,,,,,Lamar Odom,,,,,,def,,
Beno Udrih,Donte Greene,Ime Udoka,Omri Casspi,Spencer Hawes,Adam Morrison,Jordan Farmar,Kobe Bryant,Lamar Odom,Pau Gasol,1,2:10,LAL,shot,,,,,,,,,,Lamar Odom,,,,missed,,3pt,36,29
Beno Udrih,Donte Greene,Ime Udoka,Omri Casspi,Spencer Hawes,Adam Morrison,Jordan Farmar,Kobe Bryant,Lamar Odom,Pau Gasol,1,2:08,SAC,rebound,,,,,,,,,,Omri Casspi,,,,,,def,,
Beno Udrih,Donte Greene,Ime Udoka,Omri Casspi,Spencer Hawes,Adam Morrison,Jordan Farmar,Kobe Bryant,Lamar Odom,Pau Gasol,1,1:57,SAC,shot,,,,,,,,,,Beno Udrih,,,,missed,,jump,40,14
Beno Udrih,Donte Greene,Ime Udoka,Omri Casspi,Spencer Hawes,Adam Morrison,Jordan Farmar,Kobe Bryant,Lamar Odom,Pau Gasol,1,1:55,LAL,rebound,,,,,,,,,,Adam Morrison,,,,,,def,,
Beno Udrih,Donte Greene,Ime Udoka,Omri Casspi,Spencer Hawes,Adam Morrison,Jordan Farmar,Kobe Bryant,Lamar Odom,Pau Gasol,1,1:40,LAL,turnover,,,,,,,,,,Pau Gasol,,,bad pass,,,,,
Beno Udrih,Donte Greene,Ime Udoka,Omri Casspi,Spencer Hawes,Adam Morrison,Jordan Farmar,Kobe Bryant,Lamar Odom,Pau Gasol,1,1:20,SAC,shot,Beno Udrih,,,,,,,,,Spencer Hawes,2,,,made,,layup,25,6
Beno Udrih,Donte Greene,Ime Udoka,Omri Casspi,Spencer Hawes,Adam Morrison,Jordan Farmar,Kobe Bryant,Lamar Odom,Pau Gasol,1,1:03,LAL,shot,Jordan Farmar,,,,,,,,,Adam Morrison,2,,,made,,running jump,30,17
Beno Udrih,Donte Greene,Ime Udoka,Omri Casspi,Spencer Hawes,Adam Morrison,Jordan Farmar,Kobe Bryant,Lamar Odom,Pau Gasol,1,0:46,SAC,shot,,,,,,,,,,Donte Greene,,,,missed,,jump,28,22
Beno Udrih,Donte Greene,Ime Udoka,Omri Casspi,Spencer Hawes,Adam Morrison,Jordan Farmar,Kobe Bryant,Lamar Odom,Pau Gasol,1,0:45,LAL,rebound,,,,,,,,,,Kobe Bryant,,,,,,def,,
Beno Udrih,Donte Greene,Ime Udoka,Omri Casspi,Spencer Hawes,Adam Morrison,Jordan Farmar,Kobe Bryant,Lamar Odom,Pau Gasol,1,0:37,LAL,shot,,,,,,,,,,Kobe Bryant,,,,missed,,jump,26,15
Beno Udrih,Donte Greene,Ime Udoka,Omri Casspi,Spencer Hawes,Adam Morrison,Jordan Farmar,Kobe Bryant,Lamar Odom,Pau Gasol,1,0:36,SAC,rebound,,,,,,,,,,Spencer Hawes,,,,,,def,,
Beno Udrih,Donte Greene,Ime Udoka,Omri Casspi,Spencer Hawes,Adam Morrison,Jordan Farmar,Kobe Bryant,Lamar Odom,Pau Gasol,1,0:28,SAC,shot,Beno Udrih,,,,,,,,,Ime Udoka,2,,,made,,jump,38,14
Beno Udrih,Donte Greene,Ime Udoka,Omri Casspi,Spencer Hawes,Adam Morrison,Jordan Farmar,Kobe Bryant,Lamar Odom,Pau Gasol,1,0:03,LAL,turnover,,,,,,,,,,Pau Gasol,,,bad pass,,Beno Udrih,,,
Beno Udrih,Donte Greene,Ime Udoka,Omri Casspi,Spencer Hawes,Adam Morrison,Jordan Farmar,Kobe Bryant,Lamar Odom,Pau Gasol,1,0:00,SAC,shot,Beno Udrih,,,,,,,,,Omri Casspi,2,,,made,,slam dunk,25,6
Donte Greene,Ime Udoka,Omri Casspi,Sergio Rodriguez,Spencer Hawes,Andrew Bynum,Jordan Farmar,Josh Powell,Kobe Bryant,Shannon Brown,2,11:46,SAC,shot,,,,,,,,,,Omri Casspi,,,,missed,,3pt,42,25
Donte Greene,Ime Udoka,Omri Casspi,Sergio Rodriguez,Spencer Hawes,Andrew Bynum,Jordan Farmar,Josh Powell,Kobe Bryant,Shannon Brown,2,11:45,LAL,rebound,,,,,,,,,,Kobe Bryant,,,,,,def,,
Donte Greene,Ime Udoka,Omri Casspi,Sergio Rodriguez,Spencer Hawes,Andrew Bynum,Jordan Farmar,Josh Powell,Kobe Bryant,Shannon Brown,2,11:30,LAL,shot,,,,,,,,,,Andrew Bynum,,,,missed,,hook,19,13
Donte Greene,Ime Udoka,Omri Casspi,Sergio Rodriguez,Spencer Hawes,Andrew Bynum,Jordan Farmar,Josh Powell,Kobe Bryant,Shannon Brown,2,11:28,SAC,rebound,,,,,,,,,,Spencer Hawes,,,,,,def,,
Donte Greene,Ime Udoka,Omri Casspi,Sergio Rodriguez,Spencer Hawes,Andrew Bynum,Jordan Farmar,Josh Powell,Kobe Bryant,Shannon Brown,2,11:20,SAC,shot,Sergio Rodriguez,,,,,,,,,Spencer Hawes,2,,,made,,driving dunk,25,6
Donte Greene,Ime Udoka,Omri Casspi,Sergio Rodriguez,Spencer Hawes,Andrew Bynum,Jordan Farmar,Josh Powell,Kobe Bryant,Shannon Brown,2,11:02,LAL,shot,,,,,,,,,,Kobe Bryant,,,,missed,,jump,25,23
Donte Greene,Ime Udoka,Omri Casspi,Sergio Rodriguez,Spencer Hawes,Andrew Bynum,Jordan Farmar,Josh Powell,Kobe Bryant,Shannon Brown,2,11:01,SAC,rebound,,,,,,,,,,Ime Udoka,,,,,,def,,
Donte Greene,Ime Udoka,Omri Casspi,Sergio Rodriguez,Spencer Hawes,Andrew Bynum,Jordan Farmar,Josh Powell,Kobe Bryant,Shannon Brown,2,10:51,SAC,shot,,,,,,,,,,Sergio Rodriguez,2,,,made,,floating jump,27,10
Donte Greene,Ime Udoka,Omri Casspi,Sergio Rodriguez,Spencer Hawes,Andrew Bynum,Jordan Farmar,Josh Powell,Kobe Bryant,Shannon Brown,2,10:40,LAL,turnover,,,,,,,,,,Jordan Farmar,,,traveling,,,,,
Donte Greene,Ime Udoka,Jon Brockman,Sergio Rodriguez,Spencer Hawes,Andrew Bynum,Jordan Farmar,Josh Powell,Kobe Bryant,Shannon Brown,2,10:40,SAC,sub,,,,Jon Brockman,,Omri Casspi,,,,,,,,,,,,
Donte Greene,Ime Udoka,Jon Brockman,Sergio Rodriguez,Spencer Hawes,Andrew Bynum,Jordan Farmar,Josh Powell,Kobe Bryant,Shannon Brown,2,10:23,SAC,shot,,,,,,,,,,Spencer Hawes,2,,,made,,jump,16,24
Donte Greene,Ime Udoka,Jon Brockman,Sergio Rodriguez,Spencer Hawes,Andrew Bynum,Jordan Farmar,Josh Powell,Kobe Bryant,Shannon Brown,2,10:04,LAL,shot,,,,,,,,,,Jordan Farmar,,,,missed,,3pt,32,31
Donte Greene,Ime Udoka,Jon Brockman,Sergio Rodriguez,Spencer Hawes,Andrew Bynum,Jordan Farmar,Josh Powell,Kobe Bryant,Shannon Brown,2,10:03,SAC,rebound,,,,,,,,,,Ime Udoka,,,,,,def,,
Donte Greene,Ime Udoka,Jon Brockman,Sergio Rodriguez,Spencer Hawes,Andrew Bynum,Jordan Farmar,Josh Powell,Kobe Bryant,Shannon Brown,2,9:47,SAC,shot,Ime Udoka,,,,,,,,,Spencer Hawes,2,,,made,,layup,25,6
Donte Greene,Ime Udoka,Jon Brockman,Sergio Rodriguez,Spencer Hawes,Andrew Bynum,Jordan Farmar,Josh Powell,Kobe Bryant,Shannon Brown,2,9:26,LAL,shot,,,,,,,,,,Jordan Farmar,,,,missed,,jump,41,9
Donte Greene,Ime Udoka,Jon Brockman,Sergio Rodriguez,Spencer Hawes,Andrew Bynum,Jordan Farmar,Josh Powell,Kobe Bryant,Shannon Brown,2,9:25,SAC,rebound,,,,,,,,,,Ime Udoka,,,,,,def,,
Donte Greene,Ime Udoka,Jon Brockman,Sergio Rodriguez,Spencer Hawes,Andrew Bynum,Jordan Farmar,Josh Powell,Kobe Bryant,Shannon Brown,2,9:12,SAC,shot,Sergio Rodriguez,,,,,,,,,Jon Brockman,2,,,made,,layup,25,6
Donte Greene,Ime Udoka,Jon Brockman,Sergio Rodriguez,Spencer Hawes,Andrew Bynum,Jordan Farmar,Josh Powell,Kobe Bryant,Shannon Brown,2,8:52,LAL,shot,Shannon Brown,,,,,,,,,Andrew Bynum,2,,,made,,jump,21,19
Donte Greene,Ime Udoka,Jon Brockman,Sergio Rodriguez,Spencer Hawes,Andrew Bynum,Jordan Farmar,Josh Powell,Kobe Bryant,Shannon Brown,2,8:34,SAC,shot,,,,,,,,,,Donte Greene,,,,missed,,jump,18,13
Donte Greene,Ime Udoka,Jon Brockman,Sergio Rodriguez,Spencer Hawes,Andrew Bynum,Jordan Farmar,Josh Powell,Kobe Bryant,Shannon Brown,2,8:33,LAL,rebound,,,,,,,,,,Kobe Bryant,,,,,,def,,
Donte Greene,Ime Udoka,Jon Brockman,Sergio Rodriguez,Spencer Hawes,Andrew Bynum,Jordan Farmar,Josh Powell,Kobe Bryant,Shannon Brown,2,8:15,LAL,shot,,,,,,,,,,Andrew Bynum,2,,,made,,layup,25,6
Donte Greene,Ime Udoka,Jon Brockman,Sergio Rodriguez,Spencer Hawes,Andrew Bynum,Jordan Farmar,Josh Powell,Kobe Bryant,Shannon Brown,2,8:00,SAC,shot,Spencer Hawes,,,,,,,,,Sergio Rodriguez,2,,,made,,layup,25,6
Donte Greene,Ime Udoka,Jon Brockman,Sergio Rodriguez,Spencer Hawes,Andrew Bynum,Jordan Farmar,Josh Powell,Kobe Bryant,Shannon Brown,2,7:39,LAL,shot,,,,,,,,,,Kobe Bryant,2,,,made,,layup,25,6
Donte Greene,Ime Udoka,Jon Brockman,Sergio Rodriguez,Spencer Hawes,Andrew Bynum,Jordan Farmar,Josh Powell,Kobe Bryant,Shannon Brown,2,7:39,SAC,foul,,,,,,,,Kobe Bryant,,Donte Greene,,,,,,shooting,,
Donte Greene,Ime Udoka,Jon Brockman,Sergio Rodriguez,Spencer Hawes,Andrew Bynum,Jordan Farmar,Josh Powell,Kobe Bryant,Shannon Brown,2,7:39,LAL,timeout,,,,,,,,,,,,,,,,official,,
Donte Greene,Ime Udoka,Jon Brockman,Sergio Rodriguez,Spencer Hawes,Andrew Bynum,Josh Powell,Kobe Bryant,Sasha Vujacic,Shannon Brown,2,7:39,LAL,sub,,,,Sasha Vujacic,,Jordan Farmar,,,,,,,,,,,,
Donte Greene,Ime Udoka,Jon Brockman,Sergio Rodriguez,Spencer Hawes,Andrew Bynum,Kobe Bryant,Pau Gasol,Sasha Vujacic,Shannon Brown,2,7:39,LAL,sub,,,,Pau Gasol,,Josh Powell,,,,,,,,,,,,
Ime Udoka,Jon Brockman,Omri Casspi,Sergio Rodriguez,Spencer Hawes,Andrew Bynum,Kobe Bryant,Pau Gasol,Sasha Vujacic,Shannon Brown,2,7:39,SAC,sub,,,,Omri Casspi,,Donte Greene,,,,,,,,,,,,
Ime Udoka,Jon Brockman,Omri Casspi,Sergio Rodriguez,Spencer Hawes,Andrew Bynum,Kobe Bryant,Pau Gasol,Sasha Vujacic,Shannon Brown,2,7:39,LAL,free throw,,,,,,,1,,1,Kobe Bryant,,,foul,made,,,,
Ime Udoka,Jon Brockman,Omri Casspi,Sergio Rodriguez,Spencer Hawes,Andrew Bynum,Kobe Bryant,Pau Gasol,Sasha Vujacic,Shannon Brown,2,7:19,SAC,shot,,,,,,,,,,Ime Udoka,2,,,made,,turnaround jump,37,6
Ime Udoka,Jon Brockman,Omri Casspi,Sergio Rodriguez,Spencer Hawes,Andrew Bynum,Kobe Bryant,Pau Gasol,Sasha Vujacic,Shannon Brown,2,7:06,LAL,shot,,,,,,,,,,Kobe Bryant,,,,missed,,jump,14,24
Ime Udoka,Jon Brockman,Omri Casspi,Sergio Rodriguez,Spencer Hawes,Andrew Bynum,Kobe Bryant,Pau Gasol,Sasha Vujacic,Shannon Brown,2,7:05,SAC,rebound,,,,,,,,,,Spencer Hawes,,,,,,def,,
Ime Udoka,Jon Brockman,Omri Casspi,Sergio Rodriguez,Spencer Hawes,Andrew Bynum,Kobe Bryant,Pau Gasol,Sasha Vujacic,Shannon Brown,2,7:00,LAL,foul,,,,,,,,Omri Casspi,,Sasha Vujacic,,,,,,personal,,
Ime Udoka,Jon Brockman,Omri Casspi,Sergio Rodriguez,Spencer Hawes,Andrew Bynum,Kobe Bryant,Pau Gasol,Sasha Vujacic,Shannon Brown,2,6:47,SAC,shot,Sergio Rodriguez,,,,,,,,,Spencer Hawes,3,,,made,,3pt,26,32
Ime Udoka,Jon Brockman,Omri Casspi,Sergio Rodriguez,Spencer Hawes,Andrew Bynum,Kobe Bryant,Pau Gasol,Sasha Vujacic,Shannon Brown,2,6:29,LAL,shot,,,,,,,,,,Andrew Bynum,2,,,made,,layup,25,6
Ime Udoka,Jon Brockman,Omri Casspi,Sergio Rodriguez,Spencer Hawes,Andrew Bynum,Kobe Bryant,Pau Gasol,Sasha Vujacic,Shannon Brown,2,6:21,LAL,foul,,,,,,,,Sergio Rodriguez,,Pau Gasol,,,,,,shooting,,