a1,a2,a3,a4,a5,h1,h2,h3,h4,h5,period,time,team,etype,assist,away,block,entered,home,left,num,opponent,outof,player,points,possession,reason,result,steal,type,x,y
Dwight Howard,Jameer Nelson,Matt Barnes,Rashard Lewis,Vince Carter,Al Jefferson,Corey Brewer,Damien Wilkins,Jonny Flynn,Kevin Love,1,12:00,OFF,jump ball,,Dwight Howard,,,Al Jefferson,,,,,,,Jameer Nelson,,,,,,
Dwight Howard,Jameer Nelson,Matt Barnes,Rashard Lewis,Vince Carter,Al Jefferson,Corey Brewer,Damien Wilkins,Jonny Flynn,Kevin Love,1,11:45,ORL,shot,Jameer Nelson,,,,,,,,,Rashard Lewis,3,,,made,,3pt,38,28
Dwight Howard,Jameer Nelson,Matt Barnes,Rashard Lewis,Vince Carter,Al Jefferson,Corey Brewer,Damien Wilkins,Jonny Flynn,Kevin Love,1,11:29,MIN,turnover,,,,,,,,,,Corey Brewer,,,lost ball,,Matt Barnes,,,
Dwight Howard,Jameer Nelson,Matt Barnes,Rashard Lewis,Vince Carter,Al Jefferson,Corey Brewer,Damien Wilkins,Jonny Flynn,Kevin Love,1,11:25,ORL,shot,,,,,,,,,,Matt Barnes,,,,missed,,layup,25,6
Dwight Howard,Jameer Nelson,Matt Barnes,Rashard Lewis,Vince Carter,Al Jefferson,Corey Brewer,Damien Wilkins,Jonny Flynn,Kevin Love,1,11:24,ORL,rebound,,,,,,,,,,Matt Barnes,,,,,,off,,
Dwight Howard,Jameer Nelson,Matt Barnes,Rashard Lewis,Vince Carter,Al Jefferson,Corey Brewer,Damien Wilkins,Jonny Flynn,Kevin Love,1,11:23,ORL,turnover,,,,,,,,,,Matt Barnes,,,traveling,,,,,
Dwight Howard,Jameer Nelson,Matt Barnes,Rashard Lewis,Vince Carter,Al Jefferson,Corey Brewer,Damien Wilkins,Jonny Flynn,Kevin Love,1,10:58,MIN,shot,,,,,,,,,,Al Jefferson,,,,missed,,turnaround jump,35,5
Dwight Howard,Jameer Nelson,Matt Barnes,Rashard Lewis,Vince Carter,Al Jefferson,Corey Brewer,Damien Wilkins,Jonny Flynn,Kevin Love,1,10:58,ORL,rebound,,,,,,,,,,Rashard Lewis,,,,,,def,,
Dwight Howard,Jameer Nelson,Matt Barnes,Rashard Lewis,Vince Carter,Al Jefferson,Corey Brewer,Damien Wilkins,Jonny Flynn,Kevin Love,1,10:47,ORL,shot,Dwight Howard,,,,,,,,,Jameer Nelson,2,,,made,,jump,23,9
Dwight Howard,Jameer Nelson,Matt Barnes,Rashard Lewis,Vince Carter,Al Jefferson,Corey Brewer,Damien Wilkins,Jonny Flynn,Kevin Love,1,10:25,MIN,shot,,,,,,,,,,Corey Brewer,,,,missed,,jump,31,25
Dwight Howard,Jameer Nelson,Matt Barnes,Rashard Lewis,Vince Carter,Al Jefferson,Corey Brewer,Damien Wilkins,Jonny Flynn,Kevin Love,1,10:25,ORL,rebound,,,,,,,,,,Dwight Howard,,,,,,def,,
Dwight Howard,Jameer Nelson,Matt Barnes,Rashard Lewis,Vince Carter,Al Jefferson,Corey Brewer,Damien Wilkins,Jonny Flynn,Kevin Love,1,10:05,ORL,shot,Dwight Howard,,,,,,,,,Jameer Nelson,3,,,made,,3pt,13,28
Dwight Howard,Jameer Nelson,Matt Barnes,Rashard Lewis,Vince Carter,Al Jefferson,Corey Brewer,Damien Wilkins,Jonny Flynn,Kevin Love,1,9:59,MIN,timeout,,,,,,,,,,,,,,,,regular,,
Dwight Howard,Jameer Nelson,Matt Barnes,Rashard Lewis,Vince Carter,Al Jefferson,Corey Brewer,Damien Wilkins,Jonny Flynn,Kevin Love,1,9:47,MIN,shot,,,,,,,,,,Kevin Love,,,,missed,,jump,26,12
Dwight Howard,Jameer Nelson,Matt Barnes,Rashard Lewis,Vince Carter,Al Jefferson,Corey Brewer,Damien Wilkins,Jonny Flynn,Kevin Love,1,9:47,ORL,rebound,,,,,,,,,,Dwight Howard,,,,,,def,,
Dwight Howard,Jameer Nelson,Matt Barnes,Rashard Lewis,Vince Carter,Al Jefferson,Corey Brewer,Damien Wilkins,Jonny Flynn,Kevin Love,1,9:33,ORL,shot,,,,,,,,,,Matt Barnes,,,,missed,,3pt,2,14
Dwight Howard,Jameer Nelson,Matt Barnes,Rashard Lewis,Vince Carter,Al Jefferson,Corey Brewer,Damien Wilkins,Jonny Flynn,Kevin Love,1,9:32,MIN,rebound,,,,,,,,,,Jonny Flynn,,,,,,def,,
Dwight Howard,Jameer Nelson,Matt Barnes,Rashard Lewis,Vince Carter,Al Jefferson,Corey Brewer,Damien Wilkins,Jonny Flynn,Kevin Love,1,9:17,MIN,shot,,,,,,,,,,Damien Wilkins,,,,missed,,3pt,23,31
Dwight Howard,Jameer Nelson,Matt Barnes,Rashard Lewis,Vince Carter,Al Jefferson,Corey Brewer,Damien Wilkins,Jonny Flynn,Kevin Love,1,9:16,MIN,rebound,,,,,,,,,,Al Jefferson,,,,,,off,,
Dwight Howard,Jameer Nelson,Matt Barnes,Rashard Lewis,Vince Carter,Al Jefferson,Corey Brewer,Damien Wilkins,Jonny Flynn,Kevin Love,1,9:05,MIN,shot,Al Jefferson,,,,,,,,,Jonny Flynn,3,,,made,,3pt,21,31
Dwight Howard,Jameer Nelson,Matt Barnes,Rashard Lewis,Vince Carter,Al Jefferson,Corey Brewer,Damien Wilkins,Jonny Flynn,Kevin Love,1,8:49,ORL,shot,,,Corey Brewer,,,,,,,Dwight Howard,,,,missed,,jump,27,10
Dwight Howard,Jameer Nelson,Matt Barnes,Rashard Lewis,Vince Carter,Al Jefferson,Corey Brewer,Damien Wilkins,Jonny Flynn,Kevin Love,1,8:47,MIN,rebound,,,,,,,,,,Al Jefferson,,,,,,def,,
Dwight Howard,Jameer Nelson,Matt Barnes,Rashard Lewis,Vince Carter,Al Jefferson,Corey Brewer,Damien Wilkins,Jonny Flynn,Kevin Love,1,8:25,MIN,turnover,,,,,,,,,,Damien Wilkins,,,bad pass,,Jameer Nelson,,,
Dwight Howard,Jameer Nelson,Matt Barnes,Rashard Lewis,Vince Carter,Al Jefferson,Corey Brewer,Damien Wilkins,Jonny Flynn,Kevin Love,1,8:22,ORL,shot,Jameer Nelson,,,,,,,,,Matt Barnes,2,,,made,,driving layup,25,6
Dwight Howard,Jameer Nelson,Matt Barnes,Rashard Lewis,Vince Carter,Al Jefferson,Corey Brewer,Damien Wilkins,Jonny Flynn,Kevin Love,1,8:01,MIN,shot,Al Jefferson,,,,,,,,,Jonny Flynn,3,,,made,,3pt,21,31
Dwight Howard,Jameer Nelson,Matt Barnes,Rashard Lewis,Vince Carter,Al Jefferson,Corey Brewer,Damien Wilkins,Jonny Flynn,Kevin Love,1,7:49,ORL,shot,Jameer Nelson,,,,,,,,,Rashard Lewis,3,,,made,,3pt,19,31
Dwight Howard,Jameer Nelson,Matt Barnes,Rashard Lewis,Vince Carter,Al Jefferson,Corey Brewer,Damien Wilkins,Jonny Flynn,Kevin Love,1,7:34,MIN,shot,,,,,,,,,,Al Jefferson,2,,,made,,driving slam dunk,25,6
Dwight Howard,Jameer Nelson,Matt Barnes,Rashard Lewis,Vince Carter,Al Jefferson,Corey Brewer,Damien Wilkins,Jonny Flynn,Kevin Love,1,7:18,ORL,shot,,,,,,,,,,Rashard Lewis,,,,missed,,3pt,48,8
Dwight Howard,Jameer Nelson,Matt Barnes,Rashard Lewis,Vince Carter,Al Jefferson,Corey Brewer,Damien Wilkins,Jonny Flynn,Kevin Love,1,7:18,MIN,rebound,,,,,,,,,,Al Jefferson,,,,,,def,,
Dwight Howard,Jameer Nelson,Matt Barnes,Rashard Lewis,Vince Carter,Al Jefferson,Corey Brewer,Damien Wilkins,Jonny Flynn,Kevin Love,1,7:10,MIN,shot,,,Rashard Lewis,,,,,,,Kevin Love,,,,missed,,layup,25,6
Dwight Howard,Jameer Nelson,Matt Barnes,Rashard Lewis,Vince Carter,Al Jefferson,Corey Brewer,Damien Wilkins,Jonny Flynn,Kevin Love,1,7:08,MIN,rebound,,,,,,,,,,Kevin Love,,,,,,off,,
Dwight Howard,Jameer Nelson,Matt Barnes,Rashard Lewis,Vince Carter,Al Jefferson,Corey Brewer,Damien Wilkins,Jonny Flynn,Kevin Love,1,7:05,MIN,shot,,,,,,,,,,Jonny Flynn,,,,missed,,3pt,10,26
Dwight Howard,Jameer Nelson,Matt Barnes,Rashard Lewis,Vince Carter,Al Jefferson,Corey Brewer,Damien Wilkins,Jonny Flynn,Kevin Love,1,7:04,ORL,rebound,,,,,,,,,,,,,,,,,,
Dwight Howard,Jameer Nelson,Matt Barnes,Rashard Lewis,Vince Carter,Al Jefferson,Corey Brewer,Damien Wilkins,Jonny Flynn,Kevin Love,1,6:48,ORL,shot,,,,,,,,,,Vince Carter,2,,,made,,step back jump,15,15
Dwight Howard,Jameer Nelson,Matt Barnes,Rashard Lewis,Vince Carter,Al Jefferson,Corey Brewer,Damien Wilkins,Jonny Flynn,Kevin Love,1,6:33,MIN,shot,,,,,,,,,,Al Jefferson,,,,missed,,jump,37,13
Dwight Howard,Jameer Nelson,Matt Barnes,Rashard Lewis,Vince Carter,Al Jefferson,Corey Brewer,Damien Wilkins,Jonny Flynn,Kevin Love,1,6:33,MIN,rebound,,,,,,,,,,Kevin Love,,,,,,off,,
Dwight Howard,Jameer Nelson,Matt Barnes,Rashard Lewis,Vince Carter,Al Jefferson,Corey Brewer,Damien Wilkins,Jonny Flynn,Kevin Love,1,6:21,MIN,shot,,,,,,,,,,Damien Wilkins,,,,missed,,3pt,2,7
Dwight Howard,Jameer Nelson,Matt Barnes,Rashard Lewis,Vince Carter,Al Jefferson,Corey Brewer,Damien Wilkins,Jonny Flynn,Kevin Love,1,6:21,MIN,rebound,,,,,,,,,,Al Jefferson,,,,,,off,,
Dwight Howard,Jameer Nelson,Matt Barnes,Rashard Lewis,Vince Carter,Al Jefferson,Corey Brewer,Damien Wilkins,Jonny Flynn,Kevin Love,1,6:12,MIN,shot,,,,,,,,,,Damien Wilkins,,,,missed,,3pt,48,5
Dwight Howard,Jameer Nelson,Matt Barnes,Rashard Lewis,Vince Carter,Al Jefferson,Corey Brewer,Damien Wilkins,Jonny Flynn,Kevin Love,1,6:12,MIN,rebound,,,,,,,,,,Kevin Love,,,,,,off,,
Dwight Howard,Jameer Nelson,Matt Barnes,Rashard Lewis,Vince Carter,Al Jefferson,Corey Brewer,Damien Wilkins,Jonny Flynn,Kevin Love,1,6:11,MIN,shot,,,,,,,,,,Kevin Love,2,,,made,,layup,25,6
Dwight Howard,Jameer Nelson,Matt Barnes,Rashard Lewis,Vince Carter,Al Jefferson,Corey Brewer,Damien Wilkins,Jonny Flynn,Kevin Love,1,6:11,ORL,foul,,,,,,,,Kevin Love,,Rashard Lewis,,,,,,shooting,,
Dwight Howard,Jameer Nelson,Matt Barnes,Rashard Lewis,Vince Carter,Al Jefferson,Corey Brewer,Damien Wilkins,Jonny Flynn,Kevin Love,1,6:11,MIN,free throw,,,,,,,1,,1,Kevin Love,,,foul,missed,,,,
Dwight Howard,Jameer Nelson,Matt Barnes,Rashard Lewis,Vince Carter,Al Jefferson,Corey Brewer,Damien Wilkins,Jonny Flynn,Kevin Love,1,6:10,ORL,rebound,,,,,,,,,,Dwight Howard,,,,,,def,,
Dwight Howard,Jameer Nelson,Matt Barnes,Rashard Lewis,Vince Carter,Al Jefferson,Corey Brewer,Damien Wilkins,Jonny Flynn,Kevin Love,1,5:50,ORL,shot,,,Corey Brewer,,,,,,,Jameer Nelson,,,,missed,,jump,5,8
Dwight Howard,Jameer Nelson,Matt Barnes,Rashard Lewis,Vince Carter,Al Jefferson,Corey Brewer,Damien Wilkins,Jonny Flynn,Kevin Love,1,5:49,MIN,rebound,,,,,,,,,,Kevin Love,,,,,,def,,
Dwight Howard,Jameer Nelson,Matt Barnes,Rashard Lewis,Vince Carter,Al Jefferson,Corey Brewer,Damien Wilkins,Jonny Flynn,Kevin Love,1,5:39,MIN,shot,Jonny Flynn,,,,,,,,,Corey Brewer,2,,,made,,jump,26,27
Dwight Howard,Jameer Nelson,Matt Barnes,Rashard Lewis,Vince Carter,Al Jefferson,Corey Brewer,Damien Wilkins,Jonny Flynn,Kevin Love,1,5:27,MIN,foul,,,,,,,,Dwight Howard,,Damien Wilkins,,,,,,personal,,
Dwight Howard,Jameer Nelson,Matt Barnes,Rashard Lewis,Vince Carter,Al Jefferson,Corey Brewer,Damien Wilkins,Jonny Flynn,Kevin Love,1,5:18,ORL,shot,,,,,,,,,,Dwight Howard,,,,missed,,jump,31,9
Dwight Howard,Jameer Nelson,Matt Barnes,Rashard Lewis,Vince Carter,Al Jefferson,Corey Brewer,Damien Wilkins,Jonny Flynn,Kevin Love,1,5:17,ORL,rebound,,,,,,,,,,Matt Barnes,,,,,,off,,
Dwight Howard,Jameer Nelson,Matt Barnes,Rashard Lewis,Vince Carter,Al Jefferson,Corey Brewer,Damien Wilkins,Jonny Flynn,Kevin Love,1,5:17,ORL,shot,,,,,,,,,,Matt Barnes,2,,,made,,putback slam dunk,25,6
Dwight Howard,Jameer Nelson,Matt Barnes,Rashard Lewis,Vince Carter,Al Jefferson,Corey Brewer,Damien Wilkins,Jonny Flynn,Kevin Love,1,4:54,MIN,shot,,,,,,,,,,Al Jefferson,,,,missed,,jump,22,23
Dwight Howard,Jameer Nelson,Matt Barnes,Rashard Lewis,Vince Carter,Al Jefferson,Corey Brewer,Damien Wilkins,Jonny Flynn,Kevin Love,1,4:53,MIN,rebound,,,,,,,,,,Damien Wilkins,,,,,,off,,
Dwight Howard,Jameer Nelson,Matt Barnes,Rashard Lewis,Vince Carter,Al Jefferson,Corey Brewer,Damien Wilkins,Jonny Flynn,Kevin Love,1,4:44,MIN,shot,,,,,,,,,,Al Jefferson,2,,,made,,layup,25,6
Dwight Howard,Jameer Nelson,Matt Barnes,Rashard Lewis,Vince Carter,Al Jefferson,Corey Brewer,Damien Wilkins,Jonny Flynn,Kevin Love,1,4:44,ORL,foul,,,,,,,,Al Jefferson,,Dwight Howard,,,,,,shooting,,
Dwight Howard,Jameer Nelson,Matt Barnes,Rashard Lewis,Vince Carter,Al Jefferson,Corey Brewer,Damien Wilkins,Jonny Flynn,Kevin Love,1,4:44,MIN,free throw,,,,,,,1,,1,Al Jefferson,,,foul,made,,,,
Dwight Howard,Jameer Nelson,Matt Barnes,Rashard Lewis,Vince Carter,Al Jefferson,Corey Brewer,Damien Wilkins,Jonny Flynn,Kevin Love,1,4:28,ORL,shot,,,,,,,,,,Jameer Nelson,,,,missed,,3pt,48,5
Dwight Howard,Jameer Nelson,Matt Barnes,Rashard Lewis,Vince Carter,Al Jefferson,Corey Brewer,Damien Wilkins,Jonny Flynn,Kevin Love,1,4:27,MIN,rebound,,,,,,,,,,,,,,,,,,
Dwight Howard,Jameer Nelson,Matt Barnes,Rashard Lewis,Vince Carter,Al Jefferson,Corey Brewer,Damien Wilkins,Jonny Flynn,Kevin Love,1,4:27,ORL,foul,,,,,,,,Corey Brewer,,Dwight Howard,,,,,,loose ball,,
Dwight Howard,Jameer Nelson,Matt Barnes,Rashard Lewis,Vince Carter,Corey Brewer,Damien Wilkins,Jonny Flynn,Kevin Love,Nathan Jawai,1,4:27,MIN,sub,,,,Nathan Jawai,,Al Jefferson,,,,,,,,,,,,
Dwight Howard,Jameer Nelson,Matt Barnes,Rashard Lewis,Vince Carter,Corey Brewer,Jonny Flynn,Kevin Love,Nathan Jawai,Ryan Gomes,1,4:27,MIN,sub,,,,Ryan Gomes,,Damien Wilkins,,,,,,,,,,,,
Jameer Nelson,Marcin Gortat,Matt Barnes,Rashard Lewis,Vince Carter,Corey Brewer,Jonny Flynn,Kevin Love,Nathan Jawai,Ryan Gomes,1,4:27,ORL,sub,,,,Marcin Gortat,,Dwight Howard,,,,,,,,,,,,
Jameer Nelson,Marcin Gortat,Matt Barnes,Rashard Lewis,Vince Carter,Corey Brewer,Jonny Flynn,Kevin Love,Nathan Jawai,Ryan Gomes,1,4:15,MIN,shot,,,Marcin Gortat,,,,,,,Corey Brewer,,,,missed,,layup,25,6
Jameer Nelson,Marcin Gortat,Matt Barnes,Rashard Lewis,Vince Carter,Corey Brewer,Jonny Flynn,Kevin Love,Nathan Jawai,Ryan Gomes,1,4:14,MIN,rebound,,,,,,,,,,Kevin Love,,,,,,off,,
Jameer Nelson,Marcin Gortat,Matt Barnes,Rashard Lewis,Vince Carter,Corey Brewer,Jonny Flynn,Kevin Love,Nathan Jawai,Ryan Gomes,1,4:13,MIN,shot,,,,,,,,,,Kevin Love,,,,missed,,layup,25,6
Jameer Nelson,Marcin Gortat,Matt Barnes,Rashard Lewis,Vince Carter,Corey Brewer,Jonny Flynn,Kevin Love,Nathan Jawai,Ryan Gomes,1,4:12,MIN,rebound,,,,,,,,,,Kevin Love,,,,,,off,,
Jameer Nelson,Marcin Gortat,Matt Barnes,Rashard Lewis,Vince Carter,Corey Brewer,Jonny Flynn,Kevin Love,Nathan Jawai,Ryan Gomes,1,4:11,ORL,foul,,,,,,,,Kevin Love,,Marcin Gortat,,,,,,shooting,,
Jameer Nelson,Marcin Gortat,Matt Barnes,Ryan Anderson,Vince Carter,Corey Brewer,Jonny Flynn,Kevin Love,Nathan Jawai,Ryan Gomes,1,4:11,ORL,sub,,,,Ryan Anderson,,Rashard Lewis,,,,,,,,,,,,
Jameer Nelson,Marcin Gortat,Matt Barnes,Ryan Anderson,Vince Carter,Corey Brewer,Jonny Flynn,Kevin Love,Nathan Jawai,Ryan Gomes,1,4:11,MIN,free throw,,,,,,,1,,2,Kevin Love,,,foul,made,,,,
Jameer Nelson,Marcin Gortat,Matt Barnes,Ryan Anderson,Vince Carter,Corey Brewer,Jonny Flynn,Kevin Love,Nathan Jawai,Ryan Gomes,1,4:11,MIN,free throw,,,,,,,2,,2,Kevin Love,,,foul,missed,,,,
Jameer Nelson,Marcin Gortat,Matt Barnes,Ryan Anderson,Vince Carter,Corey Brewer,Jonny Flynn,Kevin Love,Nathan Jawai,Ryan Gomes,1,4:10,ORL,rebound,,,,,,,,,,Matt Barnes,,,,,,def,,
Jameer Nelson,Marcin Gortat,Matt Barnes,Ryan Anderson,Vince Carter,Corey Brewer,Jonny Flynn,Kevin Love,Nathan Jawai,Ryan Gomes,1,3:57,ORL,shot,,,,,,,,,,Vince Carter,2,,,made,,driving slam dunk,25,6
Jameer Nelson,Marcin Gortat,Matt Barnes,Ryan Anderson,Vince Carter,Corey Brewer,Jonny Flynn,Kevin Love,Nathan Jawai,Ryan Gomes,1,3:39,MIN,turnover,,,,,,,,,,Kevin Love,,,bad pass,,Ryan Anderson,,,
Jameer Nelson,Marcin Gortat,Matt Barnes,Ryan Anderson,Vince Carter,Corey Brewer,Jonny Flynn,Kevin Love,Nathan Jawai,Ryan Gomes,1,3:36,ORL,shot,Ryan Anderson,,,,,,,,,Matt Barnes,2,,,made,,dunk,25,6
Jameer Nelson,Marcin Gortat,Matt Barnes,Ryan Anderson,Vince Carter,Corey Brewer,Jonny Flynn,Kevin Love,Nathan Jawai,Ryan Gomes,1,3:14,MIN,shot,Nathan Jawai,,,,,,,,,Ryan Gomes,2,,,made,,jump,11,15
Jameer Nelson,Marcin Gortat,Matt Barnes,Ryan Anderson,Vince Carter,Corey Brewer,Jonny Flynn,Kevin Love,Nathan Jawai,Ryan Gomes,1,3:02,ORL,shot,,,,,,,,,,Vince Carter,,,,missed,,3pt,48,14
Jameer Nelson,Marcin Gortat,Matt Barnes,Ryan Anderson,Vince Carter,Corey Brewer,Jonny Flynn,Kevin Love,Nathan Jawai,Ryan Gomes,1,3:01,MIN,rebound,,,,,,,,,,Nathan Jawai,,,,,,def,,
Jameer Nelson,Marcin Gortat,Matt Barnes,Ryan Anderson,Vince Carter,Corey Brewer,Jonny Flynn,Kevin Love,Nathan Jawai,Ryan Gomes,1,2:55,MIN,foul,,,,,,,,Matt Barnes,,Jonny Flynn,,,,,,offensive,,
Jameer Nelson,Marcin Gortat,Matt Barnes,Ryan Anderson,Vince Carter,Corey Brewer,Jonny Flynn,Kevin Love,Nathan Jawai,Ryan Gomes,1,2:55,MIN,turnover,,,,,,,,,,Jonny Flynn,,,foul,,,,,
Jameer Nelson,Marcin Gortat,Matt Barnes,Ryan Anderson,Vince Carter,Corey Brewer,Jonny Flynn,Kevin Love,Nathan Jawai,Ryan Gomes,1,2:55,ORL,timeout,,,,,,,,,,,,,,,,regular,,
Jameer Nelson,Marcin Gortat,Matt Barnes,Ryan Anderson,Vince Carter,Corey Brewer,Jonny Flynn,Nathan Jawai,Ryan Gomes,Ryan Hollins,1,2:55,MIN,sub,,,,Ryan Hollins,,Kevin Love,,,,,,,,,,,,
Jameer Nelson,Marcin Gortat,Matt Barnes,Ryan Anderson,Vince Carter,Corey Brewer,Jonny Flynn,Nathan Jawai,Ryan Gomes,Ryan Hollins,1,2:38,ORL,shot,,,,,,,,,,Vince Carter,,,,missed,,pullup jump,21,20
Jameer Nelson,Marcin Gortat,Matt Barnes,Ryan Anderson,Vince Carter,Corey Brewer,Jonny Flynn,Nathan Jawai,Ryan Gomes,Ryan Hollins,1,2:37,MIN,rebound,,,,,,,,,,Ryan Gomes,,,,,,def,,
Jameer Nelson,Marcin Gortat,Matt Barnes,Ryan Anderson,Vince Carter,Corey Brewer,Jonny Flynn,Nathan Jawai,Ryan Gomes,Ryan Hollins,1,2:23,MIN,shot,,,,,,,,,,Ryan Hollins,2,,,made,,jump,9,12
Jameer Nelson,Marcin Gortat,Matt Barnes,Ryan Anderson,Vince Carter,Corey Brewer,Jonny Flynn,Nathan Jawai,Ryan Gomes,Ryan Hollins,1,2:11,ORL,shot,,,,,,,,,,Ryan Anderson,,,,missed,,3pt,48,10
Jameer Nelson,Marcin Gortat,Matt Barnes,Ryan Anderson,Vince Carter,Corey Brewer,Jonny Flynn,Nathan Jawai,Ryan Gomes,Ryan Hollins,1,2:10,MIN,rebound,,,,,,,,,,Nathan Jawai,,,,,,def,,
Jameer Nelson,Marcin Gortat,Matt Barnes,Ryan Anderson,Vince Carter,Corey Brewer,Jonny Flynn,Nathan Jawai,Ryan Gomes,Ryan Hollins,1,1:50,ORL,foul,,,,,,,,Jonny Flynn,,Matt Barnes,,,,,,shooting,,
Jameer Nelson,Marcin Gortat,Matt Barnes,Ryan Anderson,Vince Carter,Jonny Flynn,Nathan Jawai,Ryan Gomes,Ryan Hollins,Wayne Ellington,1,1:50,MIN,sub,,,,Wayne Ellington,,Corey Brewer,,,,,,,,,,,,
Jameer Nelson,Marcin Gortat,Matt Barnes,Ryan Anderson,Vince Carter,Jonny Flynn,Nathan Jawai,Ryan Gomes,Ryan Hollins,Wayne Ellington,1,1:50,MIN,free throw,,,,,,,1,,2,Jonny Flynn,,,foul,made,,,,
Jason Williams,Marcin Gortat,Matt Barnes,Ryan Anderson,Vince Carter,Jonny Flynn,Nathan Jawai,Ryan Gomes,Ryan Hollins,Wayne Ellington,1,1:50,ORL,sub,,,,Jason Williams,,Jameer Nelson,,,,,,,,,,,,
Jason Williams,Marcin Gortat,Matt Barnes,Ryan Anderson,Vince Carter,Jonny Flynn,Nathan Jawai,Ryan Gomes,Ryan Hollins,Wayne Ellington,1,1:50,MIN,free throw,,,,,,,2,,2,Jonny Flynn,,,foul,made,,,,
Jason Williams,Marcin Gortat,Matt Barnes,Ryan Anderson,Vince Carter,Jonny Flynn,Nathan Jawai,Ryan Gomes,Ryan Hollins,Wayne Ellington,1,1:35,ORL,shot,,,,,,,,,,Vince Carter,,,,missed,,turnaround jump,37,8
Jason Williams,Marcin Gortat,Matt Barnes,Ryan Anderson,Vince Carter,Jonny Flynn,Nathan Jawai,Ryan Gomes,Ryan Hollins,Wayne Ellington,1,1:34,ORL,rebound,,,,,,,,,,,,,,,,,,
Jason Williams,Marcin Gortat,Matt Barnes,Ryan Anderson,Vince Carter,Jonny Flynn,Nathan Jawai,Ryan Gomes,Ryan Hollins,Wayne Ellington,1,1:34,MIN,foul,,,,,,,,Vince Carter,,Ryan Hollins,,,,,,loose ball,,
Jason Williams,Marcin Gortat,Matt Barnes,Ryan Anderson,Vince Carter,Nathan Jawai,Ramon Sessions,Ryan Gomes,Ryan Hollins,Wayne Ellington,1,1:34,MIN,sub,,,,Ramon Sessions,,Jonny Flynn,,,,,,,,,,,,
Jason Williams,Marcin Gortat,Matt Barnes,Ryan Anderson,Vince Carter,Nathan Jawai,Ramon Sessions,Ryan Gomes,Ryan Hollins,Wayne Ellington,1,1:22,ORL,shot,Vince Carter,,,,,,,,,Jason Williams,3,,,made,,3pt,46,22
Jason Williams,Marcin Gortat,Matt Barnes,Ryan Anderson,Vince Carter,Nathan Jawai,Ramon Sessions,Ryan Gomes,Ryan Hollins,Wayne Ellington,1,1:06,MIN,turnover,,,,,,,,,,Ryan Gomes,,,bad pass,,Vince Carter,,,
Jason Williams,Marcin Gortat,Matt Barnes,Ryan Anderson,Vince Carter,Nathan Jawai,Ramon Sessions,Ryan Gomes,Ryan Hollins,Wayne Ellington,1,0:57,ORL,shot,,,,,,,,,,Vince Carter,,,,missed,,jump,16,9
Jason Williams,Marcin Gortat,Matt Barnes,Ryan Anderson,Vince Carter,Nathan Jawai,Ramon Sessions,Ryan Gomes,Ryan Hollins,Wayne Ellington,1,0:57,MIN,rebound,,,,,,,,,,Nathan Jawai,,,,,,def,,
Jason Williams,Marcin Gortat,Matt Barnes,Ryan Anderson,Vince Carter,Nathan Jawai,Ramon Sessions,Ryan Gomes,Ryan Hollins,Wayne Ellington,1,0:53,ORL,violation,,,,,,,,,,Marcin Gortat,,,,,,defensive goaltending,,
Jason Williams,Marcin Gortat,Matt Barnes,Ryan Anderson,Vince Carter,Nathan Jawai,Ramon Sessions,Ryan Gomes,Ryan Hollins,Wayne Ellington,1,0:53,MIN,shot,,,,,,,,,,Ramon Sessions,2,,,made,,driving layup,25,6
Jason Williams,Marcin Gortat,Matt Barnes,Ryan Anderson,Vince Carter,Nathan Jawai,Ramon Sessions,Ryan Gomes,Ryan Hollins,Wayne Ellington,1,0:38,ORL,shot,,,,,,,,,,Ryan Anderson,,,,missed,,3pt,48,5
Jason Williams,Marcin Gortat,Matt Barnes,Ryan Anderson,Vince Carter,Nathan Jawai,Ramon Sessions,Ryan Gomes,Ryan Hollins,Wayne Ellington,1,0:37,MIN,rebound,,,,,,,,,,Ramon Sessions,,,,,,def,,
Jason Williams,Marcin Gortat,Matt Barnes,Ryan Anderson,Vince Carter,Nathan Jawai,Ramon Sessions,Ryan Gomes,Ryan Hollins,Wayne Ellington,1,0:20,MIN,shot,Ramon Sessions,,,,,,,,,Nathan Jawai,2,,,made,,turnaround jump,15,9
Jason Williams,Marcin Gortat,Matt Barnes,Ryan Anderson,Vince Carter,Nathan Jawai,Ramon Sessions,Ryan Gomes,Ryan Hollins,Wayne Ellington,1,0:01,ORL,shot,,,,,,,,,,Ryan Anderson,,,,missed,,3pt,14,30
Jason Williams,Marcin Gortat,Matt Barnes,Ryan Anderson,Vince Carter,Nathan Jawai,Ramon Sessions,Ryan Gomes,Ryan Hollins,Wayne Ellington,1,0:00,MIN,rebound,,,,,,,,,,Ramon Sessions,,,,,,def,,
Dwight Howard,J.J. Redick,Jason Williams,Mickael Pietrus,Ryan Anderson,Nathan Jawai,Ramon Sessions,Ryan Gomes,Ryan Hollins,Wayne Ellington,2,11:46,MIN,shot,,,,,,,,,,Ramon Sessions,,,,missed,,running jump,25,15
Dwight Howard,J.J. Redick,Jason Williams,Mickael Pietrus,Ryan Anderson,Nathan Jawai,Ramon Sessions,Ryan Gomes,Ryan Hollins,Wayne Ellington,2,11:45,MIN,rebound,,,,,,,,,,Nathan Jawai,,,,,,off,,
Dwight Howard,J.J. Redick,Jason Williams,Mickael Pietrus,Ryan Anderson,Nathan Jawai,Ramon Sessions,Ryan Gomes,Ryan Hollins,Wayne Ellington,2,11:45,MIN,shot,,,,,,,,,,Nathan Jawai,,,,missed,,tip,25,6
Dwight Howard,J.J. Redick,Jason Williams,Mickael Pietrus,Ryan Anderson,Nathan Jawai,Ramon Sessions,Ryan Gomes,Ryan Hollins,Wayne Ellington,2,11:44,MIN,rebound,,,,,,,,,,Nathan Jawai,,,,,,off,,
Dwight Howard,J.J. Redick,Jason Williams,Mickael Pietrus,Ryan Anderson,Nathan Jawai,Ramon Sessions,Ryan Gomes,Ryan Hollins,Wayne Ellington,2,11:43,MIN,shot,,,,,,,,,,Nathan Jawai,,,,missed,,layup,25,6
Dwight Howard,J.J. Redick,Jason Williams,Mickael Pietrus,Ryan Anderson,Nathan Jawai,Ramon Sessions,Ryan Gomes,Ryan Hollins,Wayne Ellington,2,11:42,ORL,rebound,,,,,,,,,,Mickael Pietrus,,,,,,def,,
Dwight Howard,J.J. Redick,Jason Williams,Mickael Pietrus,Ryan Anderson,Nathan Jawai,Ramon Sessions,Ryan Gomes,Ryan Hollins,Wayne Ellington,2,11:41,MIN,foul,,,,,,,,Mickael Pietrus,,Nathan Jawai,,,,,,personal,,
Dwight Howard,J.J. Redick,Jason Williams,Mickael Pietrus,Ryan Anderson,Nathan Jawai,Ramon Sessions,Ryan Gomes,Ryan Hollins,Wayne Ellington,2,11:27,ORL,shot,,,,,,,,,,Mickael Pietrus,,,,missed,,jump,36,25
Dwight Howard,J.J. Redick,Jason Williams,Mickael Pietrus,Ryan Anderson,Nathan Jawai,Ramon Sessions,Ryan Gomes,Ryan Hollins,Wayne Ellington,2,11:26,MIN,rebound,,,,,,,,,,Nathan Jawai,,,,,,def,,
Dwight Howard,J.J. Redick,Jason Williams,Mickael Pietrus,Ryan Anderson,Nathan Jawai,Ramon Sessions,Ryan Gomes,Ryan Hollins,Wayne Ellington,2,11:19,MIN,turnover,,,,,,,,,,Ramon Sessions,,,bad pass,,Ryan Anderson,,,
Dwight Howard,J.J. Redick,Jason Williams,Mickael Pietrus,Ryan Anderson,Nathan Jawai,Ramon Sessions,Ryan Gomes,Ryan Hollins,Wayne Ellington,2,11:08,MIN,foul,,,,,,,,Ryan Anderson,,Ryan Hollins,,,,,,shooting,,
Dwight Howard,J.J. Redick,Jason Williams,Mickael Pietrus,Ryan Anderson,Nathan Jawai,Ramon Sessions,Ryan Gomes,Ryan Hollins,Wayne Ellington,2,11:08,ORL,free throw,,,,,,,1,,2,Ryan Anderson,,,foul,made,,,,
Dwight Howard,J.J. Redick,Jason Williams,Mickael Pietrus,Ryan Anderson,Kevin Love,Nathan Jawai,Ramon Sessions,Ryan Gomes,Wayne Ellington,2,11:08,MIN,sub,,,,Kevin Love,,Ryan Hollins,,,,,,,,,,,,
Dwight Howard,J.J. Redick,Jason Williams,Mickael Pietrus,Ryan Anderson,Kevin Love,Nathan Jawai,Ramon Sessions,Ryan Gomes,Wayne Ellington,2,11:08,ORL,free throw,,,,,,,2,,2,Ryan Anderson,,,foul,made,,,,
Dwight Howard,J.J. Redick,Jason Williams,Mickael Pietrus,Ryan Anderson,Kevin Love,Nathan Jawai,Ramon Sessions,Ryan Gomes,Wayne Ellington,2,10:48,MIN,shot,,,,,,,,,,Ramon Sessions,,,,missed,,jump,29,24
Dwight Howard,J.J. Redick,Jason Williams,Mickael Pietrus,Ryan Anderson,Kevin Love,Nathan Jawai,Ramon Sessions,Ryan Gomes,Wayne Ellington,2,10:47,ORL,rebound,,,,,,,,,,Jason Williams,,,,,,def,,
Dwight Howard,J.J. Redick,Jason Williams,Mickael Pietrus,Ryan Anderson,Kevin Love,Nathan Jawai,Ramon Sessions,Ryan Gomes,Wayne Ellington,2,10:40,ORL,shot,,,,,,,,,,Ryan Anderson,,,,missed,,3pt,26,32