a1,a2,a3,a4,a5,h1,h2,h3,h4,h5,period,time,team,etype,assist,away,block,entered,home,left,num,opponent,outof,player,points,possession,reason,result,steal,type,x,y
Andrew Bogut,Brandon Jennings,Carlos Delfino,Ersan Ilyasova,Michael Redd,Boris Diaw,Gerald Wallace,Nazr Mohammed,Raymond Felton,Stephen Jackson,1,12:00,OFF,jump ball,,Andrew Bogut,,,Nazr Mohammed,,,,,,,Ersan Ilyasova,,,,,,
Andrew Bogut,Brandon Jennings,Carlos Delfino,Ersan Ilyasova,Michael Redd,Boris Diaw,Gerald Wallace,Nazr Mohammed,Raymond Felton,Stephen Jackson,1,11:45,MIL,shot,,,,,,,,,,Andrew Bogut,,,,missed,,layup,25,6
Andrew Bogut,Brandon Jennings,Carlos Delfino,Ersan Ilyasova,Michael Redd,Boris Diaw,Gerald Wallace,Nazr Mohammed,Raymond Felton,Stephen Jackson,1,11:44,CHA,rebound,,,,,,,,,,Gerald Wallace,,,,,,def,,
Andrew Bogut,Brandon Jennings,Carlos Delfino,Ersan Ilyasova,Michael Redd,Boris Diaw,Gerald Wallace,Nazr Mohammed,Raymond Felton,Stephen Jackson,1,11:35,MIL,foul,,,,,,,,Gerald Wallace,,Michael Redd,,,,,,shooting,,
Andrew Bogut,Brandon Jennings,Carlos Delfino,Ersan Ilyasova,Michael Redd,Boris Diaw,Gerald Wallace,Nazr Mohammed,Raymond Felton,Stephen Jackson,1,11:35,CHA,free throw,,,,,,,1,,2,Gerald Wallace,,,foul,missed,,,,
Andrew Bogut,Brandon Jennings,Carlos Delfino,Ersan Ilyasova,Michael Redd,Boris Diaw,Gerald Wallace,Nazr Mohammed,Raymond Felton,Stephen Jackson,1,11:35,CHA,rebound,,,,,,,,,,,,,,,,,,
Andrew Bogut,Brandon Jennings,Carlos Delfino,Ersan Ilyasova,Michael Redd,Boris Diaw,Gerald Wallace,Nazr Mohammed,Raymond Felton,Stephen Jackson,1,11:35,CHA,free throw,,,,,,,2,,2,Gerald Wallace,,,foul,made,,,,
Andrew Bogut,Brandon Jennings,Carlos Delfino,Ersan Ilyasova,Michael Redd,Boris Diaw,Gerald Wallace,Nazr Mohammed,Raymond Felton,Stephen Jackson,1,11:19,MIL,shot,,,,,,,,,,Carlos Delfino,,,,missed,,jump,7,18
Andrew Bogut,Brandon Jennings,Carlos Delfino,Ersan Ilyasova,Michael Redd,Boris Diaw,Gerald Wallace,Nazr Mohammed,Raymond Felton,Stephen Jackson,1,11:18,CHA,rebound,,,,,,,,,,Gerald Wallace,,,,,,def,,
Andrew Bogut,Brandon Jennings,Carlos Delfino,Ersan Ilyasova,Michael Redd,Boris Diaw,Gerald Wallace,Nazr Mohammed,Raymond Felton,Stephen Jackson,1,11:09,CHA,shot,Boris Diaw,,,,,,,,,Raymond Felton,3,,,made,,3pt,39,27
Andrew Bogut,Brandon Jennings,Carlos Delfino,Ersan Ilyasova,Michael Redd,Boris Diaw,Gerald Wallace,Nazr Mohammed,Raymond Felton,Stephen Jackson,1,10:56,MIL,shot,Andrew Bogut,,,,,,,,,Ersan Ilyasova,3,,,made,,3pt,7,24
Andrew Bogut,Brandon Jennings,Carlos Delfino,Ersan Ilyasova,Michael Redd,Boris Diaw,Gerald Wallace,Nazr Mohammed,Raymond Felton,Stephen Jackson,1,10:33,CHA,turnover,,,,,,,,,,Nazr Mohammed,,,traveling,,,,,
Andrew Bogut,Brandon Jennings,Carlos Delfino,Ersan Ilyasova,Michael Redd,Boris Diaw,Gerald Wallace,Nazr Mohammed,Raymond Felton,Stephen Jackson,1,10:21,MIL,foul,,,,,,,,Raymond Felton,,Brandon Jennings,,,,,,offensive,,
Andrew Bogut,Brandon Jennings,Carlos Delfino,Ersan Ilyasova,Michael Redd,Boris Diaw,Gerald Wallace,Nazr Mohammed,Raymond Felton,Stephen Jackson,1,10:21,MIL,turnover,,,,,,,,,,Brandon Jennings,,,foul,,,,,
Andrew Bogut,Brandon Jennings,Carlos Delfino,Ersan Ilyasova,Michael Redd,Boris Diaw,Gerald Wallace,Nazr Mohammed,Raymond Felton,Stephen Jackson,1,10:00,CHA,shot,Boris Diaw,,,,,,,,,Raymond Felton,2,,,made,,turnaround fade away,36,8
Andrew Bogut,Brandon Jennings,Carlos Delfino,Ersan Ilyasova,Michael Redd,Boris Diaw,Gerald Wallace,Nazr Mohammed,Raymond Felton,Stephen Jackson,1,9:41,MIL,shot,,,,,,,,,,Michael Redd,,,,missed,,3pt,48,7
Andrew Bogut,Brandon Jennings,Carlos Delfino,Ersan Ilyasova,Michael Redd,Boris Diaw,Gerald Wallace,Nazr Mohammed,Raymond Felton,Stephen Jackson,1,9:39,CHA,rebound,,,,,,,,,,Gerald Wallace,,,,,,def,,
Andrew Bogut,Brandon Jennings,Carlos Delfino,Ersan Ilyasova,Michael Redd,Boris Diaw,Gerald Wallace,Nazr Mohammed,Raymond Felton,Stephen Jackson,1,9:35,CHA,shot,,,,,,,,,,Gerald Wallace,2,,,made,,layup,25,6
Andrew Bogut,Brandon Jennings,Carlos Delfino,Ersan Ilyasova,Michael Redd,Boris Diaw,Gerald Wallace,Nazr Mohammed,Raymond Felton,Stephen Jackson,1,9:12,CHA,foul,,,,,,,,Andrew Bogut,,Nazr Mohammed,,,,,,shooting,,
Andrew Bogut,Brandon Jennings,Carlos Delfino,Ersan Ilyasova,Michael Redd,Boris Diaw,Gerald Wallace,Nazr Mohammed,Raymond Felton,Stephen Jackson,1,9:12,MIL,free throw,,,,,,,1,,2,Andrew Bogut,,,foul,missed,,,,
Andrew Bogut,Brandon Jennings,Carlos Delfino,Ersan Ilyasova,Michael Redd,Boris Diaw,Gerald Wallace,Nazr Mohammed,Raymond Felton,Stephen Jackson,1,9:12,MIL,rebound,,,,,,,,,,,,,,,,,,
Andrew Bogut,Brandon Jennings,Carlos Delfino,Ersan Ilyasova,Michael Redd,Boris Diaw,Gerald Wallace,Nazr Mohammed,Raymond Felton,Stephen Jackson,1,9:12,MIL,free throw,,,,,,,2,,2,Andrew Bogut,,,foul,missed,,,,
Andrew Bogut,Brandon Jennings,Carlos Delfino,Ersan Ilyasova,Michael Redd,Boris Diaw,Gerald Wallace,Nazr Mohammed,Raymond Felton,Stephen Jackson,1,9:11,CHA,rebound,,,,,,,,,,Gerald Wallace,,,,,,def,,
Andrew Bogut,Brandon Jennings,Carlos Delfino,Ersan Ilyasova,Michael Redd,Boris Diaw,Gerald Wallace,Nazr Mohammed,Raymond Felton,Stephen Jackson,1,8:51,CHA,shot,,,Carlos Delfino,,,,,,,Stephen Jackson,,,,missed,,layup,25,6
Andrew Bogut,Brandon Jennings,Carlos Delfino,Ersan Ilyasova,Michael Redd,Boris Diaw,Gerald Wallace,Nazr Mohammed,Raymond Felton,Stephen Jackson,1,8:48,MIL,rebound,,,,,,,,,,Andrew Bogut,,,,,,def,,
Andrew Bogut,Brandon Jennings,Carlos Delfino,Ersan Ilyasova,Michael Redd,Boris Diaw,Gerald Wallace,Nazr Mohammed,Raymond Felton,Stephen Jackson,1,8:44,MIL,shot,,,,,,,,,,Michael Redd,,,,missed,,3pt,3,20
Andrew Bogut,Brandon Jennings,Carlos Delfino,Ersan Ilyasova,Michael Redd,Boris Diaw,Gerald Wallace,Nazr Mohammed,Raymond Felton,Stephen Jackson,1,8:44,CHA,rebound,,,,,,,,,,,,,,,,,,
Andrew Bogut,Brandon Jennings,Carlos Delfino,Ersan Ilyasova,Michael Redd,Boris Diaw,Gerald Wallace,Nazr Mohammed,Raymond Felton,Stephen Jackson,1,8:40,CHA,turnover,,,,,,,,,,Stephen Jackson,,,bad pass,,Michael Redd,,,
Andrew Bogut,Brandon Jennings,Carlos Delfino,Ersan Ilyasova,Michael Redd,Boris Diaw,Gerald Wallace,Nazr Mohammed,Raymond Felton,Stephen Jackson,1,8:31,MIL,shot,,,,,,,,,,Ersan Ilyasova,,,,missed,,3pt,2,7
Andrew Bogut,Brandon Jennings,Carlos Delfino,Ersan Ilyasova,Michael Redd,Boris Diaw,Gerald Wallace,Nazr Mohammed,Raymond Felton,Stephen Jackson,1,8:30,MIL,rebound,,,,,,,,,,Andrew Bogut,,,,,,off,,
Andrew Bogut,Brandon Jennings,Carlos Delfino,Ersan Ilyasova,Michael Redd,Boris Diaw,Gerald Wallace,Nazr Mohammed,Raymond Felton,Stephen Jackson,1,8:22,MIL,shot,,,,,,,,,,Andrew Bogut,,,,missed,,jump,27,11
Andrew Bogut,Brandon Jennings,Carlos Delfino,Ersan Ilyasova,Michael Redd,Boris Diaw,Gerald Wallace,Nazr Mohammed,Raymond Felton,Stephen Jackson,1,8:22,CHA,rebound,,,,,,,,,,,,,,,,,,
Andrew Bogut,Brandon Jennings,Carlos Delfino,Ersan Ilyasova,Michael Redd,Boris Diaw,Gerald Wallace,Nazr Mohammed,Raymond Felton,Stephen Jackson,1,8:22,MIL,foul,,,,,,,,Boris Diaw,,Ersan Ilyasova,,,,,,loose ball,,
Andrew Bogut,Brandon Jennings,Carlos Delfino,Ersan Ilyasova,Michael Redd,Boris Diaw,Gerald Wallace,Nazr Mohammed,Raymond Felton,Stephen Jackson,1,8:09,CHA,shot,Stephen Jackson,,,,,,,,,Gerald Wallace,2,,,made,,jump,10,19
Andrew Bogut,Brandon Jennings,Carlos Delfino,Ersan Ilyasova,Michael Redd,Boris Diaw,Gerald Wallace,Nazr Mohammed,Raymond Felton,Stephen Jackson,1,7:52,MIL,shot,,,,,,,,,,Carlos Delfino,,,,missed,,3pt,1,13
Andrew Bogut,Brandon Jennings,Carlos Delfino,Ersan Ilyasova,Michael Redd,Boris Diaw,Gerald Wallace,Nazr Mohammed,Raymond Felton,Stephen Jackson,1,7:51,CHA,rebound,,,,,,,,,,Stephen Jackson,,,,,,def,,
Andrew Bogut,Brandon Jennings,Carlos Delfino,Ersan Ilyasova,Michael Redd,Boris Diaw,Gerald Wallace,Nazr Mohammed,Raymond Felton,Stephen Jackson,1,7:43,CHA,turnover,,,,,,,,,,Stephen Jackson,,,lost ball,,Ersan Ilyasova,,,
Andrew Bogut,Brandon Jennings,Carlos Delfino,Ersan Ilyasova,Michael Redd,Boris Diaw,Gerald Wallace,Nazr Mohammed,Raymond Felton,Stephen Jackson,1,7:37,MIL,shot,,,,,,,,,,Ersan Ilyasova,,,,missed,,layup,25,6
Andrew Bogut,Brandon Jennings,Carlos Delfino,Ersan Ilyasova,Michael Redd,Boris Diaw,Gerald Wallace,Nazr Mohammed,Raymond Felton,Stephen Jackson,1,7:36,MIL,rebound,,,,,,,,,,Carlos Delfino,,,,,,off,,
Andrew Bogut,Brandon Jennings,Carlos Delfino,Ersan Ilyasova,Michael Redd,Boris Diaw,Gerald Wallace,Nazr Mohammed,Raymond Felton,Stephen Jackson,1,7:36,MIL,shot,,,,,,,,,,Carlos Delfino,2,,,made,,tip,25,6
Andrew Bogut,Brandon Jennings,Carlos Delfino,Ersan Ilyasova,Michael Redd,Boris Diaw,Gerald Wallace,Nazr Mohammed,Raymond Felton,Stephen Jackson,1,7:12,CHA,shot,,,,,,,,,,Gerald Wallace,,,,missed,,3pt,15,29
Andrew Bogut,Brandon Jennings,Carlos Delfino,Ersan Ilyasova,Michael Redd,Boris Diaw,Gerald Wallace,Nazr Mohammed,Raymond Felton,Stephen Jackson,1,7:11,MIL,rebound,,,,,,,,,,,,,,,,,,
Andrew Bogut,Brandon Jennings,Carlos Delfino,Ersan Ilyasova,Michael Redd,Boris Diaw,Gerald Wallace,Nazr Mohammed,Raymond Felton,Stephen Jackson,1,7:00,MIL,turnover,,,,,,,,,,Brandon Jennings,,,bad pass,,,,,
Andrew Bogut,Brandon Jennings,Carlos Delfino,Ersan Ilyasova,Michael Redd,Boris Diaw,Gerald Wallace,Nazr Mohammed,Raymond Felton,Stephen Jackson,1,6:39,CHA,shot,,,,,,,,,,Nazr Mohammed,,,,missed,,jump,15,21
Andrew Bogut,Brandon Jennings,Carlos Delfino,Ersan Ilyasova,Michael Redd,Boris Diaw,Gerald Wallace,Nazr Mohammed,Raymond Felton,Stephen Jackson,1,6:37,MIL,rebound,,,,,,,,,,Ersan Ilyasova,,,,,,def,,
Andrew Bogut,Brandon Jennings,Carlos Delfino,Ersan Ilyasova,Michael Redd,Boris Diaw,Gerald Wallace,Nazr Mohammed,Raymond Felton,Stephen Jackson,1,6:34,CHA,foul,,,,,,,,Andrew Bogut,,Nazr Mohammed,,,,,,personal,,
Andrew Bogut,Brandon Jennings,Carlos Delfino,Ersan Ilyasova,Michael Redd,Boris Diaw,DeSagana Diop,Gerald Wallace,Raymond Felton,Stephen Jackson,1,6:34,CHA,sub,,,,DeSagana Diop,,Nazr Mohammed,,,,,,,,,,,,
Andrew Bogut,Brandon Jennings,Carlos Delfino,Ersan Ilyasova,Michael Redd,Boris Diaw,DeSagana Diop,Gerald Wallace,Raymond Felton,Stephen Jackson,1,6:22,MIL,shot,,,,,,,,,,Ersan Ilyasova,,,,missed,,jump,10,19
Andrew Bogut,Brandon Jennings,Carlos Delfino,Ersan Ilyasova,Michael Redd,Boris Diaw,DeSagana Diop,Gerald Wallace,Raymond Felton,Stephen Jackson,1,6:21,CHA,rebound,,,,,,,,,,Gerald Wallace,,,,,,def,,
Andrew Bogut,Brandon Jennings,Carlos Delfino,Ersan Ilyasova,Michael Redd,Boris Diaw,DeSagana Diop,Gerald Wallace,Raymond Felton,Stephen Jackson,1,6:08,CHA,shot,,,,,,,,,,Stephen Jackson,,,,missed,,jump,24,22
Andrew Bogut,Brandon Jennings,Carlos Delfino,Ersan Ilyasova,Michael Redd,Boris Diaw,DeSagana Diop,Gerald Wallace,Raymond Felton,Stephen Jackson,1,6:07,MIL,rebound,,,,,,,,,,Ersan Ilyasova,,,,,,def,,
Andrew Bogut,Brandon Jennings,Carlos Delfino,Ersan Ilyasova,Michael Redd,Boris Diaw,DeSagana Diop,Gerald Wallace,Raymond Felton,Stephen Jackson,1,5:58,MIL,shot,,,,,,,,,,Brandon Jennings,2,,,made,,driving reverse layup,25,6
Andrew Bogut,Brandon Jennings,Carlos Delfino,Ersan Ilyasova,Michael Redd,Boris Diaw,DeSagana Diop,Gerald Wallace,Raymond Felton,Stephen Jackson,1,5:43,CHA,foul,,,,,,,,Andrew Bogut,,Gerald Wallace,,,,,,offensive,,
Andrew Bogut,Brandon Jennings,Carlos Delfino,Ersan Ilyasova,Michael Redd,Boris Diaw,DeSagana Diop,Gerald Wallace,Raymond Felton,Stephen Jackson,1,5:43,CHA,turnover,,,,,,,,,,Gerald Wallace,,,foul,,,,,
Andrew Bogut,Brandon Jennings,Carlos Delfino,Ersan Ilyasova,Michael Redd,Boris Diaw,DeSagana Diop,Gerald Wallace,Raymond Felton,Stephen Jackson,1,5:43,CHA,timeout,,,,,,,,,,,,,,,,regular,,
Andrew Bogut,Brandon Jennings,Carlos Delfino,Ersan Ilyasova,Michael Redd,Boris Diaw,DeSagana Diop,Gerald Wallace,Raymond Felton,Stephen Jackson,1,5:31,MIL,shot,,,Stephen Jackson,,,,,,,Andrew Bogut,,,,missed,,layup,25,6
Andrew Bogut,Brandon Jennings,Carlos Delfino,Ersan Ilyasova,Michael Redd,Boris Diaw,DeSagana Diop,Gerald Wallace,Raymond Felton,Stephen Jackson,1,5:26,MIL,rebound,,,,,,,,,,Carlos Delfino,,,,,,off,,
Andrew Bogut,Brandon Jennings,Carlos Delfino,Ersan Ilyasova,Michael Redd,Boris Diaw,DeSagana Diop,Gerald Wallace,Raymond Felton,Stephen Jackson,1,5:24,MIL,shot,Carlos Delfino,,,,,,,,,Brandon Jennings,2,,,made,,jump,38,18
Andrew Bogut,Brandon Jennings,Carlos Delfino,Ersan Ilyasova,Michael Redd,Boris Diaw,DeSagana Diop,Gerald Wallace,Raymond Felton,Stephen Jackson,1,5:07,CHA,shot,,,,,,,,,,Gerald Wallace,2,,,made,,jump bank,40,17
Andrew Bogut,Brandon Jennings,Carlos Delfino,Ersan Ilyasova,Michael Redd,Boris Diaw,DeSagana Diop,Gerald Wallace,Raymond Felton,Stephen Jackson,1,4:56,MIL,shot,,,,,,,,,,Brandon Jennings,3,,,made,,3pt,17,31
Andrew Bogut,Brandon Jennings,Carlos Delfino,Ersan Ilyasova,Michael Redd,Boris Diaw,DeSagana Diop,Gerald Wallace,Raymond Felton,Stephen Jackson,1,4:39,CHA,turnover,,,,,,,,,,Boris Diaw,,,bad pass,,Michael Redd,,,
Andrew Bogut,Brandon Jennings,Carlos Delfino,Ersan Ilyasova,Michael Redd,Boris Diaw,DeSagana Diop,Gerald Wallace,Raymond Felton,Stephen Jackson,1,4:34,MIL,foul,,,,,,,,Gerald Wallace,,Carlos Delfino,,,,,,offensive,,
Andrew Bogut,Brandon Jennings,Carlos Delfino,Ersan Ilyasova,Michael Redd,Boris Diaw,DeSagana Diop,Gerald Wallace,Raymond Felton,Stephen Jackson,1,4:34,MIL,turnover,,,,,,,,,,Carlos Delfino,,,foul,,,,,
Andrew Bogut,Brandon Jennings,Carlos Delfino,Ersan Ilyasova,Jodie Meeks,Boris Diaw,DeSagana Diop,Gerald Wallace,Raymond Felton,Stephen Jackson,1,4:34,MIL,sub,,,,Jodie Meeks,,Michael Redd,,,,,,,,,,,,
Andrew Bogut,Brandon Jennings,Carlos Delfino,Ersan Ilyasova,Jodie Meeks,Boris Diaw,DeSagana Diop,Gerald Wallace,Raymond Felton,Stephen Jackson,1,4:20,CHA,shot,,,,,,,,,,Stephen Jackson,,,,missed,,jump,29,14
Andrew Bogut,Brandon Jennings,Carlos Delfino,Ersan Ilyasova,Jodie Meeks,Boris Diaw,DeSagana Diop,Gerald Wallace,Raymond Felton,Stephen Jackson,1,4:19,MIL,rebound,,,,,,,,,,Jodie Meeks,,,,,,def,,
Andrew Bogut,Brandon Jennings,Carlos Delfino,Ersan Ilyasova,Jodie Meeks,Boris Diaw,DeSagana Diop,Gerald Wallace,Raymond Felton,Stephen Jackson,1,4:15,MIL,shot,Brandon Jennings,,,,,,,,,Ersan Ilyasova,2,,,made,,layup,25,6
Andrew Bogut,Brandon Jennings,Carlos Delfino,Ersan Ilyasova,Jodie Meeks,Boris Diaw,DeSagana Diop,Gerald Wallace,Raymond Felton,Stephen Jackson,1,3:54,CHA,shot,,,,,,,,,,DeSagana Diop,,,,missed,,layup,25,6
Andrew Bogut,Brandon Jennings,Carlos Delfino,Ersan Ilyasova,Jodie Meeks,Boris Diaw,DeSagana Diop,Gerald Wallace,Raymond Felton,Stephen Jackson,1,3:52,CHA,rebound,,,,,,,,,,Raymond Felton,,,,,,off,,
Andrew Bogut,Brandon Jennings,Carlos Delfino,Ersan Ilyasova,Jodie Meeks,Boris Diaw,DeSagana Diop,Gerald Wallace,Raymond Felton,Stephen Jackson,1,3:52,CHA,shot,,,,,,,,,,Raymond Felton,2,,,made,,tip,25,6
Andrew Bogut,Brandon Jennings,Carlos Delfino,Ersan Ilyasova,Jodie Meeks,Boris Diaw,DeSagana Diop,Gerald Wallace,Raymond Felton,Stephen Jackson,1,3:45,MIL,shot,,,,,,,,,,Jodie Meeks,,,,missed,,jump,41,12
Andrew Bogut,Brandon Jennings,Carlos Delfino,Ersan Ilyasova,Jodie Meeks,Boris Diaw,DeSagana Diop,Gerald Wallace,Raymond Felton,Stephen Jackson,1,3:42,MIL,rebound,,,,,,,,,,Ersan Ilyasova,,,,,,off,,
Andrew Bogut,Brandon Jennings,Carlos Delfino,Ersan Ilyasova,Jodie Meeks,Boris Diaw,DeSagana Diop,Gerald Wallace,Raymond Felton,Stephen Jackson,1,3:42,MIL,turnover,,,,,,,,,,Ersan Ilyasova,,,out of bounds lost ball turnover,,,,,
Andrew Bogut,Brandon Jennings,Carlos Delfino,Ersan Ilyasova,Jodie Meeks,Boris Diaw,DeSagana Diop,Gerald Wallace,Raymond Felton,Stephen Jackson,1,3:25,CHA,shot,Boris Diaw,,,,,,,,,Gerald Wallace,2,,,made,,jump,16,23
Andrew Bogut,Brandon Jennings,Carlos Delfino,Ersan Ilyasova,Jodie Meeks,Boris Diaw,DeSagana Diop,Gerald Wallace,Raymond Felton,Stephen Jackson,1,3:09,MIL,shot,,,,,,,,,,Ersan Ilyasova,,,,missed,,3pt,5,23
Andrew Bogut,Brandon Jennings,Carlos Delfino,Ersan Ilyasova,Jodie Meeks,Boris Diaw,DeSagana Diop,Gerald Wallace,Raymond Felton,Stephen Jackson,1,3:07,MIL,rebound,,,,,,,,,,Carlos Delfino,,,,,,off,,
Andrew Bogut,Brandon Jennings,Charlie Bell,Ersan Ilyasova,Jodie Meeks,Boris Diaw,DeSagana Diop,Gerald Wallace,Raymond Felton,Stephen Jackson,1,3:06,MIL,sub,,,,Charlie Bell,,Carlos Delfino,,,,,,,,,,,,
Andrew Bogut,Brandon Jennings,Charlie Bell,Hakim Warrick,Jodie Meeks,Boris Diaw,DeSagana Diop,Gerald Wallace,Raymond Felton,Stephen Jackson,1,3:06,MIL,sub,,,,Hakim Warrick,,Ersan Ilyasova,,,,,,,,,,,,
Andrew Bogut,Brandon Jennings,Charlie Bell,Hakim Warrick,Jodie Meeks,Boris Diaw,DeSagana Diop,Gerald Wallace,Raymond Felton,Stephen Jackson,1,3:00,MIL,shot,,,,,,,,,,Hakim Warrick,,,,missed,,jump,11,20
Andrew Bogut,Brandon Jennings,Charlie Bell,Hakim Warrick,Jodie Meeks,Boris Diaw,DeSagana Diop,Gerald Wallace,Raymond Felton,Stephen Jackson,1,2:59,CHA,rebound,,,,,,,,,,DeSagana Diop,,,,,,def,,
Andrew Bogut,Brandon Jennings,Charlie Bell,Hakim Warrick,Jodie Meeks,Boris Diaw,DeSagana Diop,Gerald Wallace,Raymond Felton,Stephen Jackson,1,2:47,CHA,shot,,,,,,,,,,Stephen Jackson,,,,missed,,3pt,8,26
Andrew Bogut,Brandon Jennings,Charlie Bell,Hakim Warrick,Jodie Meeks,Boris Diaw,DeSagana Diop,Gerald Wallace,Raymond Felton,Stephen Jackson,1,2:47,CHA,rebound,,,,,,,,,,,,,,,,,,
Andrew Bogut,Brandon Jennings,Charlie Bell,Hakim Warrick,Jodie Meeks,Boris Diaw,DeSagana Diop,Gerald Wallace,Raymond Felton,Stephen Jackson,1,2:47,MIL,foul,,,,,,,,Boris Diaw,,Hakim Warrick,,,,,,loose ball,,
Andrew Bogut,Brandon Jennings,Charlie Bell,Hakim Warrick,Jodie Meeks,Boris Diaw,DeSagana Diop,Gerald Wallace,Raymond Felton,Stephen Jackson,1,2:47,MIL,timeout,,,,,,,,,,,,,,,,regular,,
Andrew Bogut,Brandon Jennings,Charlie Bell,Hakim Warrick,Jodie Meeks,Boris Diaw,DeSagana Diop,Gerald Wallace,Raymond Felton,Stephen Jackson,1,2:36,CHA,shot,,,,,,,,,,Boris Diaw,,,,missed,,jump,9,13
Andrew Bogut,Brandon Jennings,Charlie Bell,Hakim Warrick,Jodie Meeks,Boris Diaw,DeSagana Diop,Gerald Wallace,Raymond Felton,Stephen Jackson,1,2:34,CHA,rebound,,,,,,,,,,DeSagana Diop,,,,,,off,,
Andrew Bogut,Brandon Jennings,Charlie Bell,Hakim Warrick,Jodie Meeks,Boris Diaw,DeSagana Diop,Gerald Wallace,Raymond Felton,Stephen Jackson,1,2:26,CHA,turnover,,,,,,,,,,Stephen Jackson,,,traveling,,,,,
Andrew Bogut,Brandon Jennings,Charlie Bell,Hakim Warrick,Jodie Meeks,Boris Diaw,DeSagana Diop,Gerald Wallace,Raymond Felton,Stephen Jackson,1,2:12,MIL,shot,,,,,,,,,,Hakim Warrick,2,,,made,,jump,23,12
Andrew Bogut,Brandon Jennings,Charlie Bell,Hakim Warrick,Jodie Meeks,Boris Diaw,DeSagana Diop,Gerald Wallace,Raymond Felton,Stephen Jackson,1,1:57,CHA,shot,,,,,,,,,,Boris Diaw,,,,missed,,jump,20,26
Andrew Bogut,Brandon Jennings,Charlie Bell,Hakim Warrick,Jodie Meeks,Boris Diaw,DeSagana Diop,Gerald Wallace,Raymond Felton,Stephen Jackson,1,1:56,MIL,rebound,,,,,,,,,,Andrew Bogut,,,,,,def,,
Andrew Bogut,Brandon Jennings,Charlie Bell,Hakim Warrick,Jodie Meeks,Boris Diaw,DeSagana Diop,Gerald Wallace,Raymond Felton,Stephen Jackson,1,1:35,MIL,shot,,,,,,,,,,Hakim Warrick,2,,,made,,turnaround fade away,39,12
Andrew Bogut,Brandon Jennings,Charlie Bell,Hakim Warrick,Jodie Meeks,Boris Diaw,DeSagana Diop,Gerald Wallace,Raymond Felton,Stephen Jackson,1,1:22,CHA,shot,Stephen Jackson,,,,,,,,,DeSagana Diop,2,,,made,,reverse layup,25,6
Andrew Bogut,Brandon Jennings,Charlie Bell,Hakim Warrick,Jodie Meeks,Boris Diaw,DeSagana Diop,Gerald Wallace,Raymond Felton,Stephen Jackson,1,1:14,MIL,turnover,,,,,,,,,,Brandon Jennings,,,out of bounds lost ball turnover,,,,,
Andrew Bogut,Brandon Jennings,Charlie Bell,Hakim Warrick,Jodie Meeks,Boris Diaw,D.J. Augustin,DeSagana Diop,Gerald Wallace,Stephen Jackson,1,1:14,CHA,sub,,,,D.J. Augustin,,Raymond Felton,,,,,,,,,,,,
Andrew Bogut,Brandon Jennings,Charlie Bell,Hakim Warrick,Jodie Meeks,Boris Diaw,D.J. Augustin,DeSagana Diop,Gerald Wallace,Stephen Jackson,1,1:03,CHA,shot,,,,,,,,,,Stephen Jackson,,,,missed,,alley oop layup,25,6
Andrew Bogut,Brandon Jennings,Charlie Bell,Hakim Warrick,Jodie Meeks,Boris Diaw,D.J. Augustin,DeSagana Diop,Gerald Wallace,Stephen Jackson,1,1:01,CHA,rebound,,,,,,,,,,Stephen Jackson,,,,,,off,,
Andrew Bogut,Brandon Jennings,Charlie Bell,Hakim Warrick,Jodie Meeks,Boris Diaw,D.J. Augustin,DeSagana Diop,Gerald Wallace,Stephen Jackson,1,1:01,CHA,shot,,,,,,,,,,Stephen Jackson,,,,missed,,putback layup,25,6
Andrew Bogut,Brandon Jennings,Charlie Bell,Hakim Warrick,Jodie Meeks,Boris Diaw,D.J. Augustin,DeSagana Diop,Gerald Wallace,Stephen Jackson,1,0:57,MIL,rebound,,,,,,,,,,Jodie Meeks,,,,,,def,,
Andrew Bogut,Brandon Jennings,Charlie Bell,Hakim Warrick,Jodie Meeks,Boris Diaw,D.J. Augustin,DeSagana Diop,Gerald Wallace,Stephen Jackson,1,0:57,CHA,foul,,,,,,,,Jodie Meeks,,Boris Diaw,,,,,,shooting,,
Brandon Jennings,Charlie Bell,Hakim Warrick,Jodie Meeks,Kurt Thomas,Boris Diaw,D.J. Augustin,DeSagana Diop,Gerald Wallace,Stephen Jackson,1,0:57,MIL,sub,,,,Kurt Thomas,,Andrew Bogut,,,,,,,,,,,,
Brandon Jennings,Charlie Bell,Hakim Warrick,Jodie Meeks,Kurt Thomas,Boris Diaw,D.J. Augustin,Gerald Wallace,Ronald Murray,Stephen Jackson,1,0:57,CHA,sub,,,,Ronald Murray,,DeSagana Diop,,,,,,,,,,,,
Brandon Jennings,Charlie Bell,Hakim Warrick,Jodie Meeks,Kurt Thomas,Boris Diaw,D.J. Augustin,Gerald Wallace,Ronald Murray,Stephen Jackson,1,0:57,MIL,free throw,,,,,,,1,,2,Jodie Meeks,,,foul,made,,,,
Charlie Bell,Hakim Warrick,Jodie Meeks,Kurt Thomas,Luke Ridnour,Boris Diaw,D.J. Augustin,Gerald Wallace,Ronald Murray,Stephen Jackson,1,0:57,MIL,sub,,,,Luke Ridnour,,Brandon Jennings,,,,,,,,,,,,
Charlie Bell,Hakim Warrick,Jodie Meeks,Kurt Thomas,Luke Ridnour,Boris Diaw,D.J. Augustin,Gerald Wallace,Ronald Murray,Stephen Jackson,1,0:57,MIL,free throw,,,,,,,2,,2,Jodie Meeks,,,foul,made,,,,
Charlie Bell,Hakim Warrick,Jodie Meeks,Kurt Thomas,Luke Ridnour,Boris Diaw,D.J. Augustin,Gerald Wallace,Ronald Murray,Stephen Jackson,1,0:43,CHA,shot,,,,,,,,,,Stephen Jackson,2,,,made,,layup,25,6
Charlie Bell,Hakim Warrick,Jodie Meeks,Kurt Thomas,Luke Ridnour,Boris Diaw,D.J. Augustin,Gerald Wallace,Ronald Murray,Stephen Jackson,1,0:40,CHA,violation,,,,,,,,,,,,,,,,delay of game,,
Charlie Bell,Hakim Warrick,Jodie Meeks,Kurt Thomas,Luke Ridnour,Boris Diaw,D.J. Augustin,Gerald Wallace,Ronald Murray,Stephen Jackson,1,0:32,MIL,shot,,,,,,,,,,Charlie Bell,,,,missed,,layup,25,6
Charlie Bell,Hakim Warrick,Jodie Meeks,Kurt Thomas,Luke Ridnour,Boris Diaw,D.J. Augustin,Gerald Wallace,Ronald Murray,Stephen Jackson,1,0:31,CHA,rebound,,,,,,,,,,Gerald Wallace,,,,,,def,,
Charlie Bell,Hakim Warrick,Jodie Meeks,Kurt Thomas,Luke Ridnour,Boris Diaw,D.J. Augustin,Gerald Wallace,Ronald Murray,Stephen Jackson,1,0:17,CHA,shot,,,,,,,,,,Gerald Wallace,,,,missed,,layup,25,6
Charlie Bell,Hakim Warrick,Jodie Meeks,Kurt Thomas,Luke Ridnour,Boris Diaw,D.J. Augustin,Gerald Wallace,Ronald Murray,Stephen Jackson,1,0:15,CHA,rebound,,,,,,,,,,Boris Diaw,,,,,,off,,
Charlie Bell,Hakim Warrick,Jodie Meeks,Kurt Thomas,Luke Ridnour,Boris Diaw,D.J. Augustin,Gerald Wallace,Ronald Murray,Stephen Jackson,1,0:01,CHA,shot,Gerald Wallace,,,,,,,,,D.J. Augustin,3,,,made,,3pt,4,21
Charlie Bell,Hakim Warrick,Jodie Meeks,Kurt Thomas,Luke Ridnour,Boris Diaw,D.J. Augustin,Gerald Wallace,Ronald Murray,Stephen Jackson,1,0:00,MIL,shot,,,,,,,,,,Charlie Bell,,,,missed,,3pt,38,54
Charlie Bell,Hakim Warrick,Jodie Meeks,Kurt Thomas,Luke Ridnour,Boris Diaw,D.J. Augustin,Gerald Wallace,Ronald Murray,Stephen Jackson,1,0:00,MIL,rebound,,,,,,,,,,,,,,,,,,
Charlie Bell,Hakim Warrick,Jodie Meeks,Luc Richard Mbah a Moute,Luke Ridnour,Boris Diaw,D.J. Augustin,Gerald Wallace,Ronald Murray,Stephen Graham,2,12:00,MIL,sub,,,,Luc Richard Mbah a Moute,,Kurt Thomas,,,,,,,,,,,,
Charlie Bell,Hakim Warrick,Jodie Meeks,Luc Richard Mbah a Moute,Luke Ridnour,Boris Diaw,D.J. Augustin,Gerald Wallace,Ronald Murray,Stephen Graham,2,11:41,CHA,turnover,,,,,,,,,,Ronald Murray,,,bad pass,,Luc Richard Mbah a Moute,,,
Charlie Bell,Hakim Warrick,Jodie Meeks,Luc Richard Mbah a Moute,Luke Ridnour,Boris Diaw,D.J. Augustin,Gerald Wallace,Ronald Murray,Stephen Graham,2,11:39,MIL,turnover,,,,,,,,,,Luke Ridnour,,,bad pass,,,,,
Charlie Bell,Hakim Warrick,Jodie Meeks,Luc Richard Mbah a Moute,Luke Ridnour,Boris Diaw,D.J. Augustin,Gerald Wallace,Ronald Murray,Stephen Graham,2,11:31,MIL,violation,,,,,,,,,,Luke Ridnour,,,,,,kicked ball,,