a1,a2,a3,a4,a5,h1,h2,h3,h4,h5,period,time,team,etype,assist,away,block,entered,home,left,num,opponent,outof,player,points,possession,reason,result,steal,type,x,y
Donte Greene,Jason Thompson,Kenny Thomas,Omri Casspi,Tyreke Evans,Al Jefferson,Corey Brewer,Damien Wilkins,Jonny Flynn,Kevin Love,1,12:00,OFF,jump ball,,Donte Greene,,,Al Jefferson,,,,,,,Damien Wilkins,,,,,,
Donte Greene,Jason Thompson,Kenny Thomas,Omri Casspi,Tyreke Evans,Al Jefferson,Corey Brewer,Damien Wilkins,Jonny Flynn,Kevin Love,1,11:42,MIN,shot,,,Kenny Thomas,,,,,,,Damien Wilkins,,,,missed,,jump,25,13
Donte Greene,Jason Thompson,Kenny Thomas,Omri Casspi,Tyreke Evans,Al Jefferson,Corey Brewer,Damien Wilkins,Jonny Flynn,Kevin Love,1,11:41,MIN,rebound,,,,,,,,,,,,,,,,,,
Donte Greene,Jason Thompson,Kenny Thomas,Omri Casspi,Tyreke Evans,Al Jefferson,Corey Brewer,Damien Wilkins,Jonny Flynn,Kevin Love,1,11:37,MIN,turnover,,,,,,,,,,Damien Wilkins,,,traveling,,,,,
Donte Greene,Jason Thompson,Kenny Thomas,Omri Casspi,Tyreke Evans,Al Jefferson,Corey Brewer,Damien Wilkins,Jonny Flynn,Kevin Love,1,11:13,SAC,shot,,,,,,,,,,Omri Casspi,,,,missed,,3pt,11,26
Donte Greene,Jason Thompson,Kenny Thomas,Omri Casspi,Tyreke Evans,Al Jefferson,Corey Brewer,Damien Wilkins,Jonny Flynn,Kevin Love,1,11:11,MIN,rebound,,,,,,,,,,,,,,,,,,
Donte Greene,Jason Thompson,Kenny Thomas,Omri Casspi,Tyreke Evans,Al Jefferson,Corey Brewer,Damien Wilkins,Jonny Flynn,Kevin Love,1,10:50,MIN,shot,,,,,,,,,,Al Jefferson,2,,,made,,layup,25,6
Donte Greene,Jason Thompson,Kenny Thomas,Omri Casspi,Tyreke Evans,Al Jefferson,Corey Brewer,Damien Wilkins,Jonny Flynn,Kevin Love,1,10:49,MIN,violation,,,,,,,,,,,,,,,,delay of game,,
Donte Greene,Jason Thompson,Kenny Thomas,Omri Casspi,Tyreke Evans,Al Jefferson,Corey Brewer,Damien Wilkins,Jonny Flynn,Kevin Love,1,10:39,MIN,foul,,,,,,,,Tyreke Evans,,Jonny Flynn,,,,,,personal,,
Donte Greene,Jason Thompson,Kenny Thomas,Omri Casspi,Tyreke Evans,Al Jefferson,Corey Brewer,Damien Wilkins,Jonny Flynn,Kevin Love,1,10:36,SAC,shot,Donte Greene,,,,,,,,,Tyreke Evans,2,,,made,,layup,25,6
Donte Greene,Jason Thompson,Kenny Thomas,Omri Casspi,Tyreke Evans,Al Jefferson,Corey Brewer,Damien Wilkins,Jonny Flynn,Kevin Love,1,10:29,MIN,shot,,,,,,,,,,Damien Wilkins,,,,missed,,jump,45,6
Donte Greene,Jason Thompson,Kenny Thomas,Omri Casspi,Tyreke Evans,Al Jefferson,Corey Brewer,Damien Wilkins,Jonny Flynn,Kevin Love,1,10:27,SAC,rebound,,,,,,,,,,Jason Thompson,,,,,,def,,
Donte Greene,Jason Thompson,Kenny Thomas,Omri Casspi,Tyreke Evans,Al Jefferson,Corey Brewer,Damien Wilkins,Jonny Flynn,Kevin Love,1,10:18,MIN,foul,,,,,,,,Jason Thompson,,Kevin Love,,,,,,personal,,
Donte Greene,Jason Thompson,Kenny Thomas,Omri Casspi,Tyreke Evans,Al Jefferson,Corey Brewer,Damien Wilkins,Jonny Flynn,Kevin Love,1,10:06,SAC,shot,,,,,,,,,,Donte Greene,,,,missed,,3pt,40,26
Donte Greene,Jason Thompson,Kenny Thomas,Omri Casspi,Tyreke Evans,Al Jefferson,Corey Brewer,Damien Wilkins,Jonny Flynn,Kevin Love,1,10:04,MIN,rebound,,,,,,,,,,Kevin Love,,,,,,def,,
Donte Greene,Jason Thompson,Kenny Thomas,Omri Casspi,Tyreke Evans,Al Jefferson,Corey Brewer,Damien Wilkins,Jonny Flynn,Kevin Love,1,10:01,MIN,turnover,,,,,,,,,,Kevin Love,,,bad pass,,Tyreke Evans,,,
Donte Greene,Jason Thompson,Kenny Thomas,Omri Casspi,Tyreke Evans,Al Jefferson,Corey Brewer,Damien Wilkins,Jonny Flynn,Kevin Love,1,9:58,SAC,foul,,,,,,,,Kevin Love,,Tyreke Evans,,,,,,offensive,,
Donte Greene,Jason Thompson,Kenny Thomas,Omri Casspi,Tyreke Evans,Al Jefferson,Corey Brewer,Damien Wilkins,Jonny Flynn,Kevin Love,1,9:58,SAC,turnover,,,,,,,,,,Tyreke Evans,,,foul,,,,,
Donte Greene,Jason Thompson,Kenny Thomas,Omri Casspi,Tyreke Evans,Al Jefferson,Corey Brewer,Damien Wilkins,Jonny Flynn,Kevin Love,1,9:51,MIN,shot,,,,,,,,,,Jonny Flynn,2,,,made,,pullup jump,41,8
Donte Greene,Jason Thompson,Kenny Thomas,Omri Casspi,Tyreke Evans,Al Jefferson,Corey Brewer,Damien Wilkins,Jonny Flynn,Kevin Love,1,9:37,MIN,foul,,,,,,,,Tyreke Evans,,Jonny Flynn,,,,,,shooting,,
Donte Greene,Jason Thompson,Kenny Thomas,Omri Casspi,Tyreke Evans,Al Jefferson,Corey Brewer,Damien Wilkins,Kevin Love,Ramon Sessions,1,9:37,MIN,sub,,,,Ramon Sessions,,Jonny Flynn,,,,,,,,,,,,
Donte Greene,Jason Thompson,Kenny Thomas,Omri Casspi,Tyreke Evans,Al Jefferson,Corey Brewer,Damien Wilkins,Kevin Love,Ramon Sessions,1,9:37,SAC,free throw,,,,,,,1,,2,Tyreke Evans,,,foul,made,,,,
Donte Greene,Jason Thompson,Kenny Thomas,Omri Casspi,Tyreke Evans,Al Jefferson,Corey Brewer,Damien Wilkins,Kevin Love,Ramon Sessions,1,9:37,SAC,free throw,,,,,,,2,,2,Tyreke Evans,,,foul,made,,,,
Donte Greene,Jason Thompson,Kenny Thomas,Omri Casspi,Tyreke Evans,Al Jefferson,Corey Brewer,Damien Wilkins,Kevin Love,Ramon Sessions,1,9:26,MIN,shot,,,,,,,,,,Ramon Sessions,,,,missed,,jump,25,25
Donte Greene,Jason Thompson,Kenny Thomas,Omri Casspi,Tyreke Evans,Al Jefferson,Corey Brewer,Damien Wilkins,Kevin Love,Ramon Sessions,1,9:25,SAC,rebound,,,,,,,,,,Donte Greene,,,,,,def,,
Donte Greene,Jason Thompson,Kenny Thomas,Omri Casspi,Tyreke Evans,Al Jefferson,Corey Brewer,Damien Wilkins,Kevin Love,Ramon Sessions,1,9:13,SAC,shot,,,,,,,,,,Donte Greene,,,,missed,,3pt,42,24
Donte Greene,Jason Thompson,Kenny Thomas,Omri Casspi,Tyreke Evans,Al Jefferson,Corey Brewer,Damien Wilkins,Kevin Love,Ramon Sessions,1,9:12,MIN,rebound,,,,,,,,,,Al Jefferson,,,,,,def,,
Donte Greene,Jason Thompson,Kenny Thomas,Omri Casspi,Tyreke Evans,Al Jefferson,Corey Brewer,Damien Wilkins,Kevin Love,Ramon Sessions,1,9:07,SAC,foul,,,,,,,,Corey Brewer,,Donte Greene,,,,,,shooting,,
Donte Greene,Jason Thompson,Kenny Thomas,Omri Casspi,Tyreke Evans,Al Jefferson,Corey Brewer,Damien Wilkins,Kevin Love,Ramon Sessions,1,9:07,MIN,free throw,,,,,,,1,,2,Corey Brewer,,,foul,made,,,,
Donte Greene,Jason Thompson,Kenny Thomas,Omri Casspi,Tyreke Evans,Al Jefferson,Corey Brewer,Damien Wilkins,Kevin Love,Ramon Sessions,1,9:07,MIN,free throw,,,,,,,2,,2,Corey Brewer,,,foul,missed,,,,
Donte Greene,Jason Thompson,Kenny Thomas,Omri Casspi,Tyreke Evans,Al Jefferson,Corey Brewer,Damien Wilkins,Kevin Love,Ramon Sessions,1,9:06,SAC,rebound,,,,,,,,,,Kenny Thomas,,,,,,def,,
Donte Greene,Jason Thompson,Kenny Thomas,Omri Casspi,Tyreke Evans,Al Jefferson,Corey Brewer,Damien Wilkins,Kevin Love,Ramon Sessions,1,9:04,SAC,turnover,,,,,,,,,,Kenny Thomas,,,bad pass,,Damien Wilkins,,,
Donte Greene,Jason Thompson,Kenny Thomas,Omri Casspi,Tyreke Evans,Al Jefferson,Corey Brewer,Damien Wilkins,Kevin Love,Ramon Sessions,1,8:47,MIN,shot,,,,,,,,,,Al Jefferson,,,,missed,,jump,31,15
Donte Greene,Jason Thompson,Kenny Thomas,Omri Casspi,Tyreke Evans,Al Jefferson,Corey Brewer,Damien Wilkins,Kevin Love,Ramon Sessions,1,8:46,SAC,rebound,,,,,,,,,,Donte Greene,,,,,,def,,
Donte Greene,Jason Thompson,Kenny Thomas,Omri Casspi,Tyreke Evans,Al Jefferson,Corey Brewer,Damien Wilkins,Kevin Love,Ramon Sessions,1,8:39,SAC,shot,,,,,,,,,,Tyreke Evans,,,,missed,,3pt,31,31
Donte Greene,Jason Thompson,Kenny Thomas,Omri Casspi,Tyreke Evans,Al Jefferson,Corey Brewer,Damien Wilkins,Kevin Love,Ramon Sessions,1,8:38,MIN,rebound,,,,,,,,,,Kevin Love,,,,,,def,,
Donte Greene,Jason Thompson,Kenny Thomas,Omri Casspi,Tyreke Evans,Al Jefferson,Corey Brewer,Damien Wilkins,Kevin Love,Ramon Sessions,1,8:32,MIN,shot,Ramon Sessions,,,,,,,,,Corey Brewer,2,,,made,,reverse layup,25,6
Donte Greene,Jason Thompson,Kenny Thomas,Omri Casspi,Tyreke Evans,Al Jefferson,Corey Brewer,Damien Wilkins,Kevin Love,Ramon Sessions,1,8:09,SAC,shot,,,,,,,,,,Tyreke Evans,,,,missed,,jump,35,9
Donte Greene,Jason Thompson,Kenny Thomas,Omri Casspi,Tyreke Evans,Al Jefferson,Corey Brewer,Damien Wilkins,Kevin Love,Ramon Sessions,1,8:08,MIN,rebound,,,,,,,,,,Al Jefferson,,,,,,def,,
Donte Greene,Jason Thompson,Kenny Thomas,Omri Casspi,Tyreke Evans,Al Jefferson,Corey Brewer,Damien Wilkins,Kevin Love,Ramon Sessions,1,7:52,MIN,shot,,,,,,,,,,Damien Wilkins,2,,,made,,jump,11,16
Donte Greene,Jason Thompson,Kenny Thomas,Omri Casspi,Tyreke Evans,Al Jefferson,Corey Brewer,Damien Wilkins,Kevin Love,Ramon Sessions,1,7:33,MIN,foul,,,,,,,,Omri Casspi,,Corey Brewer,,,,,,shooting,,
Donte Greene,Jason Thompson,Kenny Thomas,Omri Casspi,Tyreke Evans,Al Jefferson,Corey Brewer,Damien Wilkins,Kevin Love,Ramon Sessions,1,7:33,SAC,free throw,,,,,,,1,,2,Omri Casspi,,,foul,made,,,,
Donte Greene,Jason Thompson,Kenny Thomas,Omri Casspi,Tyreke Evans,Al Jefferson,Corey Brewer,Damien Wilkins,Kevin Love,Ramon Sessions,1,7:33,SAC,free throw,,,,,,,2,,2,Omri Casspi,,,foul,made,,,,
Donte Greene,Jason Thompson,Kenny Thomas,Omri Casspi,Tyreke Evans,Al Jefferson,Corey Brewer,Damien Wilkins,Kevin Love,Ramon Sessions,1,7:17,MIN,shot,,,,,,,,,,Corey Brewer,,,,missed,,layup,25,6
Donte Greene,Jason Thompson,Kenny Thomas,Omri Casspi,Tyreke Evans,Al Jefferson,Corey Brewer,Damien Wilkins,Kevin Love,Ramon Sessions,1,7:15,MIN,rebound,,,,,,,,,,Kevin Love,,,,,,off,,
Donte Greene,Jason Thompson,Kenny Thomas,Omri Casspi,Tyreke Evans,Al Jefferson,Corey Brewer,Damien Wilkins,Kevin Love,Ramon Sessions,1,7:14,MIN,shot,,,,,,,,,,Kevin Love,2,,,made,,layup,25,6
Donte Greene,Jason Thompson,Kenny Thomas,Omri Casspi,Tyreke Evans,Al Jefferson,Corey Brewer,Damien Wilkins,Kevin Love,Ramon Sessions,1,7:03,SAC,shot,,,,,,,,,,Jason Thompson,,,,missed,,jump,29,14
Donte Greene,Jason Thompson,Kenny Thomas,Omri Casspi,Tyreke Evans,Al Jefferson,Corey Brewer,Damien Wilkins,Kevin Love,Ramon Sessions,1,7:01,SAC,rebound,,,,,,,,,,Kenny Thomas,,,,,,off,,
Donte Greene,Jason Thompson,Kenny Thomas,Omri Casspi,Tyreke Evans,Al Jefferson,Corey Brewer,Damien Wilkins,Kevin Love,Ramon Sessions,1,6:52,SAC,turnover,,,,,,,,,,Omri Casspi,,,traveling,,,,,
Donte Greene,Jason Thompson,Kenny Thomas,Omri Casspi,Tyreke Evans,Al Jefferson,Corey Brewer,Damien Wilkins,Kevin Love,Ramon Sessions,1,6:44,MIN,foul,,,,,,,,Donte Greene,,Damien Wilkins,,,,,,offensive,,
Donte Greene,Jason Thompson,Kenny Thomas,Omri Casspi,Tyreke Evans,Al Jefferson,Corey Brewer,Damien Wilkins,Kevin Love,Ramon Sessions,1,6:44,MIN,turnover,,,,,,,,,,Damien Wilkins,,,foul,,,,,
Donte Greene,Jason Thompson,Kenny Thomas,Omri Casspi,Tyreke Evans,Al Jefferson,Corey Brewer,Damien Wilkins,Kevin Love,Ramon Sessions,1,6:28,SAC,shot,Donte Greene,,,,,,,,,Tyreke Evans,2,,,made,,layup,25,6
Donte Greene,Jason Thompson,Kenny Thomas,Omri Casspi,Tyreke Evans,Al Jefferson,Corey Brewer,Damien Wilkins,Kevin Love,Ramon Sessions,1,6:16,SAC,foul,,,,,,,,Al Jefferson,,Kenny Thomas,,,,,,shooting,,
Donte Greene,Jason Thompson,Kenny Thomas,Omri Casspi,Tyreke Evans,Al Jefferson,Corey Brewer,Damien Wilkins,Kevin Love,Ramon Sessions,1,6:16,MIN,free throw,,,,,,,1,,2,Al Jefferson,,,foul,made,,,,
Donte Greene,Jason Thompson,Kenny Thomas,Omri Casspi,Tyreke Evans,Al Jefferson,Corey Brewer,Damien Wilkins,Ramon Sessions,Ryan Hollins,1,6:16,MIN,sub,,,,Ryan Hollins,,Kevin Love,,,,,,,,,,,,
Donte Greene,Jason Thompson,Kenny Thomas,Omri Casspi,Tyreke Evans,Al Jefferson,Corey Brewer,Damien Wilkins,Ramon Sessions,Ryan Hollins,1,6:16,MIN,free throw,,,,,,,2,,2,Al Jefferson,,,foul,made,,,,
Donte Greene,Jason Thompson,Kenny Thomas,Omri Casspi,Tyreke Evans,Al Jefferson,Corey Brewer,Damien Wilkins,Ramon Sessions,Ryan Hollins,1,6:03,SAC,shot,,,,,,,,,,Donte Greene,,,,missed,,jump,13,19
Donte Greene,Jason Thompson,Kenny Thomas,Omri Casspi,Tyreke Evans,Al Jefferson,Corey Brewer,Damien Wilkins,Ramon Sessions,Ryan Hollins,1,6:02,MIN,rebound,,,,,,,,,,Ryan Hollins,,,,,,def,,
Donte Greene,Jason Thompson,Kenny Thomas,Omri Casspi,Tyreke Evans,Al Jefferson,Corey Brewer,Damien Wilkins,Ramon Sessions,Ryan Hollins,1,5:47,MIN,shot,,,Jason Thompson,,,,,,,Ramon Sessions,,,,missed,,layup,25,6
Donte Greene,Jason Thompson,Kenny Thomas,Omri Casspi,Tyreke Evans,Al Jefferson,Corey Brewer,Damien Wilkins,Ramon Sessions,Ryan Hollins,1,5:46,SAC,rebound,,,,,,,,,,,,,,,,,,
Donte Greene,Jason Thompson,Kenny Thomas,Omri Casspi,Tyreke Evans,Al Jefferson,Corey Brewer,Damien Wilkins,Ramon Sessions,Ryan Hollins,1,5:46,MIN,foul,,,,,,,,Donte Greene,,Ryan Hollins,,,,,,loose ball,,
Donte Greene,Jason Thompson,Kenny Thomas,Omri Casspi,Tyreke Evans,Al Jefferson,Corey Brewer,Damien Wilkins,Ramon Sessions,Ryan Hollins,1,5:46,MIN,timeout,,,,,,,,,,,,,,,,regular,,
Donte Greene,Jason Thompson,Omri Casspi,Spencer Hawes,Tyreke Evans,Al Jefferson,Corey Brewer,Damien Wilkins,Ramon Sessions,Ryan Hollins,1,5:46,SAC,sub,,,,Spencer Hawes,,Kenny Thomas,,,,,,,,,,,,
Donte Greene,Jason Thompson,Omri Casspi,Spencer Hawes,Tyreke Evans,Al Jefferson,Corey Brewer,Damien Wilkins,Ramon Sessions,Ryan Hollins,1,5:46,SAC,free throw,,,,,,,1,,2,Donte Greene,,,foul,missed,,,,
Donte Greene,Jason Thompson,Omri Casspi,Spencer Hawes,Tyreke Evans,Al Jefferson,Corey Brewer,Damien Wilkins,Ramon Sessions,Ryan Hollins,1,5:46,SAC,rebound,,,,,,,,,,,,,,,,,,
Donte Greene,Jason Thompson,Omri Casspi,Spencer Hawes,Tyreke Evans,Al Jefferson,Corey Brewer,Damien Wilkins,Ramon Sessions,Ryan Hollins,1,5:46,SAC,free throw,,,,,,,2,,2,Donte Greene,,,foul,missed,,,,
Donte Greene,Jason Thompson,Omri Casspi,Spencer Hawes,Tyreke Evans,Al Jefferson,Corey Brewer,Damien Wilkins,Ramon Sessions,Ryan Hollins,1,5:46,MIN,rebound,,,,,,,,,,Damien Wilkins,,,,,,def,,
Donte Greene,Jason Thompson,Omri Casspi,Spencer Hawes,Tyreke Evans,Al Jefferson,Corey Brewer,Damien Wilkins,Ramon Sessions,Ryan Hollins,1,5:37,SAC,violation,,,,,,,,,,Tyreke Evans,,,,,,kicked ball,,
Donte Greene,Jason Thompson,Omri Casspi,Spencer Hawes,Tyreke Evans,Al Jefferson,Corey Brewer,Ramon Sessions,Ryan Hollins,Sasha Pavlovic,1,5:37,MIN,sub,,,,Sasha Pavlovic,,Damien Wilkins,,,,,,,,,,,,
Beno Udrih,Jason Thompson,Omri Casspi,Spencer Hawes,Tyreke Evans,Al Jefferson,Corey Brewer,Ramon Sessions,Ryan Hollins,Sasha Pavlovic,1,5:37,SAC,sub,,,,Beno Udrih,,Donte Greene,,,,,,,,,,,,
Beno Udrih,Jason Thompson,Omri Casspi,Spencer Hawes,Tyreke Evans,Al Jefferson,Corey Brewer,Ramon Sessions,Ryan Hollins,Sasha Pavlovic,1,5:28,MIN,shot,,,,,,,,,,Corey Brewer,,,,missed,,driving layup,25,6
Beno Udrih,Jason Thompson,Omri Casspi,Spencer Hawes,Tyreke Evans,Al Jefferson,Corey Brewer,Ramon Sessions,Ryan Hollins,Sasha Pavlovic,1,5:27,SAC,rebound,,,,,,,,,,,,,,,,,,
Beno Udrih,Jason Thompson,Omri Casspi,Spencer Hawes,Tyreke Evans,Al Jefferson,Corey Brewer,Ramon Sessions,Ryan Hollins,Sasha Pavlovic,1,5:12,SAC,shot,,,,,,,,,,Beno Udrih,,,,missed,,3pt,12,27
Beno Udrih,Jason Thompson,Omri Casspi,Spencer Hawes,Tyreke Evans,Al Jefferson,Corey Brewer,Ramon Sessions,Ryan Hollins,Sasha Pavlovic,1,5:11,MIN,rebound,,,,,,,,,,Sasha Pavlovic,,,,,,def,,
Beno Udrih,Jason Thompson,Omri Casspi,Spencer Hawes,Tyreke Evans,Al Jefferson,Corey Brewer,Ramon Sessions,Ryan Hollins,Sasha Pavlovic,1,5:07,MIN,turnover,,,,,,,,,,Sasha Pavlovic,,,traveling,,,,,
Beno Udrih,Jason Thompson,Omri Casspi,Spencer Hawes,Tyreke Evans,Al Jefferson,Corey Brewer,Ramon Sessions,Ryan Hollins,Sasha Pavlovic,1,4:54,SAC,shot,Tyreke Evans,,,,,,,,,Jason Thompson,2,,,made,,jump,20,23
Beno Udrih,Jason Thompson,Omri Casspi,Spencer Hawes,Tyreke Evans,Al Jefferson,Corey Brewer,Ramon Sessions,Ryan Hollins,Sasha Pavlovic,1,4:38,MIN,shot,,,,,,,,,,Ryan Hollins,2,,,made,,layup,25,6
Beno Udrih,Jason Thompson,Omri Casspi,Spencer Hawes,Tyreke Evans,Al Jefferson,Corey Brewer,Ramon Sessions,Ryan Hollins,Sasha Pavlovic,1,4:15,SAC,shot,Tyreke Evans,,,,,,,,,Jason Thompson,2,,,made,,jump,25,23
Beno Udrih,Jason Thompson,Omri Casspi,Spencer Hawes,Tyreke Evans,Al Jefferson,Corey Brewer,Ramon Sessions,Ryan Hollins,Sasha Pavlovic,1,3:57,MIN,shot,,,,,,,,,,Al Jefferson,2,,,made,,layup,25,5
Beno Udrih,Jason Thompson,Omri Casspi,Spencer Hawes,Tyreke Evans,Al Jefferson,Corey Brewer,Ramon Sessions,Ryan Hollins,Sasha Pavlovic,1,3:47,MIN,foul,,,,,,,,Omri Casspi,,Corey Brewer,,,,,,personal,,
Beno Udrih,Jason Thompson,Omri Casspi,Spencer Hawes,Tyreke Evans,Corey Brewer,Nathan Jawai,Ramon Sessions,Ryan Hollins,Sasha Pavlovic,1,3:47,MIN,sub,,,,Nathan Jawai,,Al Jefferson,,,,,,,,,,,,
Beno Udrih,Jason Thompson,Omri Casspi,Spencer Hawes,Tyreke Evans,Damien Wilkins,Nathan Jawai,Ramon Sessions,Ryan Hollins,Sasha Pavlovic,1,3:47,MIN,sub,,,,Damien Wilkins,,Corey Brewer,,,,,,,,,,,,
Beno Udrih,Jason Thompson,Omri Casspi,Spencer Hawes,Tyreke Evans,Damien Wilkins,Nathan Jawai,Ramon Sessions,Ryan Hollins,Sasha Pavlovic,1,3:47,SAC,free throw,,,,,,,1,,2,Omri Casspi,,,foul,made,,,,
Beno Udrih,Jason Thompson,Omri Casspi,Spencer Hawes,Tyreke Evans,Damien Wilkins,Nathan Jawai,Ramon Sessions,Ryan Hollins,Sasha Pavlovic,1,3:47,SAC,free throw,,,,,,,2,,2,Omri Casspi,,,foul,made,,,,
Beno Udrih,Jason Thompson,Omri Casspi,Spencer Hawes,Tyreke Evans,Damien Wilkins,Nathan Jawai,Ramon Sessions,Ryan Hollins,Sasha Pavlovic,1,3:37,MIN,shot,,,,,,,,,,Ramon Sessions,,,,missed,,jump,33,20
Beno Udrih,Jason Thompson,Omri Casspi,Spencer Hawes,Tyreke Evans,Damien Wilkins,Nathan Jawai,Ramon Sessions,Ryan Hollins,Sasha Pavlovic,1,3:36,MIN,rebound,,,,,,,,,,Ryan Hollins,,,,,,off,,
Beno Udrih,Jason Thompson,Omri Casspi,Spencer Hawes,Tyreke Evans,Damien Wilkins,Nathan Jawai,Ramon Sessions,Ryan Hollins,Sasha Pavlovic,1,3:36,MIN,shot,,,,,,,,,,Ryan Hollins,2,,,made,,putback slam dunk,25,6
Beno Udrih,Jason Thompson,Omri Casspi,Spencer Hawes,Tyreke Evans,Damien Wilkins,Nathan Jawai,Ramon Sessions,Ryan Hollins,Sasha Pavlovic,1,3:17,SAC,shot,Spencer Hawes,,,,,,,,,Omri Casspi,3,,,made,,3pt,2,8
Beno Udrih,Jason Thompson,Omri Casspi,Spencer Hawes,Tyreke Evans,Damien Wilkins,Nathan Jawai,Ramon Sessions,Ryan Hollins,Sasha Pavlovic,1,3:00,MIN,shot,Ramon Sessions,,,,,,,,,Damien Wilkins,2,,,made,,fade away jumper,13,7
Beno Udrih,Jason Thompson,Omri Casspi,Spencer Hawes,Tyreke Evans,Damien Wilkins,Nathan Jawai,Ramon Sessions,Ryan Hollins,Sasha Pavlovic,1,2:49,SAC,turnover,,,,,,,,,,Tyreke Evans,,,out of bounds lost ball turnover,,,,,
Beno Udrih,Jason Thompson,Omri Casspi,Spencer Hawes,Tyreke Evans,Damien Wilkins,Nathan Jawai,Ramon Sessions,Ryan Hollins,Sasha Pavlovic,1,2:49,SAC,timeout,,,,,,,,,,,,,,,,regular,,
Beno Udrih,Jason Thompson,Omri Casspi,Sergio Rodriguez,Spencer Hawes,Damien Wilkins,Nathan Jawai,Ramon Sessions,Ryan Hollins,Sasha Pavlovic,1,2:49,SAC,sub,,,,Sergio Rodriguez,,Tyreke Evans,,,,,,,,,,,,
Beno Udrih,Jason Thompson,Omri Casspi,Sergio Rodriguez,Spencer Hawes,Damien Wilkins,Nathan Jawai,Ramon Sessions,Ryan Hollins,Sasha Pavlovic,1,2:35,MIN,shot,Ramon Sessions,,,,,,,,,Ryan Hollins,2,,,made,,layup,25,5
Beno Udrih,Jason Thompson,Omri Casspi,Sergio Rodriguez,Spencer Hawes,Damien Wilkins,Nathan Jawai,Ramon Sessions,Ryan Hollins,Sasha Pavlovic,1,2:19,SAC,shot,,,,,,,,,,Sergio Rodriguez,,,,missed,,3pt,25,32
Beno Udrih,Jason Thompson,Omri Casspi,Sergio Rodriguez,Spencer Hawes,Damien Wilkins,Nathan Jawai,Ramon Sessions,Ryan Hollins,Sasha Pavlovic,1,2:18,SAC,rebound,,,,,,,,,,Spencer Hawes,,,,,,off,,
Beno Udrih,Jason Thompson,Omri Casspi,Sergio Rodriguez,Spencer Hawes,Damien Wilkins,Nathan Jawai,Ramon Sessions,Ryan Hollins,Sasha Pavlovic,1,2:16,SAC,shot,,,,,,,,,,Spencer Hawes,,,,missed,,layup,25,6
Beno Udrih,Jason Thompson,Omri Casspi,Sergio Rodriguez,Spencer Hawes,Damien Wilkins,Nathan Jawai,Ramon Sessions,Ryan Hollins,Sasha Pavlovic,1,2:15,SAC,rebound,,,,,,,,,,Spencer Hawes,,,,,,off,,
Beno Udrih,Jason Thompson,Omri Casspi,Sergio Rodriguez,Spencer Hawes,Damien Wilkins,Nathan Jawai,Ramon Sessions,Ryan Hollins,Sasha Pavlovic,1,2:15,SAC,shot,,,,,,,,,,Spencer Hawes,2,,,made,,tip,25,6
Beno Udrih,Jason Thompson,Omri Casspi,Sergio Rodriguez,Spencer Hawes,Damien Wilkins,Nathan Jawai,Ramon Sessions,Ryan Hollins,Sasha Pavlovic,1,2:03,MIN,turnover,,,,,,,,,,Ramon Sessions,,,bad pass,,Jason Thompson,,,
Beno Udrih,Jason Thompson,Omri Casspi,Sergio Rodriguez,Spencer Hawes,Damien Wilkins,Nathan Jawai,Ramon Sessions,Ryan Hollins,Sasha Pavlovic,1,1:58,SAC,shot,Jason Thompson,,,,,,,,,Beno Udrih,2,,,made,,reverse layup,25,6
Beno Udrih,Jason Thompson,Omri Casspi,Sergio Rodriguez,Spencer Hawes,Damien Wilkins,Nathan Jawai,Ramon Sessions,Ryan Hollins,Sasha Pavlovic,1,1:41,MIN,shot,,,,,,,,,,Sasha Pavlovic,,,,missed,,jump,38,21
Beno Udrih,Jason Thompson,Omri Casspi,Sergio Rodriguez,Spencer Hawes,Damien Wilkins,Nathan Jawai,Ramon Sessions,Ryan Hollins,Sasha Pavlovic,1,1:39,SAC,rebound,,,,,,,,,,,,,,,,,,
Beno Udrih,Jason Thompson,Omri Casspi,Sergio Rodriguez,Spencer Hawes,Damien Wilkins,Nathan Jawai,Ramon Sessions,Ryan Hollins,Sasha Pavlovic,1,1:39,MIN,foul,,,,,,,,Omri Casspi,,Ryan Hollins,,,,,,loose ball,,
Beno Udrih,Jason Thompson,Omri Casspi,Sergio Rodriguez,Spencer Hawes,Nathan Jawai,Ramon Sessions,Ryan Hollins,Sasha Pavlovic,Wayne Ellington,1,1:39,MIN,sub,,,,Wayne Ellington,,Damien Wilkins,,,,,,,,,,,,
Beno Udrih,Jason Thompson,Omri Casspi,Sergio Rodriguez,Spencer Hawes,Kevin Love,Nathan Jawai,Ramon Sessions,Sasha Pavlovic,Wayne Ellington,1,1:39,MIN,sub,,,,Kevin Love,,Ryan Hollins,,,,,,,,,,,,
Beno Udrih,Jason Thompson,Omri Casspi,Sergio Rodriguez,Spencer Hawes,Kevin Love,Nathan Jawai,Ramon Sessions,Sasha Pavlovic,Wayne Ellington,1,1:39,SAC,free throw,,,,,,,1,,2,Omri Casspi,,,foul,made,,,,
Beno Udrih,Jason Thompson,Omri Casspi,Sergio Rodriguez,Spencer Hawes,Kevin Love,Nathan Jawai,Ramon Sessions,Sasha Pavlovic,Wayne Ellington,1,1:39,SAC,free throw,,,,,,,2,,2,Omri Casspi,,,foul,missed,,,,
Beno Udrih,Jason Thompson,Omri Casspi,Sergio Rodriguez,Spencer Hawes,Kevin Love,Nathan Jawai,Ramon Sessions,Sasha Pavlovic,Wayne Ellington,1,1:39,MIN,rebound,,,,,,,,,,Sasha Pavlovic,,,,,,def,,
Beno Udrih,Jason Thompson,Omri Casspi,Sergio Rodriguez,Spencer Hawes,Kevin Love,Nathan Jawai,Ramon Sessions,Sasha Pavlovic,Wayne Ellington,1,1:24,MIN,shot,,,,,,,,,,Ramon Sessions,,,,missed,,jump,15,9
Beno Udrih,Jason Thompson,Omri Casspi,Sergio Rodriguez,Spencer Hawes,Kevin Love,Nathan Jawai,Ramon Sessions,Sasha Pavlovic,Wayne Ellington,1,1:23,MIN,rebound,,,,,,,,,,Nathan Jawai,,,,,,off,,
Beno Udrih,Jason Thompson,Omri Casspi,Sergio Rodriguez,Spencer Hawes,Kevin Love,Nathan Jawai,Ramon Sessions,Sasha Pavlovic,Wayne Ellington,1,1:23,SAC,foul,,,,,,,,Nathan Jawai,,Beno Udrih,,,,,,personal,,
Beno Udrih,Jason Thompson,Omri Casspi,Sergio Rodriguez,Spencer Hawes,Kevin Love,Nathan Jawai,Ramon Sessions,Sasha Pavlovic,Wayne Ellington,1,1:14,MIN,turnover,,,,,,,,,,Ramon Sessions,,,bad pass,,,,,
Beno Udrih,Jason Thompson,Omri Casspi,Sergio Rodriguez,Spencer Hawes,Kevin Love,Nathan Jawai,Ramon Sessions,Sasha Pavlovic,Wayne Ellington,1,1:03,SAC,shot,,,,,,,,,,Jason Thompson,,,,missed,,jump,36,22
Beno Udrih,Jason Thompson,Omri Casspi,Sergio Rodriguez,Spencer Hawes,Kevin Love,Nathan Jawai,Ramon Sessions,Sasha Pavlovic,Wayne Ellington,1,1:01,MIN,rebound,,,,,,,,,,Wayne Ellington,,,,,,def,,
Beno Udrih,Jason Thompson,Omri Casspi,Sergio Rodriguez,Spencer Hawes,Kevin Love,Nathan Jawai,Ramon Sessions,Sasha Pavlovic,Wayne Ellington,1,0:55,MIN,shot,,,,,,,,,,Sasha Pavlovic,2,,,made,,step back jump,14,18
Beno Udrih,Jason Thompson,Omri Casspi,Sergio Rodriguez,Spencer Hawes,Kevin Love,Nathan Jawai,Ramon Sessions,Sasha Pavlovic,Wayne Ellington,1,0:38,SAC,shot,,,,,,,,,,Omri Casspi,,,,missed,,turnaround jump,41,8
Beno Udrih,Jason Thompson,Omri Casspi,Sergio Rodriguez,Spencer Hawes,Kevin Love,Nathan Jawai,Ramon Sessions,Sasha Pavlovic,Wayne Ellington,1,0:37,MIN,rebound,,,,,,,,,,Kevin Love,,,,,,def,,
Beno Udrih,Jason Thompson,Omri Casspi,Sergio Rodriguez,Spencer Hawes,Kevin Love,Nathan Jawai,Ramon Sessions,Sasha Pavlovic,Wayne Ellington,1,0:32,MIN,shot,,,,,,,,,,Kevin Love,2,,,made,,driving layup,25,6
Beno Udrih,Jason Thompson,Omri Casspi,Sergio Rodriguez,Spencer Hawes,Kevin Love,Nathan Jawai,Ramon Sessions,Sasha Pavlovic,Wayne Ellington,1,0:25,SAC,shot,,,,,,,,,,Sergio Rodriguez,,,,missed,,3pt,22,31
Beno Udrih,Jason Thompson,Omri Casspi,Sergio Rodriguez,Spencer Hawes,Kevin Love,Nathan Jawai,Ramon Sessions,Sasha Pavlovic,Wayne Ellington,1,0:24,MIN,rebound,,,,,,,,,,Kevin Love,,,,,,def,,
Beno Udrih,Jason Thompson,Omri Casspi,Sergio Rodriguez,Spencer Hawes,Kevin Love,Nathan Jawai,Ramon Sessions,Sasha Pavlovic,Wayne Ellington,1,0:03,MIN,shot,,,,,,,,,,Kevin Love,,,,missed,,3pt,33,29
Beno Udrih,Jason Thompson,Omri Casspi,Sergio Rodriguez,Spencer Hawes,Kevin Love,Nathan Jawai,Ramon Sessions,Sasha Pavlovic,Wayne Ellington,1,0:02,SAC,rebound,,,,,,,,,,Jason Thompson,,,,,,def,,