a1,a2,a3,a4,a5,h1,h2,h3,h4,h5,period,time,team,etype,assist,away,block,entered,home,left,num,opponent,outof,player,points,possession,reason,result,steal,type,x,y
Brandon Rush,Mike Dunleavy,Roy Hibbert,T.J. Ford,Troy Murphy,Marc Gasol,Mike Conley,O.J. Mayo,Rudy Gay,Zach Randolph,1,12:00,OFF,jump ball,,Roy Hibbert,,,Marc Gasol,,,,,,,Mike Conley,,,,,,
Brandon Rush,Mike Dunleavy,Roy Hibbert,T.J. Ford,Troy Murphy,Marc Gasol,Mike Conley,O.J. Mayo,Rudy Gay,Zach Randolph,1,11:49,MEM,shot,Marc Gasol,,,,,,,,,O.J. Mayo,2,,,made,,layup,25,6
Brandon Rush,Mike Dunleavy,Roy Hibbert,T.J. Ford,Troy Murphy,Marc Gasol,Mike Conley,O.J. Mayo,Rudy Gay,Zach Randolph,1,11:40,MEM,violation,,,,,,,,,,Rudy Gay,,,,,,defensive goaltending,,
Brandon Rush,Mike Dunleavy,Roy Hibbert,T.J. Ford,Troy Murphy,Marc Gasol,Mike Conley,O.J. Mayo,Rudy Gay,Zach Randolph,1,11:40,IND,shot,Roy Hibbert,,,,,,,,,Mike Dunleavy,2,,,made,,layup,25,6
Brandon Rush,Mike Dunleavy,Roy Hibbert,T.J. Ford,Troy Murphy,Marc Gasol,Mike Conley,O.J. Mayo,Rudy Gay,Zach Randolph,1,11:28,MEM,shot,Marc Gasol,,,,,,,,,Rudy Gay,2,,,made,,jump,11,21
Brandon Rush,Mike Dunleavy,Roy Hibbert,T.J. Ford,Troy Murphy,Marc Gasol,Mike Conley,O.J. Mayo,Rudy Gay,Zach Randolph,1,11:14,IND,shot,,,,,,,,,,T.J. Ford,,,,missed,,jump,13,9
Brandon Rush,Mike Dunleavy,Roy Hibbert,T.J. Ford,Troy Murphy,Marc Gasol,Mike Conley,O.J. Mayo,Rudy Gay,Zach Randolph,1,11:13,MEM,rebound,,,,,,,,,,Zach Randolph,,,,,,def,,
Brandon Rush,Mike Dunleavy,Roy Hibbert,T.J. Ford,Troy Murphy,Marc Gasol,Mike Conley,O.J. Mayo,Rudy Gay,Zach Randolph,1,10:58,MEM,shot,,,,,,,,,,Marc Gasol,,,,missed,,turnaround fade away,20,12
Brandon Rush,Mike Dunleavy,Roy Hibbert,T.J. Ford,Troy Murphy,Marc Gasol,Mike Conley,O.J. Mayo,Rudy Gay,Zach Randolph,1,10:55,IND,rebound,,,,,,,,,,Troy Murphy,,,,,,def,,
Brandon Rush,Mike Dunleavy,Roy Hibbert,T.J. Ford,Troy Murphy,Marc Gasol,Mike Conley,O.J. Mayo,Rudy Gay,Zach Randolph,1,10:44,IND,shot,,,,,,,,,,T.J. Ford,2,,,made,,running jump,27,12
Brandon Rush,Mike Dunleavy,Roy Hibbert,T.J. Ford,Troy Murphy,Marc Gasol,Mike Conley,O.J. Mayo,Rudy Gay,Zach Randolph,1,10:29,MEM,shot,,,,,,,,,,Rudy Gay,,,,missed,,step back jump,40,13
Brandon Rush,Mike Dunleavy,Roy Hibbert,T.J. Ford,Troy Murphy,Marc Gasol,Mike Conley,O.J. Mayo,Rudy Gay,Zach Randolph,1,10:26,MEM,rebound,,,,,,,,,,Zach Randolph,,,,,,off,,
Brandon Rush,Mike Dunleavy,Roy Hibbert,T.J. Ford,Troy Murphy,Marc Gasol,Mike Conley,O.J. Mayo,Rudy Gay,Zach Randolph,1,10:24,MEM,shot,,,,,,,,,,Zach Randolph,,,,missed,,jump,39,5
Brandon Rush,Mike Dunleavy,Roy Hibbert,T.J. Ford,Troy Murphy,Marc Gasol,Mike Conley,O.J. Mayo,Rudy Gay,Zach Randolph,1,10:22,IND,rebound,,,,,,,,,,Troy Murphy,,,,,,def,,
Brandon Rush,Mike Dunleavy,Roy Hibbert,T.J. Ford,Troy Murphy,Marc Gasol,Mike Conley,O.J. Mayo,Rudy Gay,Zach Randolph,1,10:19,MEM,foul,,,,,,,,T.J. Ford,,Mike Conley,,,,,,personal,,
Brandon Rush,Mike Dunleavy,Roy Hibbert,T.J. Ford,Troy Murphy,Marc Gasol,Mike Conley,O.J. Mayo,Rudy Gay,Zach Randolph,1,10:04,IND,shot,,,,,,,,,,T.J. Ford,,,,missed,,3pt,38,29
Brandon Rush,Mike Dunleavy,Roy Hibbert,T.J. Ford,Troy Murphy,Marc Gasol,Mike Conley,O.J. Mayo,Rudy Gay,Zach Randolph,1,10:03,MEM,rebound,,,,,,,,,,O.J. Mayo,,,,,,def,,
Brandon Rush,Mike Dunleavy,Roy Hibbert,T.J. Ford,Troy Murphy,Marc Gasol,Mike Conley,O.J. Mayo,Rudy Gay,Zach Randolph,1,10:03,IND,foul,,,,,,,,Zach Randolph,,Roy Hibbert,,,,,,loose ball,,
Brandon Rush,Mike Dunleavy,Roy Hibbert,T.J. Ford,Troy Murphy,Marc Gasol,Mike Conley,O.J. Mayo,Rudy Gay,Zach Randolph,1,9:41,MEM,shot,Zach Randolph,,,,,,,,,Mike Conley,3,,,made,,3pt,31,31
Brandon Rush,Mike Dunleavy,Roy Hibbert,T.J. Ford,Troy Murphy,Marc Gasol,Mike Conley,O.J. Mayo,Rudy Gay,Zach Randolph,1,9:27,IND,shot,,,,,,,,,,Brandon Rush,2,,,made,,jump,23,21
Brandon Rush,Mike Dunleavy,Roy Hibbert,T.J. Ford,Troy Murphy,Marc Gasol,Mike Conley,O.J. Mayo,Rudy Gay,Zach Randolph,1,9:16,IND,foul,,,,,,,,Marc Gasol,,Brandon Rush,,,,,,personal,,
Brandon Rush,Mike Dunleavy,Roy Hibbert,T.J. Ford,Troy Murphy,Marc Gasol,Mike Conley,O.J. Mayo,Rudy Gay,Zach Randolph,1,9:02,MEM,shot,,,,,,,,,,Mike Conley,2,,,made,,fade away jumper,20,19
Brandon Rush,Mike Dunleavy,Roy Hibbert,T.J. Ford,Troy Murphy,Marc Gasol,Mike Conley,O.J. Mayo,Rudy Gay,Zach Randolph,1,8:52,IND,shot,,,,,,,,,,Troy Murphy,,,,missed,,3pt,42,27
Brandon Rush,Mike Dunleavy,Roy Hibbert,T.J. Ford,Troy Murphy,Marc Gasol,Mike Conley,O.J. Mayo,Rudy Gay,Zach Randolph,1,8:50,MEM,rebound,,,,,,,,,,Marc Gasol,,,,,,def,,
Brandon Rush,Mike Dunleavy,Roy Hibbert,T.J. Ford,Troy Murphy,Marc Gasol,Mike Conley,O.J. Mayo,Rudy Gay,Zach Randolph,1,8:47,MEM,shot,,,,,,,,,,O.J. Mayo,,,,missed,,pullup jump,11,21
Brandon Rush,Mike Dunleavy,Roy Hibbert,T.J. Ford,Troy Murphy,Marc Gasol,Mike Conley,O.J. Mayo,Rudy Gay,Zach Randolph,1,8:44,MEM,rebound,,,,,,,,,,Mike Conley,,,,,,off,,
Brandon Rush,Mike Dunleavy,Roy Hibbert,T.J. Ford,Troy Murphy,Marc Gasol,Mike Conley,O.J. Mayo,Rudy Gay,Zach Randolph,1,8:42,MEM,shot,Mike Conley,,,,,,,,,Zach Randolph,2,,,made,,layup,25,6
Brandon Rush,Mike Dunleavy,Roy Hibbert,T.J. Ford,Troy Murphy,Marc Gasol,Mike Conley,O.J. Mayo,Rudy Gay,Zach Randolph,1,8:27,IND,shot,,,,,,,,,,Brandon Rush,,,,missed,,3pt,1,7
Brandon Rush,Mike Dunleavy,Roy Hibbert,T.J. Ford,Troy Murphy,Marc Gasol,Mike Conley,O.J. Mayo,Rudy Gay,Zach Randolph,1,8:25,MEM,rebound,,,,,,,,,,Marc Gasol,,,,,,def,,
Brandon Rush,Mike Dunleavy,Roy Hibbert,T.J. Ford,Troy Murphy,Marc Gasol,Mike Conley,O.J. Mayo,Rudy Gay,Zach Randolph,1,8:18,IND,foul,,,,,,,,Marc Gasol,,Mike Dunleavy,,,,,,shooting,,
Brandon Rush,Mike Dunleavy,Roy Hibbert,T.J. Ford,Troy Murphy,Marc Gasol,Mike Conley,O.J. Mayo,Rudy Gay,Zach Randolph,1,8:18,MEM,free throw,,,,,,,1,,2,Marc Gasol,,,foul,missed,,,,
Brandon Rush,Mike Dunleavy,Roy Hibbert,T.J. Ford,Troy Murphy,Marc Gasol,Mike Conley,O.J. Mayo,Rudy Gay,Zach Randolph,1,8:18,MEM,rebound,,,,,,,,,,,,,,,,,,
Brandon Rush,Mike Dunleavy,Roy Hibbert,T.J. Ford,Troy Murphy,Marc Gasol,Mike Conley,O.J. Mayo,Rudy Gay,Zach Randolph,1,8:18,MEM,free throw,,,,,,,2,,2,Marc Gasol,,,foul,made,,,,
Brandon Rush,Mike Dunleavy,Roy Hibbert,T.J. Ford,Troy Murphy,Marc Gasol,Mike Conley,O.J. Mayo,Rudy Gay,Zach Randolph,1,7:54,IND,shot,,,,,,,,,,T.J. Ford,,,,missed,,jump,10,7
Brandon Rush,Mike Dunleavy,Roy Hibbert,T.J. Ford,Troy Murphy,Marc Gasol,Mike Conley,O.J. Mayo,Rudy Gay,Zach Randolph,1,7:53,IND,rebound,,,,,,,,,,Troy Murphy,,,,,,off,,
Brandon Rush,Mike Dunleavy,Roy Hibbert,T.J. Ford,Troy Murphy,Marc Gasol,Mike Conley,O.J. Mayo,Rudy Gay,Zach Randolph,1,7:53,IND,turnover,,,,,,,,,,,,,shot clock turnover,,,,,
Brandon Rush,Mike Dunleavy,Roy Hibbert,T.J. Ford,Troy Murphy,Marc Gasol,Mike Conley,O.J. Mayo,Rudy Gay,Zach Randolph,1,7:43,MEM,shot,Marc Gasol,,,,,,,,,Zach Randolph,2,,,made,,layup,25,6
Brandon Rush,Mike Dunleavy,Roy Hibbert,T.J. Ford,Troy Murphy,Marc Gasol,Mike Conley,O.J. Mayo,Rudy Gay,Zach Randolph,1,7:29,IND,turnover,,,,,,,,,,Troy Murphy,,,bad pass,,Rudy Gay,,,
Brandon Rush,Mike Dunleavy,Roy Hibbert,T.J. Ford,Troy Murphy,Marc Gasol,Mike Conley,O.J. Mayo,Rudy Gay,Zach Randolph,1,7:26,MEM,shot,,,,,,,,,,Rudy Gay,,,,missed,,reverse layup,25,6
Brandon Rush,Mike Dunleavy,Roy Hibbert,T.J. Ford,Troy Murphy,Marc Gasol,Mike Conley,O.J. Mayo,Rudy Gay,Zach Randolph,1,7:23,IND,rebound,,,,,,,,,,Troy Murphy,,,,,,def,,
Brandon Rush,Mike Dunleavy,Roy Hibbert,T.J. Ford,Troy Murphy,Marc Gasol,Mike Conley,O.J. Mayo,Rudy Gay,Zach Randolph,1,7:21,IND,turnover,,,,,,,,,,Troy Murphy,,,lost ball,,O.J. Mayo,,,
Brandon Rush,Mike Dunleavy,Roy Hibbert,T.J. Ford,Troy Murphy,Marc Gasol,Mike Conley,O.J. Mayo,Rudy Gay,Zach Randolph,1,7:18,MEM,shot,,,,,,,,,,O.J. Mayo,3,,,made,,3pt,46,20
Brandon Rush,Mike Dunleavy,Roy Hibbert,T.J. Ford,Troy Murphy,Marc Gasol,Mike Conley,O.J. Mayo,Rudy Gay,Zach Randolph,1,7:13,IND,timeout,,,,,,,,,,,,,,,,regular,,
Brandon Rush,Mike Dunleavy,Roy Hibbert,T.J. Ford,Troy Murphy,Marc Gasol,Mike Conley,O.J. Mayo,Rudy Gay,Zach Randolph,1,7:01,IND,shot,,,,,,,,,,T.J. Ford,2,,,made,,pullup jump,13,20
Brandon Rush,Mike Dunleavy,Roy Hibbert,T.J. Ford,Troy Murphy,Marc Gasol,Mike Conley,O.J. Mayo,Rudy Gay,Zach Randolph,1,6:34,MEM,shot,,,,,,,,,,Marc Gasol,,,,missed,,turnaround fade away,31,7
Brandon Rush,Mike Dunleavy,Roy Hibbert,T.J. Ford,Troy Murphy,Marc Gasol,Mike Conley,O.J. Mayo,Rudy Gay,Zach Randolph,1,6:31,IND,rebound,,,,,,,,,,Troy Murphy,,,,,,def,,
Brandon Rush,Mike Dunleavy,Roy Hibbert,T.J. Ford,Troy Murphy,Marc Gasol,Mike Conley,O.J. Mayo,Rudy Gay,Zach Randolph,1,6:27,IND,shot,,,,,,,,,,Brandon Rush,,,,missed,,3pt,2,8
Brandon Rush,Mike Dunleavy,Roy Hibbert,T.J. Ford,Troy Murphy,Marc Gasol,Mike Conley,O.J. Mayo,Rudy Gay,Zach Randolph,1,6:24,MEM,rebound,,,,,,,,,,Marc Gasol,,,,,,def,,
Brandon Rush,Mike Dunleavy,Roy Hibbert,T.J. Ford,Troy Murphy,Marc Gasol,Mike Conley,O.J. Mayo,Rudy Gay,Zach Randolph,1,6:13,MEM,shot,Mike Conley,,,,,,,,,Rudy Gay,2,,,made,,layup,25,6
Brandon Rush,Mike Dunleavy,Roy Hibbert,T.J. Ford,Troy Murphy,Marc Gasol,Mike Conley,O.J. Mayo,Rudy Gay,Zach Randolph,1,6:13,IND,foul,,,,,,,,Rudy Gay,,Roy Hibbert,,,,,,shooting,,
Brandon Rush,Mike Dunleavy,Roy Hibbert,T.J. Ford,Troy Murphy,Marc Gasol,Mike Conley,O.J. Mayo,Rudy Gay,Zach Randolph,1,6:13,MEM,free throw,,,,,,,1,,1,Rudy Gay,,,foul,made,,,,
Brandon Rush,Mike Dunleavy,Roy Hibbert,T.J. Ford,Troy Murphy,Marc Gasol,Mike Conley,O.J. Mayo,Rudy Gay,Zach Randolph,1,5:56,IND,shot,,,,,,,,,,Roy Hibbert,2,,,made,,layup,25,6
Brandon Rush,Mike Dunleavy,Roy Hibbert,T.J. Ford,Troy Murphy,Marc Gasol,Mike Conley,O.J. Mayo,Rudy Gay,Zach Randolph,1,5:43,MEM,shot,,,,,,,,,,Marc Gasol,,,,missed,,running hook,25,10
Brandon Rush,Mike Dunleavy,Roy Hibbert,T.J. Ford,Troy Murphy,Marc Gasol,Mike Conley,O.J. Mayo,Rudy Gay,Zach Randolph,1,5:39,IND,rebound,,,,,,,,,,T.J. Ford,,,,,,def,,
Brandon Rush,Mike Dunleavy,Roy Hibbert,T.J. Ford,Troy Murphy,Marc Gasol,Mike Conley,O.J. Mayo,Rudy Gay,Zach Randolph,1,5:36,IND,shot,,,,,,,,,,Troy Murphy,,,,missed,,3pt,17,31
Brandon Rush,Mike Dunleavy,Roy Hibbert,T.J. Ford,Troy Murphy,Marc Gasol,Mike Conley,O.J. Mayo,Rudy Gay,Zach Randolph,1,5:34,MEM,rebound,,,,,,,,,,Marc Gasol,,,,,,def,,
Brandon Rush,Mike Dunleavy,Roy Hibbert,T.J. Ford,Troy Murphy,Marc Gasol,Mike Conley,O.J. Mayo,Rudy Gay,Zach Randolph,1,5:24,MEM,shot,,,,,,,,,,O.J. Mayo,,,,missed,,jump,37,22
Brandon Rush,Mike Dunleavy,Roy Hibbert,T.J. Ford,Troy Murphy,Marc Gasol,Mike Conley,O.J. Mayo,Rudy Gay,Zach Randolph,1,5:23,IND,rebound,,,,,,,,,,Troy Murphy,,,,,,def,,
Brandon Rush,Mike Dunleavy,Roy Hibbert,T.J. Ford,Troy Murphy,Marc Gasol,Mike Conley,O.J. Mayo,Rudy Gay,Zach Randolph,1,5:07,IND,shot,,,,,,,,,,Troy Murphy,2,,,made,,driving layup,25,6
Brandon Rush,Mike Dunleavy,Roy Hibbert,T.J. Ford,Troy Murphy,Marc Gasol,Mike Conley,O.J. Mayo,Rudy Gay,Zach Randolph,1,5:00,MEM,turnover,,,,,,,,,,Mike Conley,,,traveling,,,,,
Brandon Rush,Mike Dunleavy,Roy Hibbert,T.J. Ford,Troy Murphy,Marc Gasol,Mike Conley,O.J. Mayo,Rudy Gay,Zach Randolph,1,4:42,MEM,foul,,,,,,,,Roy Hibbert,,Marc Gasol,,,,,,shooting,,
Brandon Rush,Mike Dunleavy,Roy Hibbert,T.J. Ford,Troy Murphy,Marc Gasol,Mike Conley,O.J. Mayo,Rudy Gay,Zach Randolph,1,4:42,IND,free throw,,,,,,,1,,2,Roy Hibbert,,,foul,made,,,,
Brandon Rush,Dahntay Jones,Mike Dunleavy,Roy Hibbert,Troy Murphy,Marc Gasol,Mike Conley,O.J. Mayo,Rudy Gay,Zach Randolph,1,4:42,IND,sub,,,,Dahntay Jones,,T.J. Ford,,,,,,,,,,,,
Brandon Rush,Dahntay Jones,Earl Watson,Roy Hibbert,Troy Murphy,Marc Gasol,Mike Conley,O.J. Mayo,Rudy Gay,Zach Randolph,1,4:42,IND,sub,,,,Earl Watson,,Mike Dunleavy,,,,,,,,,,,,
Brandon Rush,Dahntay Jones,Earl Watson,Roy Hibbert,Troy Murphy,Marc Gasol,Mike Conley,O.J. Mayo,Rudy Gay,Zach Randolph,1,4:42,IND,free throw,,,,,,,2,,2,Roy Hibbert,,,foul,made,,,,
Brandon Rush,Dahntay Jones,Earl Watson,Roy Hibbert,Troy Murphy,Marc Gasol,Mike Conley,O.J. Mayo,Rudy Gay,Zach Randolph,1,4:28,MEM,shot,,,,,,,,,,Zach Randolph,,,,missed,,turnaround jump,28,9
Brandon Rush,Dahntay Jones,Earl Watson,Roy Hibbert,Troy Murphy,Marc Gasol,Mike Conley,O.J. Mayo,Rudy Gay,Zach Randolph,1,4:25,MEM,rebound,,,,,,,,,,Marc Gasol,,,,,,off,,
Brandon Rush,Dahntay Jones,Earl Watson,Roy Hibbert,Troy Murphy,Marc Gasol,Mike Conley,O.J. Mayo,Rudy Gay,Zach Randolph,1,4:20,MEM,shot,O.J. Mayo,,,,,,,,,Mike Conley,3,,,made,,3pt,37,28
Brandon Rush,Dahntay Jones,Earl Watson,Roy Hibbert,Tyler Hansbrough,Marc Gasol,Mike Conley,O.J. Mayo,Rudy Gay,Zach Randolph,1,4:07,IND,sub,,,,Tyler Hansbrough,,Troy Murphy,,,,,,,,,,,,
Brandon Rush,Dahntay Jones,Earl Watson,Roy Hibbert,Tyler Hansbrough,Marc Gasol,Mike Conley,O.J. Mayo,Rudy Gay,Zach Randolph,1,4:07,IND,jump ball,,Dahntay Jones,,,Rudy Gay,,,,,,,Zach Randolph,,,,,,
Brandon Rush,Dahntay Jones,Earl Watson,Roy Hibbert,Tyler Hansbrough,Marc Gasol,Mike Conley,O.J. Mayo,Rudy Gay,Zach Randolph,1,4:07,IND,turnover,,,,,,,,,,Dahntay Jones,,,lost ball,,Rudy Gay,,,
Brandon Rush,Dahntay Jones,Earl Watson,Roy Hibbert,Tyler Hansbrough,Marc Gasol,Mike Conley,O.J. Mayo,Rudy Gay,Zach Randolph,1,3:48,MEM,shot,,,,,,,,,,Rudy Gay,,,,missed,,jump,42,5
Brandon Rush,Dahntay Jones,Earl Watson,Roy Hibbert,Tyler Hansbrough,Marc Gasol,Mike Conley,O.J. Mayo,Rudy Gay,Zach Randolph,1,3:46,IND,rebound,,,,,,,,,,Earl Watson,,,,,,def,,
Brandon Rush,Dahntay Jones,Earl Watson,Roy Hibbert,Tyler Hansbrough,Marc Gasol,Mike Conley,O.J. Mayo,Rudy Gay,Zach Randolph,1,3:42,MEM,foul,,,,,,,,Brandon Rush,,Rudy Gay,,,,,,personal,,
Brandon Rush,Dahntay Jones,Earl Watson,Roy Hibbert,Tyler Hansbrough,Marc Gasol,Mike Conley,O.J. Mayo,Rudy Gay,Zach Randolph,1,3:35,IND,shot,,,,,,,,,,Tyler Hansbrough,,,,missed,,jump,27,26
Brandon Rush,Dahntay Jones,Earl Watson,Roy Hibbert,Tyler Hansbrough,Marc Gasol,Mike Conley,O.J. Mayo,Rudy Gay,Zach Randolph,1,3:31,MEM,rebound,,,,,,,,,,Marc Gasol,,,,,,def,,
Brandon Rush,Dahntay Jones,Earl Watson,Roy Hibbert,Tyler Hansbrough,Marc Gasol,Mike Conley,O.J. Mayo,Rudy Gay,Zach Randolph,1,3:22,MEM,turnover,,,,,,,,,,Mike Conley,,,bad pass,,Earl Watson,,,
Brandon Rush,Dahntay Jones,Earl Watson,Roy Hibbert,Tyler Hansbrough,Marc Gasol,Mike Conley,O.J. Mayo,Rudy Gay,Zach Randolph,1,3:16,IND,shot,,,,,,,,,,Roy Hibbert,,,,missed,,layup,25,6
Brandon Rush,Dahntay Jones,Earl Watson,Roy Hibbert,Tyler Hansbrough,Marc Gasol,Mike Conley,O.J. Mayo,Rudy Gay,Zach Randolph,1,3:13,MEM,rebound,,,,,,,,,,Mike Conley,,,,,,def,,
Brandon Rush,Dahntay Jones,Earl Watson,Roy Hibbert,Tyler Hansbrough,Marc Gasol,Mike Conley,O.J. Mayo,Rudy Gay,Zach Randolph,1,3:13,MEM,foul,,,,,,,,Roy Hibbert,,Marc Gasol,,,,,,offensive,,
Brandon Rush,Dahntay Jones,Earl Watson,Roy Hibbert,Tyler Hansbrough,Marc Gasol,Mike Conley,O.J. Mayo,Rudy Gay,Zach Randolph,1,3:13,MEM,turnover,,,,,,,,,,Marc Gasol,,,foul,,,,,
Brandon Rush,Dahntay Jones,Earl Watson,Roy Hibbert,Tyler Hansbrough,Hasheem Thabeet,Mike Conley,O.J. Mayo,Rudy Gay,Zach Randolph,1,3:13,MEM,sub,,,,Hasheem Thabeet,,Marc Gasol,,,,,,,,,,,,
Brandon Rush,Dahntay Jones,Earl Watson,Roy Hibbert,Tyler Hansbrough,Hasheem Thabeet,Mike Conley,O.J. Mayo,Rudy Gay,Zach Randolph,1,3:01,IND,shot,,,,,,,,,,Earl Watson,,,,missed,,jump bank,15,12
Brandon Rush,Dahntay Jones,Earl Watson,Roy Hibbert,Tyler Hansbrough,Hasheem Thabeet,Mike Conley,O.J. Mayo,Rudy Gay,Zach Randolph,1,2:59,MEM,rebound,,,,,,,,,,Zach Randolph,,,,,,def,,
Brandon Rush,Dahntay Jones,Earl Watson,Roy Hibbert,Tyler Hansbrough,Hasheem Thabeet,Mike Conley,O.J. Mayo,Rudy Gay,Zach Randolph,1,2:51,MEM,shot,,,,,,,,,,Zach Randolph,,,,missed,,jump,23,26
Brandon Rush,Dahntay Jones,Earl Watson,Roy Hibbert,Tyler Hansbrough,Hasheem Thabeet,Mike Conley,O.J. Mayo,Rudy Gay,Zach Randolph,1,2:50,IND,rebound,,,,,,,,,,Roy Hibbert,,,,,,def,,
Brandon Rush,Dahntay Jones,Earl Watson,Roy Hibbert,Tyler Hansbrough,Hasheem Thabeet,Mike Conley,O.J. Mayo,Rudy Gay,Zach Randolph,1,2:26,IND,shot,,,,,,,,,,Earl Watson,,,,missed,,3pt,22,31
Brandon Rush,Dahntay Jones,Earl Watson,Roy Hibbert,Tyler Hansbrough,Hasheem Thabeet,Mike Conley,O.J. Mayo,Rudy Gay,Zach Randolph,1,2:25,MEM,rebound,,,,,,,,,,Zach Randolph,,,,,,def,,
Brandon Rush,Dahntay Jones,Earl Watson,Roy Hibbert,Tyler Hansbrough,Hasheem Thabeet,Mike Conley,O.J. Mayo,Rudy Gay,Zach Randolph,1,2:10,MEM,timeout,,,,,,,,,,,,,,,,regular,,
Brandon Rush,Dahntay Jones,Earl Watson,Jeff Foster,Tyler Hansbrough,Hasheem Thabeet,Mike Conley,O.J. Mayo,Rudy Gay,Zach Randolph,1,2:10,IND,sub,,,,Jeff Foster,,Roy Hibbert,,,,,,,,,,,,
Dahntay Jones,Earl Watson,Jeff Foster,Mike Dunleavy,Tyler Hansbrough,Hasheem Thabeet,Mike Conley,O.J. Mayo,Rudy Gay,Zach Randolph,1,2:10,IND,sub,,,,Mike Dunleavy,,Brandon Rush,,,,,,,,,,,,
Dahntay Jones,Earl Watson,Jeff Foster,Mike Dunleavy,Tyler Hansbrough,Hasheem Thabeet,Mike Conley,Rudy Gay,Sam Young,Zach Randolph,1,2:10,MEM,sub,,,,Sam Young,,O.J. Mayo,,,,,,,,,,,,
Dahntay Jones,Earl Watson,Jeff Foster,Mike Dunleavy,Tyler Hansbrough,Hasheem Thabeet,Mike Conley,Rudy Gay,Sam Young,Zach Randolph,1,2:01,MEM,shot,,,Dahntay Jones,,,,,,,Zach Randolph,,,,missed,,jump,21,15
Dahntay Jones,Earl Watson,Jeff Foster,Mike Dunleavy,Tyler Hansbrough,Hasheem Thabeet,Mike Conley,Rudy Gay,Sam Young,Zach Randolph,1,2:00,IND,rebound,,,,,,,,,,Jeff Foster,,,,,,def,,
Dahntay Jones,Earl Watson,Jeff Foster,Mike Dunleavy,Tyler Hansbrough,Hasheem Thabeet,Mike Conley,Rudy Gay,Sam Young,Zach Randolph,1,1:51,IND,shot,Earl Watson,,,,,,,,,Mike Dunleavy,2,,,made,,jump,44,11
Dahntay Jones,Earl Watson,Jeff Foster,Mike Dunleavy,Tyler Hansbrough,Hasheem Thabeet,Mike Conley,Rudy Gay,Sam Young,Zach Randolph,1,1:29,MEM,shot,Sam Young,,,,,,,,,Mike Conley,3,,,made,,3pt,30,31
Dahntay Jones,Earl Watson,Jeff Foster,Mike Dunleavy,Tyler Hansbrough,Hasheem Thabeet,Mike Conley,Rudy Gay,Sam Young,Zach Randolph,1,1:17,IND,shot,Dahntay Jones,,,,,,,,,Mike Dunleavy,3,,,made,,3pt,43,24
Dahntay Jones,Earl Watson,Jeff Foster,Mike Dunleavy,Tyler Hansbrough,Hasheem Thabeet,Mike Conley,Rudy Gay,Sam Young,Zach Randolph,1,0:59,MEM,shot,,,,,,,,,,Zach Randolph,2,,,made,,jump bank,31,9
Dahntay Jones,Earl Watson,Jeff Foster,Mike Dunleavy,Tyler Hansbrough,Hasheem Thabeet,Mike Conley,Rudy Gay,Sam Young,Zach Randolph,1,0:53,IND,shot,,,,,,,,,,Mike Dunleavy,,,,missed,,3pt,48,8
Dahntay Jones,Earl Watson,Jeff Foster,Mike Dunleavy,Tyler Hansbrough,Hasheem Thabeet,Mike Conley,Rudy Gay,Sam Young,Zach Randolph,1,0:50,IND,rebound,,,,,,,,,,Mike Dunleavy,,,,,,off,,
Dahntay Jones,Earl Watson,Jeff Foster,Mike Dunleavy,Tyler Hansbrough,Hasheem Thabeet,Mike Conley,Rudy Gay,Sam Young,Zach Randolph,1,0:31,IND,shot,Earl Watson,,,,,,,,,Mike Dunleavy,2,,,made,,reverse layup,25,6
Dahntay Jones,Earl Watson,Jeff Foster,Mike Dunleavy,Tyler Hansbrough,Hasheem Thabeet,Mike Conley,Rudy Gay,Sam Young,Zach Randolph,1,0:10,MEM,shot,,,,,,,,,,Mike Conley,,,,missed,,pullup jump,12,22
Dahntay Jones,Earl Watson,Jeff Foster,Mike Dunleavy,Tyler Hansbrough,Hasheem Thabeet,Mike Conley,Rudy Gay,Sam Young,Zach Randolph,1,0:08,MEM,rebound,,,,,,,,,,Hasheem Thabeet,,,,,,off,,
Dahntay Jones,Earl Watson,Jeff Foster,Mike Dunleavy,Tyler Hansbrough,Hasheem Thabeet,Mike Conley,Rudy Gay,Sam Young,Zach Randolph,1,0:06,MEM,turnover,,,,,,,,,,Hasheem Thabeet,,,lost ball,,Mike Dunleavy,,,
Dahntay Jones,Earl Watson,Jeff Foster,Mike Dunleavy,Tyler Hansbrough,Hasheem Thabeet,Mike Conley,Rudy Gay,Sam Young,Zach Randolph,1,0:00,IND,shot,Mike Dunleavy,,,,,,,,,Earl Watson,3,,,made,,3pt,41,25
Dahntay Jones,Earl Watson,Jeff Foster,Mike Dunleavy,Tyler Hansbrough,DeMarre Carroll,Hasheem Thabeet,Jamaal Tinsley,O.J. Mayo,Zach Randolph,2,11:44,IND,shot,,,,,,,,,,Tyler Hansbrough,,,,missed,,jump,19,27
Dahntay Jones,Earl Watson,Jeff Foster,Mike Dunleavy,Tyler Hansbrough,DeMarre Carroll,Hasheem Thabeet,Jamaal Tinsley,O.J. Mayo,Zach Randolph,2,11:43,MEM,rebound,,,,,,,,,,O.J. Mayo,,,,,,def,,
Dahntay Jones,Earl Watson,Jeff Foster,Mike Dunleavy,Tyler Hansbrough,DeMarre Carroll,Hasheem Thabeet,Jamaal Tinsley,O.J. Mayo,Zach Randolph,2,11:39,MEM,turnover,,,,,,,,,,Zach Randolph,,,out of bounds lost ball turnover,,,,,
Dahntay Jones,Earl Watson,Jeff Foster,Mike Dunleavy,Tyler Hansbrough,DeMarre Carroll,Hasheem Thabeet,Jamaal Tinsley,O.J. Mayo,Zach Randolph,2,11:23,IND,shot,,,,,,,,,,Mike Dunleavy,,,,missed,,jump,39,22
Dahntay Jones,Earl Watson,Jeff Foster,Mike Dunleavy,Tyler Hansbrough,DeMarre Carroll,Hasheem Thabeet,Jamaal Tinsley,O.J. Mayo,Zach Randolph,2,11:22,MEM,rebound,,,,,,,,,,O.J. Mayo,,,,,,def,,
Dahntay Jones,Earl Watson,Jeff Foster,Mike Dunleavy,Tyler Hansbrough,DeMarre Carroll,Hasheem Thabeet,Jamaal Tinsley,O.J. Mayo,Zach Randolph,2,11:18,MEM,turnover,,,,,,,,,,O.J. Mayo,,,traveling,,,,,
Dahntay Jones,Earl Watson,Jeff Foster,Mike Dunleavy,Tyler Hansbrough,DeMarre Carroll,Hasheem Thabeet,Jamaal Tinsley,O.J. Mayo,Zach Randolph,2,11:07,MEM,foul,,,,,,,,Mike Dunleavy,,DeMarre Carroll,,,,,,shooting,,
Dahntay Jones,Earl Watson,Jeff Foster,Mike Dunleavy,Troy Murphy,DeMarre Carroll,Hasheem Thabeet,Jamaal Tinsley,O.J. Mayo,Zach Randolph,2,11:07,IND,sub,,,,Troy Murphy,,Tyler Hansbrough,,,,,,,,,,,,
Dahntay Jones,Earl Watson,Jeff Foster,Mike Dunleavy,Troy Murphy,DeMarre Carroll,Hasheem Thabeet,Jamaal Tinsley,O.J. Mayo,Zach Randolph,2,11:07,IND,free throw,,,,,,,1,,2,Mike Dunleavy,,,foul,made,,,,
Dahntay Jones,Earl Watson,Jeff Foster,Mike Dunleavy,Troy Murphy,DeMarre Carroll,Hasheem Thabeet,Jamaal Tinsley,O.J. Mayo,Zach Randolph,2,11:07,IND,free throw,,,,,,,2,,2,Mike Dunleavy,,,foul,made,,,,
Dahntay Jones,Earl Watson,Jeff Foster,Mike Dunleavy,Troy Murphy,DeMarre Carroll,Hasheem Thabeet,Jamaal Tinsley,O.J. Mayo,Zach Randolph,2,10:51,MEM,shot,,,,,,,,,,Jamaal Tinsley,,,,missed,,jump,11,17
Dahntay Jones,Earl Watson,Jeff Foster,Mike Dunleavy,Troy Murphy,DeMarre Carroll,Hasheem Thabeet,Jamaal Tinsley,O.J. Mayo,Zach Randolph,2,10:49,IND,rebound,,,,,,,,,,Dahntay Jones,,,,,,def,,
Dahntay Jones,Earl Watson,Jeff Foster,Mike Dunleavy,Troy Murphy,DeMarre Carroll,Hasheem Thabeet,Jamaal Tinsley,O.J. Mayo,Zach Randolph,2,10:43,MEM,foul,,,,,,,,Earl Watson,,Hasheem Thabeet,,,,,,shooting,,
Dahntay Jones,Earl Watson,Jeff Foster,Mike Dunleavy,Troy Murphy,DeMarre Carroll,Hasheem Thabeet,Jamaal Tinsley,O.J. Mayo,Zach Randolph,2,10:43,IND,free throw,,,,,,,1,,2,Earl Watson,,,foul,missed,,,,
Dahntay Jones,Earl Watson,Jeff Foster,Mike Dunleavy,Troy Murphy,DeMarre Carroll,Hasheem Thabeet,Jamaal Tinsley,O.J. Mayo,Zach Randolph,2,10:43,IND,rebound,,,,,,,,,,,,,,,,,,
Dahntay Jones,Earl Watson,Jeff Foster,Mike Dunleavy,Troy Murphy,DeMarre Carroll,Hasheem Thabeet,Jamaal Tinsley,O.J. Mayo,Zach Randolph,2,10:43,IND,free throw,,,,,,,2,,2,Earl Watson,,,foul,made,,,,
Dahntay Jones,Earl Watson,Jeff Foster,Mike Dunleavy,Troy Murphy,DeMarre Carroll,Hasheem Thabeet,Jamaal Tinsley,O.J. Mayo,Zach Randolph,2,10:24,IND,foul,,,,,,,,Zach Randolph,,Jeff Foster,,,,,,shooting,,
Dahntay Jones,Earl Watson,Jeff Foster,Mike Dunleavy,Troy Murphy,DeMarre Carroll,Hasheem Thabeet,Jamaal Tinsley,O.J. Mayo,Zach Randolph,2,10:24,MEM,free throw,,,,,,,1,,2,Zach Randolph,,,foul,missed,,,,
Dahntay Jones,Earl Watson,Jeff Foster,Mike Dunleavy,Troy Murphy,DeMarre Carroll,Hasheem Thabeet,Jamaal Tinsley,O.J. Mayo,Zach Randolph,2,10:24,MEM,rebound,,,,,,,,,,,,,,,,,,
Dahntay Jones,Earl Watson,Jeff Foster,Mike Dunleavy,Troy Murphy,DeMarre Carroll,Hasheem Thabeet,Jamaal Tinsley,O.J. Mayo,Zach Randolph,2,10:24,MEM,free throw,,,,,,,2,,2,Zach Randolph,,,foul,made,,,,
Dahntay Jones,Earl Watson,Jeff Foster,Mike Dunleavy,Troy Murphy,DeMarre Carroll,Hasheem Thabeet,Jamaal Tinsley,O.J. Mayo,Zach Randolph,2,10:11,IND,shot,,,,,,,,,,Jeff Foster,,,,missed,,jump,20,15
Dahntay Jones,Earl Watson,Jeff Foster,Mike Dunleavy,Troy Murphy,DeMarre Carroll,Hasheem Thabeet,Jamaal Tinsley,O.J. Mayo,Zach Randolph,2,10:10,MEM,rebound,,,,,,,,,,Zach Randolph,,,,,,def,,
Dahntay Jones,Earl Watson,Jeff Foster,Mike Dunleavy,Troy Murphy,DeMarre Carroll,Hasheem Thabeet,Jamaal Tinsley,O.J. Mayo,Zach Randolph,2,9:59,MEM,shot,,,,,,,,,,O.J. Mayo,2,,,made,,jump,42,10
Dahntay Jones,Earl Watson,Jeff Foster,Mike Dunleavy,Troy Murphy,DeMarre Carroll,Hasheem Thabeet,Jamaal Tinsley,O.J. Mayo,Zach Randolph,2,9:52,MEM,foul,,,,,,,,Earl Watson,,Jamaal Tinsley,,,,,,shooting,,