a1,a2,a3,a4,a5,h1,h2,h3,h4,h5,period,time,team,etype,assist,away,block,entered,home,left,num,opponent,outof,player,points,possession,reason,result,steal,type,x,y
Marc Gasol,Mike Conley,O.J. Mayo,Rudy Gay,Zach Randolph,Dwyane Wade,Jermaine O'Neal,Mario Chalmers,Michael Beasley,Yakhouba Diawara,1,12:00,OFF,jump ball,,Marc Gasol,,,Jermaine O'Neal,,,,,,,Miami,,,,,,
Marc Gasol,Mike Conley,O.J. Mayo,Rudy Gay,Zach Randolph,Dwyane Wade,Jermaine O'Neal,Mario Chalmers,Michael Beasley,Yakhouba Diawara,1,11:45,MIA,shot,,,,,,,,,,Dwyane Wade,2,,,made,,driving layup,25,6
Marc Gasol,Mike Conley,O.J. Mayo,Rudy Gay,Zach Randolph,Dwyane Wade,Jermaine O'Neal,Mario Chalmers,Michael Beasley,Yakhouba Diawara,1,11:36,MEM,shot,,,,,,,,,,O.J. Mayo,2,,,made,,jump,8,14
Marc Gasol,Mike Conley,O.J. Mayo,Rudy Gay,Zach Randolph,Dwyane Wade,Jermaine O'Neal,Mario Chalmers,Michael Beasley,Yakhouba Diawara,1,11:18,MIA,shot,,,,,,,,,,Dwyane Wade,2,,,made,,jump,28,7
Marc Gasol,Mike Conley,O.J. Mayo,Rudy Gay,Zach Randolph,Dwyane Wade,Jermaine O'Neal,Mario Chalmers,Michael Beasley,Yakhouba Diawara,1,10:59,MEM,shot,,,,,,,,,,Marc Gasol,2,,,made,,hook,17,7
Marc Gasol,Mike Conley,O.J. Mayo,Rudy Gay,Zach Randolph,Dwyane Wade,Jermaine O'Neal,Mario Chalmers,Michael Beasley,Yakhouba Diawara,1,10:49,MIA,turnover,,,,,,,,,,Mario Chalmers,,,traveling,,,,,
Marc Gasol,Mike Conley,O.J. Mayo,Rudy Gay,Zach Randolph,Dwyane Wade,Jermaine O'Neal,Mario Chalmers,Michael Beasley,Yakhouba Diawara,1,10:36,MEM,shot,,,,,,,,,,Rudy Gay,2,,,made,,driving reverse layup,25,6
Marc Gasol,Mike Conley,O.J. Mayo,Rudy Gay,Zach Randolph,Dwyane Wade,Jermaine O'Neal,Mario Chalmers,Michael Beasley,Yakhouba Diawara,1,10:13,MIA,shot,,,,,,,,,,Michael Beasley,,,,missed,,jump,32,24
Marc Gasol,Mike Conley,O.J. Mayo,Rudy Gay,Zach Randolph,Dwyane Wade,Jermaine O'Neal,Mario Chalmers,Michael Beasley,Yakhouba Diawara,1,10:12,MEM,rebound,,,,,,,,,,Mike Conley,,,,,,def,,
Marc Gasol,Mike Conley,O.J. Mayo,Rudy Gay,Zach Randolph,Dwyane Wade,Jermaine O'Neal,Mario Chalmers,Michael Beasley,Yakhouba Diawara,1,9:58,MEM,shot,,,,,,,,,,Rudy Gay,,,,missed,,running hook,16,9
Marc Gasol,Mike Conley,O.J. Mayo,Rudy Gay,Zach Randolph,Dwyane Wade,Jermaine O'Neal,Mario Chalmers,Michael Beasley,Yakhouba Diawara,1,9:57,MEM,rebound,,,,,,,,,,Marc Gasol,,,,,,off,,
Marc Gasol,Mike Conley,O.J. Mayo,Rudy Gay,Zach Randolph,Dwyane Wade,Jermaine O'Neal,Mario Chalmers,Michael Beasley,Yakhouba Diawara,1,9:57,MIA,foul,,,,,,,,Marc Gasol,,Yakhouba Diawara,,,,,,shooting,,
Marc Gasol,Mike Conley,O.J. Mayo,Rudy Gay,Zach Randolph,Dwyane Wade,Jermaine O'Neal,Mario Chalmers,Michael Beasley,Yakhouba Diawara,1,9:57,MEM,free throw,,,,,,,1,,2,Marc Gasol,,,foul,made,,,,
Marc Gasol,Mike Conley,O.J. Mayo,Rudy Gay,Zach Randolph,Dwyane Wade,Jermaine O'Neal,Mario Chalmers,Michael Beasley,Yakhouba Diawara,1,9:57,MEM,free throw,,,,,,,2,,2,Marc Gasol,,,foul,missed,,,,
Marc Gasol,Mike Conley,O.J. Mayo,Rudy Gay,Zach Randolph,Dwyane Wade,Jermaine O'Neal,Mario Chalmers,Michael Beasley,Yakhouba Diawara,1,9:56,MEM,rebound,,,,,,,,,,Zach Randolph,,,,,,off,,
Marc Gasol,Mike Conley,O.J. Mayo,Rudy Gay,Zach Randolph,Dwyane Wade,Jermaine O'Neal,Mario Chalmers,Michael Beasley,Yakhouba Diawara,1,9:55,MIA,foul,,,,,,,,Zach Randolph,,Michael Beasley,,,,,,shooting,,
Marc Gasol,Mike Conley,O.J. Mayo,Rudy Gay,Zach Randolph,Dwyane Wade,Jermaine O'Neal,Mario Chalmers,Michael Beasley,Yakhouba Diawara,1,9:55,MEM,free throw,,,,,,,1,,2,Zach Randolph,,,foul,made,,,,
Marc Gasol,Mike Conley,O.J. Mayo,Rudy Gay,Zach Randolph,Dwyane Wade,Jermaine O'Neal,Mario Chalmers,Michael Beasley,Yakhouba Diawara,1,9:55,MEM,free throw,,,,,,,2,,2,Zach Randolph,,,foul,made,,,,
Marc Gasol,Mike Conley,O.J. Mayo,Rudy Gay,Zach Randolph,Dwyane Wade,Jermaine O'Neal,Mario Chalmers,Michael Beasley,Yakhouba Diawara,1,9:43,MIA,shot,Mario Chalmers,,,,,,,,,Jermaine O'Neal,2,,,made,,jump,36,16
Marc Gasol,Mike Conley,O.J. Mayo,Rudy Gay,Zach Randolph,Dwyane Wade,Jermaine O'Neal,Mario Chalmers,Michael Beasley,Yakhouba Diawara,1,9:25,MEM,turnover,,,,,,,,,,Marc Gasol,,,bad pass,,Yakhouba Diawara,,,
Marc Gasol,Mike Conley,O.J. Mayo,Rudy Gay,Zach Randolph,Dwyane Wade,Jermaine O'Neal,Mario Chalmers,Michael Beasley,Yakhouba Diawara,1,9:16,MIA,turnover,,,,,,,,,,Mario Chalmers,,,bad pass,,,,,
Marc Gasol,Mike Conley,O.J. Mayo,Rudy Gay,Zach Randolph,Dwyane Wade,Jermaine O'Neal,Mario Chalmers,Michael Beasley,Yakhouba Diawara,1,8:56,MEM,shot,,,,,,,,,,Zach Randolph,,,,missed,,jump,13,19
Marc Gasol,Mike Conley,O.J. Mayo,Rudy Gay,Zach Randolph,Dwyane Wade,Jermaine O'Neal,Mario Chalmers,Michael Beasley,Yakhouba Diawara,1,8:53,MIA,rebound,,,,,,,,,,,,,,,,,,
Marc Gasol,Mike Conley,O.J. Mayo,Rudy Gay,Zach Randolph,Dwyane Wade,Jermaine O'Neal,Mario Chalmers,Michael Beasley,Yakhouba Diawara,1,8:34,MIA,shot,,,,,,,,,,Michael Beasley,,,,missed,,jump,44,7
Marc Gasol,Mike Conley,O.J. Mayo,Rudy Gay,Zach Randolph,Dwyane Wade,Jermaine O'Neal,Mario Chalmers,Michael Beasley,Yakhouba Diawara,1,8:32,MEM,rebound,,,,,,,,,,Rudy Gay,,,,,,def,,
Marc Gasol,Mike Conley,O.J. Mayo,Rudy Gay,Zach Randolph,Dwyane Wade,Jermaine O'Neal,Mario Chalmers,Michael Beasley,Yakhouba Diawara,1,8:22,MIA,foul,,,,,,,,O.J. Mayo,,Dwyane Wade,,,,,,shooting,,
Marc Gasol,Mike Conley,O.J. Mayo,Rudy Gay,Zach Randolph,Dwyane Wade,Jermaine O'Neal,Mario Chalmers,Michael Beasley,Yakhouba Diawara,1,8:22,MEM,free throw,,,,,,,1,,2,O.J. Mayo,,,foul,made,,,,
Marc Gasol,Mike Conley,O.J. Mayo,Rudy Gay,Zach Randolph,Dwyane Wade,Jermaine O'Neal,Mario Chalmers,Michael Beasley,Yakhouba Diawara,1,8:22,MEM,free throw,,,,,,,2,,2,O.J. Mayo,,,foul,made,,,,
Marc Gasol,Mike Conley,O.J. Mayo,Rudy Gay,Zach Randolph,Dwyane Wade,Jermaine O'Neal,Mario Chalmers,Michael Beasley,Yakhouba Diawara,1,8:03,MIA,shot,,,Zach Randolph,,,,,,,Mario Chalmers,,,,missed,,layup,25,6
Marc Gasol,Mike Conley,O.J. Mayo,Rudy Gay,Zach Randolph,Dwyane Wade,Jermaine O'Neal,Mario Chalmers,Michael Beasley,Yakhouba Diawara,1,8:02,MIA,rebound,,,,,,,,,,,,,,,,,,
Marc Gasol,Mike Conley,O.J. Mayo,Rudy Gay,Zach Randolph,Dwyane Wade,Jermaine O'Neal,Mario Chalmers,Michael Beasley,Yakhouba Diawara,1,7:55,MIA,shot,,,,,,,,,,Dwyane Wade,,,,missed,,jump,25,20
Marc Gasol,Mike Conley,O.J. Mayo,Rudy Gay,Zach Randolph,Dwyane Wade,Jermaine O'Neal,Mario Chalmers,Michael Beasley,Yakhouba Diawara,1,7:54,MIA,rebound,,,,,,,,,,Dwyane Wade,,,,,,off,,
Marc Gasol,Mike Conley,O.J. Mayo,Rudy Gay,Zach Randolph,Dwyane Wade,Jermaine O'Neal,Mario Chalmers,Michael Beasley,Yakhouba Diawara,1,7:51,MIA,shot,,,Marc Gasol,,,,,,,Michael Beasley,,,,missed,,driving reverse layup,25,6
Marc Gasol,Mike Conley,O.J. Mayo,Rudy Gay,Zach Randolph,Dwyane Wade,Jermaine O'Neal,Mario Chalmers,Michael Beasley,Yakhouba Diawara,1,7:49,MEM,rebound,,,,,,,,,,Rudy Gay,,,,,,def,,
Marc Gasol,Mike Conley,O.J. Mayo,Rudy Gay,Zach Randolph,Dwyane Wade,Jermaine O'Neal,Mario Chalmers,Michael Beasley,Yakhouba Diawara,1,7:42,MIA,foul,,,,,,,,Rudy Gay,,Jermaine O'Neal,,,,,,shooting,,
Marc Gasol,Mike Conley,O.J. Mayo,Rudy Gay,Zach Randolph,Dwyane Wade,Jermaine O'Neal,Mario Chalmers,Michael Beasley,Yakhouba Diawara,1,7:42,MEM,free throw,,,,,,,1,,2,Rudy Gay,,,foul,made,,,,
Marc Gasol,Mike Conley,O.J. Mayo,Rudy Gay,Zach Randolph,Dwyane Wade,Jermaine O'Neal,Mario Chalmers,Michael Beasley,Yakhouba Diawara,1,7:42,MEM,free throw,,,,,,,2,,2,Rudy Gay,,,foul,made,,,,
Marc Gasol,Mike Conley,O.J. Mayo,Rudy Gay,Zach Randolph,Dwyane Wade,Jermaine O'Neal,Mario Chalmers,Michael Beasley,Yakhouba Diawara,1,7:26,MIA,turnover,,,,,,,,,,Dwyane Wade,,,lost ball,,Marc Gasol,,,
Marc Gasol,Mike Conley,O.J. Mayo,Rudy Gay,Zach Randolph,Dwyane Wade,Jermaine O'Neal,Mario Chalmers,Michael Beasley,Yakhouba Diawara,1,7:22,MEM,shot,,,,,,,,,,O.J. Mayo,2,,,made,,driving dunk,25,6
Marc Gasol,Mike Conley,O.J. Mayo,Rudy Gay,Zach Randolph,Dwyane Wade,Jermaine O'Neal,Mario Chalmers,Michael Beasley,Yakhouba Diawara,1,7:13,MIA,timeout,,,,,,,,,,,,,,,,regular,,
Marc Gasol,Mike Conley,O.J. Mayo,Rudy Gay,Zach Randolph,Dwyane Wade,Jermaine O'Neal,Mario Chalmers,Udonis Haslem,Yakhouba Diawara,1,7:13,MIA,sub,,,,Udonis Haslem,,Michael Beasley,,,,,,,,,,,,
Marc Gasol,Mike Conley,O.J. Mayo,Rudy Gay,Zach Randolph,Dwyane Wade,Jermaine O'Neal,Mario Chalmers,Udonis Haslem,Yakhouba Diawara,1,7:04,MIA,shot,,,,,,,,,,Dwyane Wade,2,,,made,,running jump,30,12
Marc Gasol,Mike Conley,O.J. Mayo,Rudy Gay,Zach Randolph,Dwyane Wade,Jermaine O'Neal,Mario Chalmers,Udonis Haslem,Yakhouba Diawara,1,6:36,MEM,shot,,,,,,,,,,Mike Conley,,,,missed,,layup,25,6
Marc Gasol,Mike Conley,O.J. Mayo,Rudy Gay,Zach Randolph,Dwyane Wade,Jermaine O'Neal,Mario Chalmers,Udonis Haslem,Yakhouba Diawara,1,6:35,MIA,rebound,,,,,,,,,,Mario Chalmers,,,,,,def,,
Marc Gasol,Mike Conley,O.J. Mayo,Rudy Gay,Zach Randolph,Dwyane Wade,Jermaine O'Neal,Mario Chalmers,Udonis Haslem,Yakhouba Diawara,1,6:24,MIA,shot,,,,,,,,,,Jermaine O'Neal,,,,missed,,turnaround jump,34,9
Marc Gasol,Mike Conley,O.J. Mayo,Rudy Gay,Zach Randolph,Dwyane Wade,Jermaine O'Neal,Mario Chalmers,Udonis Haslem,Yakhouba Diawara,1,6:21,MEM,rebound,,,,,,,,,,Marc Gasol,,,,,,def,,
Marc Gasol,Mike Conley,O.J. Mayo,Rudy Gay,Zach Randolph,Dwyane Wade,Jermaine O'Neal,Mario Chalmers,Udonis Haslem,Yakhouba Diawara,1,6:15,MEM,shot,,,,,,,,,,Mike Conley,2,,,made,,driving layup,25,6
Marc Gasol,Mike Conley,O.J. Mayo,Rudy Gay,Zach Randolph,Dwyane Wade,Jermaine O'Neal,Mario Chalmers,Udonis Haslem,Yakhouba Diawara,1,6:07,MIA,shot,,,,,,,,,,Dwyane Wade,,,,missed,,driving layup,25,6
Marc Gasol,Mike Conley,O.J. Mayo,Rudy Gay,Zach Randolph,Dwyane Wade,Jermaine O'Neal,Mario Chalmers,Udonis Haslem,Yakhouba Diawara,1,6:05,MEM,rebound,,,,,,,,,,O.J. Mayo,,,,,,def,,
Marc Gasol,Mike Conley,O.J. Mayo,Rudy Gay,Zach Randolph,Dwyane Wade,Jermaine O'Neal,Mario Chalmers,Udonis Haslem,Yakhouba Diawara,1,6:03,MEM,foul,,,,,,,,Udonis Haslem,,O.J. Mayo,,,,,,offensive,,
Marc Gasol,Mike Conley,O.J. Mayo,Rudy Gay,Zach Randolph,Dwyane Wade,Jermaine O'Neal,Mario Chalmers,Udonis Haslem,Yakhouba Diawara,1,6:03,MEM,turnover,,,,,,,,,,O.J. Mayo,,,foul,,,,,
Marc Gasol,Mike Conley,O.J. Mayo,Rudy Gay,Zach Randolph,Dwyane Wade,Jermaine O'Neal,Mario Chalmers,Udonis Haslem,Yakhouba Diawara,1,5:50,MEM,foul,,,,,,,,Mario Chalmers,,Mike Conley,,,,,,personal,,
Marc Gasol,Mike Conley,O.J. Mayo,Rudy Gay,Zach Randolph,Dwyane Wade,Jermaine O'Neal,Mario Chalmers,Udonis Haslem,Yakhouba Diawara,1,5:34,MIA,shot,,,,,,,,,,Jermaine O'Neal,,,,missed,,jump,4,8
Marc Gasol,Mike Conley,O.J. Mayo,Rudy Gay,Zach Randolph,Dwyane Wade,Jermaine O'Neal,Mario Chalmers,Udonis Haslem,Yakhouba Diawara,1,5:31,MIA,rebound,,,,,,,,,,Dwyane Wade,,,,,,off,,
Marc Gasol,Mike Conley,O.J. Mayo,Rudy Gay,Zach Randolph,Dwyane Wade,Jermaine O'Neal,Mario Chalmers,Udonis Haslem,Yakhouba Diawara,1,5:29,MIA,shot,,,,,,,,,,Dwyane Wade,2,,,made,,layup,25,6
Marc Gasol,Mike Conley,O.J. Mayo,Rudy Gay,Zach Randolph,Dwyane Wade,Jermaine O'Neal,Mario Chalmers,Udonis Haslem,Yakhouba Diawara,1,5:17,MEM,shot,,,,,,,,,,Rudy Gay,2,,,made,,reverse layup,25,6
Marc Gasol,Mike Conley,O.J. Mayo,Rudy Gay,Zach Randolph,Dwyane Wade,Jermaine O'Neal,Mario Chalmers,Udonis Haslem,Yakhouba Diawara,1,4:55,MIA,turnover,,,,,,,,,,Yakhouba Diawara,,,bad pass,,Mike Conley,,,
Marc Gasol,Mike Conley,O.J. Mayo,Rudy Gay,Zach Randolph,Dwyane Wade,Jermaine O'Neal,Mario Chalmers,Udonis Haslem,Yakhouba Diawara,1,4:45,MEM,shot,,,,,,,,,,Rudy Gay,,,,missed,,jump bank,40,10
Marc Gasol,Mike Conley,O.J. Mayo,Rudy Gay,Zach Randolph,Dwyane Wade,Jermaine O'Neal,Mario Chalmers,Udonis Haslem,Yakhouba Diawara,1,4:43,MIA,rebound,,,,,,,,,,Jermaine O'Neal,,,,,,def,,
Marc Gasol,Mike Conley,O.J. Mayo,Rudy Gay,Zach Randolph,Dwyane Wade,Jermaine O'Neal,Mario Chalmers,Udonis Haslem,Yakhouba Diawara,1,4:30,MIA,shot,,,,,,,,,,Mario Chalmers,2,,,made,,running jump,30,14
Marc Gasol,Mike Conley,O.J. Mayo,Rudy Gay,Zach Randolph,Dwyane Wade,Jermaine O'Neal,Mario Chalmers,Udonis Haslem,Yakhouba Diawara,1,4:18,MIA,foul,,,,,,,,O.J. Mayo,,Udonis Haslem,,,,,,shooting,,
Marc Gasol,Mike Conley,O.J. Mayo,Rudy Gay,Zach Randolph,Dwyane Wade,Jamaal Magloire,Mario Chalmers,Udonis Haslem,Yakhouba Diawara,1,4:18,MIA,sub,,,,Jamaal Magloire,,Jermaine O'Neal,,,,,,,,,,,,
Marc Gasol,Mike Conley,O.J. Mayo,Rudy Gay,Zach Randolph,Dwyane Wade,Jamaal Magloire,Mario Chalmers,Udonis Haslem,Yakhouba Diawara,1,4:18,MEM,free throw,,,,,,,1,,2,O.J. Mayo,,,foul,made,,,,
Marc Gasol,Mike Conley,O.J. Mayo,Rudy Gay,Zach Randolph,Dwyane Wade,Jamaal Magloire,Mario Chalmers,Udonis Haslem,Yakhouba Diawara,1,4:18,MEM,free throw,,,,,,,2,,2,O.J. Mayo,,,foul,made,,,,
Marc Gasol,Mike Conley,O.J. Mayo,Rudy Gay,Zach Randolph,Dwyane Wade,Jamaal Magloire,Mario Chalmers,Udonis Haslem,Yakhouba Diawara,1,4:10,MIA,shot,,,,,,,,,,Dwyane Wade,,,,missed,,driving dunk,25,6
Marc Gasol,Mike Conley,O.J. Mayo,Rudy Gay,Zach Randolph,Dwyane Wade,Jamaal Magloire,Mario Chalmers,Udonis Haslem,Yakhouba Diawara,1,4:06,MEM,rebound,,,,,,,,,,Marc Gasol,,,,,,def,,
Marc Gasol,Mike Conley,O.J. Mayo,Rudy Gay,Zach Randolph,Dwyane Wade,Jamaal Magloire,Mario Chalmers,Udonis Haslem,Yakhouba Diawara,1,4:00,MEM,shot,Marc Gasol,,,,,,,,,O.J. Mayo,2,,,made,,jump,33,18
Marc Gasol,Mike Conley,O.J. Mayo,Rudy Gay,Zach Randolph,Dwyane Wade,Jamaal Magloire,Mario Chalmers,Udonis Haslem,Yakhouba Diawara,1,3:44,MIA,shot,,,,,,,,,,Yakhouba Diawara,,,,missed,,3pt,12,27
Marc Gasol,Mike Conley,O.J. Mayo,Rudy Gay,Zach Randolph,Dwyane Wade,Jamaal Magloire,Mario Chalmers,Udonis Haslem,Yakhouba Diawara,1,3:43,MEM,rebound,,,,,,,,,,Marc Gasol,,,,,,def,,
Marc Gasol,Mike Conley,O.J. Mayo,Rudy Gay,Zach Randolph,Dwyane Wade,Jamaal Magloire,Mario Chalmers,Udonis Haslem,Yakhouba Diawara,1,3:37,MEM,turnover,,,,,,,,,,Rudy Gay,,,bad pass,,Jamaal Magloire,,,
Marc Gasol,Mike Conley,O.J. Mayo,Rudy Gay,Zach Randolph,Dwyane Wade,Jamaal Magloire,Mario Chalmers,Udonis Haslem,Yakhouba Diawara,1,3:32,MIA,shot,Yakhouba Diawara,,,,,,,,,Dwyane Wade,2,,,made,,dunk,25,6
Marc Gasol,Mike Conley,O.J. Mayo,Rudy Gay,Zach Randolph,Dwyane Wade,Jamaal Magloire,Mario Chalmers,Udonis Haslem,Yakhouba Diawara,1,3:24,MEM,shot,,,,,,,,,,Rudy Gay,,,,missed,,jump,31,10
Marc Gasol,Mike Conley,O.J. Mayo,Rudy Gay,Zach Randolph,Dwyane Wade,Jamaal Magloire,Mario Chalmers,Udonis Haslem,Yakhouba Diawara,1,3:22,MEM,rebound,,,,,,,,,,Marc Gasol,,,,,,off,,
Marc Gasol,Mike Conley,O.J. Mayo,Rudy Gay,Zach Randolph,Dwyane Wade,Jamaal Magloire,Mario Chalmers,Udonis Haslem,Yakhouba Diawara,1,3:20,MIA,foul,,,,,,,,Marc Gasol,,Udonis Haslem,,,,,,personal,,
Marc Gasol,Mike Conley,O.J. Mayo,Rudy Gay,Zach Randolph,Dwyane Wade,Jamaal Magloire,Mario Chalmers,Udonis Haslem,Yakhouba Diawara,1,3:20,MEM,free throw,,,,,,,1,,2,Marc Gasol,,,foul,made,,,,
Marc Gasol,Mike Conley,O.J. Mayo,Rudy Gay,Zach Randolph,Dorell Wright,Dwyane Wade,Jamaal Magloire,Udonis Haslem,Yakhouba Diawara,1,3:20,MIA,sub,,,,Dorell Wright,,Mario Chalmers,,,,,,,,,,,,
Marc Gasol,Mike Conley,O.J. Mayo,Rudy Gay,Zach Randolph,Dorell Wright,Dwyane Wade,Jamaal Magloire,Michael Beasley,Yakhouba Diawara,1,3:20,MIA,sub,,,,Michael Beasley,,Udonis Haslem,,,,,,,,,,,,
Marc Gasol,Mike Conley,O.J. Mayo,Rudy Gay,Zach Randolph,Dorell Wright,Dwyane Wade,Jamaal Magloire,Michael Beasley,Yakhouba Diawara,1,3:20,MEM,free throw,,,,,,,2,,2,Marc Gasol,,,foul,missed,,,,
Marc Gasol,Mike Conley,O.J. Mayo,Rudy Gay,Zach Randolph,Dorell Wright,Dwyane Wade,Jamaal Magloire,Michael Beasley,Yakhouba Diawara,1,3:19,MIA,rebound,,,,,,,,,,Dorell Wright,,,,,,def,,
Marc Gasol,Mike Conley,O.J. Mayo,Rudy Gay,Zach Randolph,Dorell Wright,Dwyane Wade,Jamaal Magloire,Michael Beasley,Yakhouba Diawara,1,3:04,MIA,shot,Dwyane Wade,,,,,,,,,Michael Beasley,2,,,made,,reverse dunk,25,6
Marc Gasol,Mike Conley,O.J. Mayo,Rudy Gay,Zach Randolph,Dorell Wright,Dwyane Wade,Jamaal Magloire,Michael Beasley,Yakhouba Diawara,1,2:47,MIA,foul,,,,,,,,Rudy Gay,,Dorell Wright,,,,,,shooting,,
Marc Gasol,Mike Conley,O.J. Mayo,Rudy Gay,Zach Randolph,Dorell Wright,Dwyane Wade,Jamaal Magloire,Michael Beasley,Yakhouba Diawara,1,2:47,MEM,timeout,,,,,,,,,,,,,,,,regular,,
Marc Gasol,Mike Conley,O.J. Mayo,Rudy Gay,Zach Randolph,Dorell Wright,Dwyane Wade,Jamaal Magloire,James Jones,Michael Beasley,1,2:47,MIA,sub,,,,James Jones,,Yakhouba Diawara,,,,,,,,,,,,
Marc Gasol,Mike Conley,O.J. Mayo,Rudy Gay,Zach Randolph,Dorell Wright,Dwyane Wade,Jamaal Magloire,James Jones,Michael Beasley,1,2:47,MEM,free throw,,,,,,,1,,2,Rudy Gay,,,foul,made,,,,
Marc Gasol,Mike Conley,O.J. Mayo,Rudy Gay,Zach Randolph,Dorell Wright,Dwyane Wade,Jamaal Magloire,James Jones,Michael Beasley,1,2:47,MEM,free throw,,,,,,,2,,2,Rudy Gay,,,foul,made,,,,
Marc Gasol,Mike Conley,O.J. Mayo,Rudy Gay,Zach Randolph,Dorell Wright,Dwyane Wade,Jamaal Magloire,James Jones,Michael Beasley,1,2:32,MIA,shot,James Jones,,,,,,,,,Dorell Wright,3,,,made,,3pt,1,8
Marc Gasol,Mike Conley,O.J. Mayo,Rudy Gay,Zach Randolph,Dorell Wright,Dwyane Wade,Jamaal Magloire,James Jones,Michael Beasley,1,2:16,MEM,shot,,,,,,,,,,Zach Randolph,,,,missed,,layup,25,6
Marc Gasol,Mike Conley,O.J. Mayo,Rudy Gay,Zach Randolph,Dorell Wright,Dwyane Wade,Jamaal Magloire,James Jones,Michael Beasley,1,2:14,MEM,rebound,,,,,,,,,,,,,,,,,,
Marc Gasol,Mike Conley,O.J. Mayo,Rudy Gay,Zach Randolph,Dorell Wright,Dwyane Wade,Jamaal Magloire,James Jones,Michael Beasley,1,2:12,MIA,foul,,,,,,,,Rudy Gay,,James Jones,,,,,,personal,,
Marc Gasol,Mike Conley,O.J. Mayo,Rudy Gay,Zach Randolph,Dorell Wright,Dwyane Wade,Jamaal Magloire,James Jones,Michael Beasley,1,2:12,MEM,free throw,,,,,,,1,,2,Rudy Gay,,,foul,missed,,,,
Marc Gasol,Mike Conley,O.J. Mayo,Rudy Gay,Zach Randolph,Dorell Wright,Dwyane Wade,Jamaal Magloire,James Jones,Michael Beasley,1,2:12,MEM,rebound,,,,,,,,,,,,,,,,,,
Hasheem Thabeet,Mike Conley,O.J. Mayo,Rudy Gay,Zach Randolph,Dorell Wright,Dwyane Wade,Jamaal Magloire,James Jones,Michael Beasley,1,2:12,MEM,sub,,,,Hasheem Thabeet,,Marc Gasol,,,,,,,,,,,,
Hasheem Thabeet,Jamaal Tinsley,O.J. Mayo,Rudy Gay,Zach Randolph,Dorell Wright,Dwyane Wade,Jamaal Magloire,James Jones,Michael Beasley,1,2:12,MEM,sub,,,,Jamaal Tinsley,,Mike Conley,,,,,,,,,,,,
Hasheem Thabeet,Jamaal Tinsley,O.J. Mayo,Rudy Gay,Zach Randolph,Dorell Wright,Dwyane Wade,Jamaal Magloire,James Jones,Michael Beasley,1,2:12,MEM,free throw,,,,,,,2,,2,Rudy Gay,,,foul,missed,,,,
Hasheem Thabeet,Jamaal Tinsley,O.J. Mayo,Rudy Gay,Zach Randolph,Dorell Wright,Dwyane Wade,Jamaal Magloire,James Jones,Michael Beasley,1,2:10,MIA,rebound,,,,,,,,,,Jamaal Magloire,,,,,,def,,
Hasheem Thabeet,Jamaal Tinsley,O.J. Mayo,Rudy Gay,Zach Randolph,Dorell Wright,Dwyane Wade,Jamaal Magloire,James Jones,Michael Beasley,1,1:55,MIA,shot,,,,,,,,,,Dorell Wright,2,,,made,,turnaround hook,25,6
Hasheem Thabeet,Jamaal Tinsley,O.J. Mayo,Rudy Gay,Zach Randolph,Dorell Wright,Dwyane Wade,Jamaal Magloire,James Jones,Michael Beasley,1,1:36,MEM,shot,,,,,,,,,,Rudy Gay,2,,,made,,turnaround jump,16,17
Hasheem Thabeet,Jamaal Tinsley,O.J. Mayo,Rudy Gay,Zach Randolph,Dorell Wright,Dwyane Wade,Jamaal Magloire,James Jones,Michael Beasley,1,1:19,MIA,shot,,,Hasheem Thabeet,,,,,,,Dwyane Wade,,,,missed,,layup,25,6
Hasheem Thabeet,Jamaal Tinsley,O.J. Mayo,Rudy Gay,Zach Randolph,Dorell Wright,Dwyane Wade,Jamaal Magloire,James Jones,Michael Beasley,1,1:16,MEM,rebound,,,,,,,,,,O.J. Mayo,,,,,,def,,
Hasheem Thabeet,Jamaal Tinsley,O.J. Mayo,Rudy Gay,Zach Randolph,Dorell Wright,Dwyane Wade,Jamaal Magloire,James Jones,Michael Beasley,1,1:14,MEM,shot,,,,,,,,,,O.J. Mayo,2,,,made,,layup,25,6
Hasheem Thabeet,Jamaal Tinsley,O.J. Mayo,Rudy Gay,Zach Randolph,Dorell Wright,Dwyane Wade,Jamaal Magloire,James Jones,Michael Beasley,1,1:03,MIA,turnover,,,,,,,,,,Dorell Wright,,,bad pass,,Rudy Gay,,,
Hasheem Thabeet,Jamaal Tinsley,O.J. Mayo,Rudy Gay,Zach Randolph,Dorell Wright,Dwyane Wade,Jamaal Magloire,James Jones,Michael Beasley,1,1:01,MEM,shot,,,,,,,,,,Rudy Gay,2,,,made,,layup,25,6
Hasheem Thabeet,Jamaal Tinsley,O.J. Mayo,Rudy Gay,Zach Randolph,Dorell Wright,Dwyane Wade,Jamaal Magloire,James Jones,Michael Beasley,1,1:01,MIA,foul,,,,,,,,Rudy Gay,,Dorell Wright,,,,,,shooting,,
Hasheem Thabeet,Jamaal Tinsley,Rudy Gay,Sam Young,Zach Randolph,Dorell Wright,Dwyane Wade,Jamaal Magloire,James Jones,Michael Beasley,1,1:01,MEM,sub,,,,Sam Young,,O.J. Mayo,,,,,,,,,,,,
Hasheem Thabeet,Jamaal Tinsley,Rudy Gay,Sam Young,Zach Randolph,Dorell Wright,Dwyane Wade,Jamaal Magloire,James Jones,Michael Beasley,1,1:01,MEM,free throw,,,,,,,1,,1,Rudy Gay,,,foul,missed,,,,
Hasheem Thabeet,Jamaal Tinsley,Rudy Gay,Sam Young,Zach Randolph,Dorell Wright,Dwyane Wade,Jamaal Magloire,James Jones,Michael Beasley,1,1:00,MEM,rebound,,,,,,,,,,Jamaal Tinsley,,,,,,off,,
Hasheem Thabeet,Jamaal Tinsley,Rudy Gay,Sam Young,Zach Randolph,Dorell Wright,Dwyane Wade,Jamaal Magloire,James Jones,Michael Beasley,1,0:46,MEM,shot,,,,,,,,,,Rudy Gay,,,,missed,,driving layup,25,6
Hasheem Thabeet,Jamaal Tinsley,Rudy Gay,Sam Young,Zach Randolph,Dorell Wright,Dwyane Wade,Jamaal Magloire,James Jones,Michael Beasley,1,0:46,MIA,rebound,,,,,,,,,,,,,,,,,,
Hasheem Thabeet,Jamaal Tinsley,Rudy Gay,Sam Young,Zach Randolph,Dorell Wright,Dwyane Wade,Jamaal Magloire,James Jones,Michael Beasley,1,0:29,MIA,turnover,,,,,,,,,,Dwyane Wade,,,bad pass,,Hasheem Thabeet,,,
Hasheem Thabeet,Jamaal Tinsley,Rudy Gay,Sam Young,Zach Randolph,Dorell Wright,Dwyane Wade,Jamaal Magloire,James Jones,Michael Beasley,1,0:27,MEM,shot,Hasheem Thabeet,,,,,,,,,Rudy Gay,2,,,made,,reverse dunk,25,6
Hasheem Thabeet,Jamaal Tinsley,Rudy Gay,Sam Young,Zach Randolph,Dorell Wright,Dwyane Wade,Jamaal Magloire,James Jones,Michael Beasley,1,0:17,MEM,foul,,,,,,,,Dwyane Wade,,Sam Young,,,,,,personal,,
Hasheem Thabeet,Jamaal Tinsley,Rudy Gay,Sam Young,Zach Randolph,Dorell Wright,Dwyane Wade,Jamaal Magloire,James Jones,Michael Beasley,1,0:10,MEM,foul,,,,,,,,James Jones,,Jamaal Tinsley,,,,,,personal,,
Hasheem Thabeet,Jamaal Tinsley,Rudy Gay,Sam Young,Zach Randolph,Dorell Wright,Dwyane Wade,Jamaal Magloire,James Jones,Michael Beasley,1,0:10,MIA,free throw,,,,,,,1,,2,James Jones,,,foul,missed,,,,
Hasheem Thabeet,Jamaal Tinsley,Rudy Gay,Sam Young,Zach Randolph,Dorell Wright,Dwyane Wade,Jamaal Magloire,James Jones,Michael Beasley,1,0:10,MIA,rebound,,,,,,,,,,,,,,,,,,
Hasheem Thabeet,Jamaal Tinsley,Rudy Gay,Sam Young,Zach Randolph,Dorell Wright,Dwyane Wade,Jamaal Magloire,James Jones,Michael Beasley,1,0:10,MIA,free throw,,,,,,,2,,2,James Jones,,,foul,made,,,,
Hasheem Thabeet,Jamaal Tinsley,Rudy Gay,Sam Young,Zach Randolph,Dorell Wright,Dwyane Wade,Jamaal Magloire,James Jones,Michael Beasley,1,0:02,MEM,shot,Hasheem Thabeet,,,,,,,,,Zach Randolph,3,,,made,,3pt,42,25
Hasheem Thabeet,Jamaal Tinsley,Rudy Gay,Sam Young,Zach Randolph,Dorell Wright,Dwyane Wade,Jamaal Magloire,James Jones,Michael Beasley,1,0:00,MIA,shot,,,,,,,,,,Dwyane Wade,3,,,made,,3pt,25,35
Hasheem Thabeet,Jamaal Tinsley,Rudy Gay,Sam Young,Zach Randolph,Dorell Wright,Jamaal Magloire,Mario Chalmers,Michael Beasley,Udonis Haslem,2,11:39,MEM,shot,,,,,,,,,,Rudy Gay,,,,missed,,turnaround jump,41,8
Hasheem Thabeet,Jamaal Tinsley,Rudy Gay,Sam Young,Zach Randolph,Dorell Wright,Jamaal Magloire,Mario Chalmers,Michael Beasley,Udonis Haslem,2,11:39,MEM,rebound,,,,,,,,,,,,,,,,,,
Hasheem Thabeet,Jamaal Tinsley,Rudy Gay,Sam Young,Zach Randolph,Dorell Wright,Jamaal Magloire,Mario Chalmers,Michael Beasley,Udonis Haslem,2,11:39,MIA,foul,,,,,,,,Zach Randolph,,Mario Chalmers,,,,,,loose ball,,
Hasheem Thabeet,Jamaal Tinsley,Rudy Gay,Sam Young,Zach Randolph,Dorell Wright,Jamaal Magloire,Mario Chalmers,Michael Beasley,Udonis Haslem,2,11:31,MEM,shot,,,,,,,,,,Sam Young,,,,missed,,driving layup,25,6
Hasheem Thabeet,Jamaal Tinsley,Rudy Gay,Sam Young,Zach Randolph,Dorell Wright,Jamaal Magloire,Mario Chalmers,Michael Beasley,Udonis Haslem,2,11:30,MEM,rebound,,,,,,,,,,Zach Randolph,,,,,,off,,
Hasheem Thabeet,Jamaal Tinsley,Rudy Gay,Sam Young,Zach Randolph,Dorell Wright,Jamaal Magloire,Mario Chalmers,Michael Beasley,Udonis Haslem,2,11:29,MEM,shot,,,,,,,,,,Zach Randolph,,,,missed,,tip,25,6
Hasheem Thabeet,Jamaal Tinsley,Rudy Gay,Sam Young,Zach Randolph,Dorell Wright,Jamaal Magloire,Mario Chalmers,Michael Beasley,Udonis Haslem,2,11:28,MEM,rebound,,,,,,,,,,,,,,,,,,