a1,a2,a3,a4,a5,h1,h2,h3,h4,h5,period,time,team,etype,assist,away,block,entered,home,left,num,opponent,outof,player,points,possession,reason,result,steal,type,x,y
Darren Collison,David West,Devin Brown,Emeka Okafor,James Posey,Andrew Bynum,Derek Fisher,Kobe Bryant,Pau Gasol,Ron Artest,1,12:00,OFF,jump ball,,Emeka Okafor,,,Andrew Bynum,,,,,,,Ron Artest,,,,,,
Darren Collison,David West,Devin Brown,Emeka Okafor,James Posey,Andrew Bynum,Derek Fisher,Kobe Bryant,Pau Gasol,Ron Artest,1,11:44,NOH,foul,,,,,,,,Andrew Bynum,,James Posey,,,,,,personal,,
Darren Collison,David West,Devin Brown,Emeka Okafor,James Posey,Andrew Bynum,Derek Fisher,Kobe Bryant,Pau Gasol,Ron Artest,1,11:35,LAL,shot,Andrew Bynum,,,,,,,,,Kobe Bryant,3,,,made,,3pt,14,29
Darren Collison,David West,Devin Brown,Emeka Okafor,James Posey,Andrew Bynum,Derek Fisher,Kobe Bryant,Pau Gasol,Ron Artest,1,11:17,NOH,shot,David West,,,,,,,,,Emeka Okafor,2,,,made,,slam dunk,25,6
Darren Collison,David West,Devin Brown,Emeka Okafor,James Posey,Andrew Bynum,Derek Fisher,Kobe Bryant,Pau Gasol,Ron Artest,1,10:58,LAL,shot,,,,,,,,,,Andrew Bynum,2,,,made,,jump hook,22,12
Darren Collison,David West,Devin Brown,Emeka Okafor,James Posey,Andrew Bynum,Derek Fisher,Kobe Bryant,Pau Gasol,Ron Artest,1,10:43,NOH,shot,,,,,,,,,,Darren Collison,2,,,made,,pullup jump,40,21
Darren Collison,David West,Devin Brown,Emeka Okafor,James Posey,Andrew Bynum,Derek Fisher,Kobe Bryant,Pau Gasol,Ron Artest,1,10:33,LAL,shot,Derek Fisher,,,,,,,,,Andrew Bynum,2,,,made,,turnaround bank hook,21,11
Darren Collison,David West,Devin Brown,Emeka Okafor,James Posey,Andrew Bynum,Derek Fisher,Kobe Bryant,Pau Gasol,Ron Artest,1,10:13,NOH,shot,Darren Collison,,,,,,,,,David West,2,,,made,,jump,22,26
Darren Collison,David West,Devin Brown,Emeka Okafor,James Posey,Andrew Bynum,Derek Fisher,Kobe Bryant,Pau Gasol,Ron Artest,1,9:53,LAL,shot,Derek Fisher,,,,,,,,,Kobe Bryant,2,,,made,,jump,9,20
Darren Collison,David West,Devin Brown,Emeka Okafor,James Posey,Andrew Bynum,Derek Fisher,Kobe Bryant,Pau Gasol,Ron Artest,1,9:36,NOH,shot,,,,,,,,,,Devin Brown,,,,missed,,3pt,6,22
Darren Collison,David West,Devin Brown,Emeka Okafor,James Posey,Andrew Bynum,Derek Fisher,Kobe Bryant,Pau Gasol,Ron Artest,1,9:34,LAL,rebound,,,,,,,,,,Derek Fisher,,,,,,def,,
Darren Collison,David West,Devin Brown,Emeka Okafor,James Posey,Andrew Bynum,Derek Fisher,Kobe Bryant,Pau Gasol,Ron Artest,1,9:31,LAL,shot,,,,,,,,,,Derek Fisher,2,,,made,,driving layup,25,6
Darren Collison,David West,Devin Brown,Emeka Okafor,James Posey,Andrew Bynum,Derek Fisher,Kobe Bryant,Pau Gasol,Ron Artest,1,9:31,NOH,foul,,,,,,,,Derek Fisher,,David West,,,,,,shooting,,
Darren Collison,David West,Devin Brown,Emeka Okafor,James Posey,Andrew Bynum,Derek Fisher,Kobe Bryant,Pau Gasol,Ron Artest,1,9:31,LAL,free throw,,,,,,,1,,1,Derek Fisher,,,foul,missed,,,,
Darren Collison,David West,Devin Brown,Emeka Okafor,James Posey,Andrew Bynum,Derek Fisher,Kobe Bryant,Pau Gasol,Ron Artest,1,9:29,NOH,rebound,,,,,,,,,,James Posey,,,,,,def,,
Darren Collison,David West,Devin Brown,Emeka Okafor,James Posey,Andrew Bynum,Derek Fisher,Kobe Bryant,Pau Gasol,Ron Artest,1,9:12,NOH,shot,Devin Brown,,,,,,,,,Emeka Okafor,2,,,made,,jump hook,16,8
Darren Collison,David West,Devin Brown,Emeka Okafor,James Posey,Andrew Bynum,Derek Fisher,Kobe Bryant,Pau Gasol,Ron Artest,1,8:56,LAL,shot,,,,,,,,,,Kobe Bryant,2,,,made,,floating jump,29,12
Darren Collison,David West,Devin Brown,Emeka Okafor,James Posey,Andrew Bynum,Derek Fisher,Kobe Bryant,Pau Gasol,Ron Artest,1,8:44,NOH,shot,,,,,,,,,,Darren Collison,2,,,made,,jump,41,16
Darren Collison,David West,Devin Brown,Emeka Okafor,James Posey,Andrew Bynum,Derek Fisher,Kobe Bryant,Pau Gasol,Ron Artest,1,8:27,LAL,shot,Derek Fisher,,,,,,,,,Andrew Bynum,2,,,made,,layup,25,6
Darren Collison,David West,Devin Brown,Emeka Okafor,James Posey,Andrew Bynum,Derek Fisher,Kobe Bryant,Pau Gasol,Ron Artest,1,8:27,NOH,foul,,,,,,,,Andrew Bynum,,David West,,,,,,shooting,,
Darius Songaila,Darren Collison,Devin Brown,Emeka Okafor,James Posey,Andrew Bynum,Derek Fisher,Kobe Bryant,Pau Gasol,Ron Artest,1,8:27,NOH,sub,,,,Darius Songaila,,David West,,,,,,,,,,,,
Darius Songaila,Darren Collison,Devin Brown,Emeka Okafor,James Posey,Andrew Bynum,Derek Fisher,Kobe Bryant,Pau Gasol,Ron Artest,1,8:27,LAL,free throw,,,,,,,1,,1,Andrew Bynum,,,foul,made,,,,
Darius Songaila,Darren Collison,Devin Brown,Emeka Okafor,James Posey,Andrew Bynum,Derek Fisher,Kobe Bryant,Pau Gasol,Ron Artest,1,8:17,LAL,foul,,,,,,,,Devin Brown,,Kobe Bryant,,,,,,personal,,
Darius Songaila,Darren Collison,Devin Brown,Emeka Okafor,James Posey,Andrew Bynum,Derek Fisher,Kobe Bryant,Pau Gasol,Ron Artest,1,8:09,NOH,shot,,,,,,,,,,Devin Brown,,,,missed,,jump,46,14
Darius Songaila,Darren Collison,Devin Brown,Emeka Okafor,James Posey,Andrew Bynum,Derek Fisher,Kobe Bryant,Pau Gasol,Ron Artest,1,8:08,LAL,rebound,,,,,,,,,,Pau Gasol,,,,,,def,,
Darius Songaila,Darren Collison,Devin Brown,Emeka Okafor,James Posey,Andrew Bynum,Derek Fisher,Kobe Bryant,Pau Gasol,Ron Artest,1,8:02,LAL,shot,,,,,,,,,,Kobe Bryant,,,,missed,,3pt,14,29
Darius Songaila,Darren Collison,Devin Brown,Emeka Okafor,James Posey,Andrew Bynum,Derek Fisher,Kobe Bryant,Pau Gasol,Ron Artest,1,8:01,NOH,rebound,,,,,,,,,,Emeka Okafor,,,,,,def,,
Darius Songaila,Darren Collison,Devin Brown,Emeka Okafor,James Posey,Andrew Bynum,Derek Fisher,Kobe Bryant,Pau Gasol,Ron Artest,1,7:50,NOH,shot,,,,,,,,,,Devin Brown,,,,missed,,driving layup,25,6
Darius Songaila,Darren Collison,Devin Brown,Emeka Okafor,James Posey,Andrew Bynum,Derek Fisher,Kobe Bryant,Pau Gasol,Ron Artest,1,7:48,NOH,rebound,,,,,,,,,,Emeka Okafor,,,,,,off,,
Darius Songaila,Darren Collison,Devin Brown,Emeka Okafor,James Posey,Andrew Bynum,Derek Fisher,Kobe Bryant,Pau Gasol,Ron Artest,1,7:48,NOH,shot,,,,,,,,,,Emeka Okafor,2,,,made,,putback slam dunk,25,6
Darius Songaila,Darren Collison,Devin Brown,Emeka Okafor,James Posey,Andrew Bynum,Derek Fisher,Kobe Bryant,Pau Gasol,Ron Artest,1,7:31,LAL,shot,,,,,,,,,,Pau Gasol,,,,missed,,jump,16,7
Darius Songaila,Darren Collison,Devin Brown,Emeka Okafor,James Posey,Andrew Bynum,Derek Fisher,Kobe Bryant,Pau Gasol,Ron Artest,1,7:30,NOH,rebound,,,,,,,,,,Devin Brown,,,,,,def,,
Darius Songaila,Darren Collison,Devin Brown,Emeka Okafor,James Posey,Andrew Bynum,Derek Fisher,Kobe Bryant,Pau Gasol,Ron Artest,1,7:23,NOH,shot,,,,,,,,,,Devin Brown,,,,missed,,3pt,26,32
Darius Songaila,Darren Collison,Devin Brown,Emeka Okafor,James Posey,Andrew Bynum,Derek Fisher,Kobe Bryant,Pau Gasol,Ron Artest,1,7:23,LAL,rebound,,,,,,,,,,,,,,,,,,
Darius Songaila,Darren Collison,Devin Brown,Emeka Okafor,James Posey,Andrew Bynum,Derek Fisher,Kobe Bryant,Pau Gasol,Ron Artest,1,7:11,LAL,shot,,,James Posey,,,,,,,Pau Gasol,,,,missed,,layup,25,6
Darius Songaila,Darren Collison,Devin Brown,Emeka Okafor,James Posey,Andrew Bynum,Derek Fisher,Kobe Bryant,Pau Gasol,Ron Artest,1,7:11,LAL,rebound,,,,,,,,,,,,,,,,,,
Darius Songaila,Darren Collison,Devin Brown,Emeka Okafor,James Posey,Andrew Bynum,Derek Fisher,Kobe Bryant,Pau Gasol,Ron Artest,1,7:04,LAL,shot,,,,,,,,,,Derek Fisher,,,,missed,,3pt,39,27
Darius Songaila,Darren Collison,Devin Brown,Emeka Okafor,James Posey,Andrew Bynum,Derek Fisher,Kobe Bryant,Pau Gasol,Ron Artest,1,7:03,NOH,rebound,,,,,,,,,,James Posey,,,,,,def,,
Darius Songaila,Darren Collison,Devin Brown,Emeka Okafor,James Posey,Andrew Bynum,Derek Fisher,Kobe Bryant,Pau Gasol,Ron Artest,1,6:54,NOH,turnover,,,,,,,,,,Darren Collison,,,bad pass,,Derek Fisher,,,
Darius Songaila,Darren Collison,Devin Brown,Emeka Okafor,James Posey,Andrew Bynum,Derek Fisher,Kobe Bryant,Pau Gasol,Ron Artest,1,6:52,LAL,turnover,,,,,,,,,,Ron Artest,,,palming turnover,,,,,
Darius Songaila,Darren Collison,Devin Brown,Emeka Okafor,James Posey,Andrew Bynum,Derek Fisher,Kobe Bryant,Pau Gasol,Ron Artest,1,6:35,NOH,shot,,,,,,,,,,Emeka Okafor,,,,missed,,layup,25,6
Darius Songaila,Darren Collison,Devin Brown,Emeka Okafor,James Posey,Andrew Bynum,Derek Fisher,Kobe Bryant,Pau Gasol,Ron Artest,1,6:34,LAL,rebound,,,,,,,,,,Pau Gasol,,,,,,def,,
Darius Songaila,Darren Collison,Devin Brown,Emeka Okafor,James Posey,Andrew Bynum,Derek Fisher,Kobe Bryant,Pau Gasol,Ron Artest,1,6:23,LAL,shot,,,,,,,,,,Andrew Bynum,,,,missed,,hook,23,11
Darius Songaila,Darren Collison,Devin Brown,Emeka Okafor,James Posey,Andrew Bynum,Derek Fisher,Kobe Bryant,Pau Gasol,Ron Artest,1,6:19,NOH,rebound,,,,,,,,,,Emeka Okafor,,,,,,def,,
Darius Songaila,Darren Collison,Devin Brown,Emeka Okafor,James Posey,Andrew Bynum,Derek Fisher,Kobe Bryant,Pau Gasol,Ron Artest,1,6:08,NOH,shot,Devin Brown,,,,,,,,,Emeka Okafor,2,,,made,,jump,11,7
Darius Songaila,Darren Collison,Devin Brown,Emeka Okafor,James Posey,Andrew Bynum,Derek Fisher,Kobe Bryant,Pau Gasol,Ron Artest,1,5:50,LAL,shot,,,,,,,,,,Pau Gasol,,,,missed,,hook,23,12
Darius Songaila,Darren Collison,Devin Brown,Emeka Okafor,James Posey,Andrew Bynum,Derek Fisher,Kobe Bryant,Pau Gasol,Ron Artest,1,5:48,NOH,rebound,,,,,,,,,,Emeka Okafor,,,,,,def,,
Darius Songaila,Darren Collison,Devin Brown,Emeka Okafor,James Posey,Andrew Bynum,Derek Fisher,Kobe Bryant,Pau Gasol,Ron Artest,1,5:36,NOH,shot,Devin Brown,,,,,,,,,Darius Songaila,2,,,made,,jump,36,26
Darius Songaila,Darren Collison,Devin Brown,Emeka Okafor,James Posey,Andrew Bynum,Derek Fisher,Kobe Bryant,Pau Gasol,Ron Artest,1,5:20,LAL,shot,Derek Fisher,,,,,,,,,Ron Artest,2,,,made,,slam dunk,25,6
Darius Songaila,Darren Collison,Devin Brown,Emeka Okafor,James Posey,Andrew Bynum,Derek Fisher,Kobe Bryant,Pau Gasol,Ron Artest,1,4:53,NOH,shot,,,,,,,,,,James Posey,,,,missed,,floating jump,21,11
Darius Songaila,Darren Collison,Devin Brown,Emeka Okafor,James Posey,Andrew Bynum,Derek Fisher,Kobe Bryant,Pau Gasol,Ron Artest,1,4:50,LAL,rebound,,,,,,,,,,Andrew Bynum,,,,,,def,,
Darius Songaila,Darren Collison,Devin Brown,Emeka Okafor,James Posey,Andrew Bynum,Derek Fisher,Kobe Bryant,Pau Gasol,Ron Artest,1,4:47,NOH,foul,,,,,,,,Pau Gasol,,Darius Songaila,,,,,,personal,,
Darius Songaila,Darren Collison,Devin Brown,Emeka Okafor,James Posey,Andrew Bynum,Derek Fisher,Kobe Bryant,Pau Gasol,Ron Artest,1,4:47,LAL,timeout,,,,,,,,,,,,,,,,regular,,
Darius Songaila,Darren Collison,Devin Brown,Emeka Okafor,James Posey,Andrew Bynum,Derek Fisher,Kobe Bryant,Lamar Odom,Ron Artest,1,4:47,LAL,sub,,,,Lamar Odom,,Pau Gasol,,,,,,,,,,,,
Darius Songaila,Darren Collison,Devin Brown,Emeka Okafor,James Posey,Andrew Bynum,Derek Fisher,Kobe Bryant,Lamar Odom,Ron Artest,1,4:37,LAL,shot,Derek Fisher,,,,,,,,,Andrew Bynum,2,,,made,,turnaround jump,21,15
Darius Songaila,Darren Collison,Devin Brown,Emeka Okafor,James Posey,Andrew Bynum,Derek Fisher,Kobe Bryant,Lamar Odom,Ron Artest,1,4:13,NOH,shot,,,,,,,,,,Darren Collison,2,,,made,,floating jump,39,5
Darius Songaila,Darren Collison,Devin Brown,Emeka Okafor,James Posey,Andrew Bynum,Derek Fisher,Kobe Bryant,Lamar Odom,Ron Artest,1,4:05,LAL,turnover,,,,,,,,,,Derek Fisher,,,out of bounds lost ball turnover,,,,,
Darius Songaila,Darren Collison,Devin Brown,Emeka Okafor,James Posey,Andrew Bynum,Derek Fisher,Kobe Bryant,Lamar Odom,Ron Artest,1,3:53,NOH,shot,Devin Brown,,,,,,,,,James Posey,2,,,made,,driving layup,25,6
Darius Songaila,Darren Collison,Devin Brown,Emeka Okafor,James Posey,Andrew Bynum,Derek Fisher,Kobe Bryant,Lamar Odom,Ron Artest,1,3:39,LAL,shot,,,,,,,,,,Kobe Bryant,,,,missed,,driving layup,25,6
Darius Songaila,Darren Collison,Devin Brown,Emeka Okafor,James Posey,Andrew Bynum,Derek Fisher,Kobe Bryant,Lamar Odom,Ron Artest,1,3:38,NOH,rebound,,,,,,,,,,Emeka Okafor,,,,,,def,,
Darius Songaila,Darren Collison,Devin Brown,Emeka Okafor,James Posey,Andrew Bynum,Derek Fisher,Kobe Bryant,Lamar Odom,Ron Artest,1,3:36,LAL,foul,,,,,,,,Darren Collison,,Derek Fisher,,,,,,shooting,,
Darius Songaila,Darren Collison,Devin Brown,Emeka Okafor,James Posey,Andrew Bynum,Derek Fisher,Kobe Bryant,Lamar Odom,Ron Artest,1,3:36,NOH,free throw,,,,,,,1,,2,Darren Collison,,,foul,made,,,,
Darius Songaila,Darren Collison,Devin Brown,Emeka Okafor,James Posey,Andrew Bynum,Derek Fisher,Kobe Bryant,Lamar Odom,Ron Artest,1,3:36,NOH,free throw,,,,,,,2,,2,Darren Collison,,,foul,made,,,,
Darius Songaila,Darren Collison,Devin Brown,Emeka Okafor,James Posey,Andrew Bynum,Derek Fisher,Kobe Bryant,Lamar Odom,Ron Artest,1,3:24,LAL,shot,Derek Fisher,,,,,,,,,Kobe Bryant,2,,,made,,jump,38,23
Darius Songaila,Darren Collison,Devin Brown,Emeka Okafor,James Posey,Andrew Bynum,Derek Fisher,Kobe Bryant,Lamar Odom,Ron Artest,1,3:11,NOH,shot,,,,,,,,,,Devin Brown,,,,missed,,hook,29,6
Darius Songaila,Darren Collison,Devin Brown,Emeka Okafor,James Posey,Andrew Bynum,Derek Fisher,Kobe Bryant,Lamar Odom,Ron Artest,1,3:11,LAL,rebound,,,,,,,,,,,,,,,,,,
Darius Songaila,Darren Collison,Devin Brown,Emeka Okafor,James Posey,Andrew Bynum,Derek Fisher,Kobe Bryant,Lamar Odom,Ron Artest,1,2:57,LAL,shot,,,,,,,,,,Derek Fisher,,,,missed,,jump,28,24
Darius Songaila,Darren Collison,Devin Brown,Emeka Okafor,James Posey,Andrew Bynum,Derek Fisher,Kobe Bryant,Lamar Odom,Ron Artest,1,2:55,NOH,rebound,,,,,,,,,,Devin Brown,,,,,,def,,
Darius Songaila,Darren Collison,Devin Brown,Emeka Okafor,James Posey,Andrew Bynum,Derek Fisher,Kobe Bryant,Lamar Odom,Ron Artest,1,2:31,NOH,shot,,,,,,,,,,Darius Songaila,,,,missed,,floating jump,31,12
Darius Songaila,Darren Collison,Devin Brown,Emeka Okafor,James Posey,Andrew Bynum,Derek Fisher,Kobe Bryant,Lamar Odom,Ron Artest,1,2:28,LAL,rebound,,,,,,,,,,Derek Fisher,,,,,,def,,
Darius Songaila,Darren Collison,Devin Brown,Emeka Okafor,James Posey,Andrew Bynum,Derek Fisher,Kobe Bryant,Lamar Odom,Ron Artest,1,2:16,LAL,shot,Lamar Odom,,,,,,,,,Ron Artest,3,,,made,,3pt,39,27
Darius Songaila,Darren Collison,Devin Brown,Emeka Okafor,James Posey,Andrew Bynum,Derek Fisher,Kobe Bryant,Lamar Odom,Ron Artest,1,1:58,NOH,shot,Devin Brown,,,,,,,,,Darius Songaila,2,,,made,,layup,25,6
Darius Songaila,Darren Collison,Devin Brown,Emeka Okafor,James Posey,Andrew Bynum,Derek Fisher,Kobe Bryant,Lamar Odom,Ron Artest,1,1:45,NOH,foul,,,,,,,,Ron Artest,,Darius Songaila,,,,,,personal,,
Darius Songaila,Darren Collison,Devin Brown,Emeka Okafor,James Posey,Andrew Bynum,Derek Fisher,Kobe Bryant,Lamar Odom,Ron Artest,1,1:45,NOH,timeout,,,,,,,,,,,,,,,,regular,,
Bobby Brown,Darius Songaila,Darren Collison,Devin Brown,James Posey,Andrew Bynum,Derek Fisher,Kobe Bryant,Lamar Odom,Ron Artest,1,1:45,NOH,sub,,,,Bobby Brown,,Emeka Okafor,,,,,,,,,,,,
Bobby Brown,Darius Songaila,Devin Brown,Hilton Armstrong,James Posey,Andrew Bynum,Derek Fisher,Kobe Bryant,Lamar Odom,Ron Artest,1,1:45,NOH,sub,,,,Hilton Armstrong,,Darren Collison,,,,,,,,,,,,
Bobby Brown,Darius Songaila,Devin Brown,Hilton Armstrong,James Posey,Derek Fisher,Kobe Bryant,Lamar Odom,Pau Gasol,Ron Artest,1,1:45,LAL,sub,,,,Pau Gasol,,Andrew Bynum,,,,,,,,,,,,
Bobby Brown,Darius Songaila,Devin Brown,Hilton Armstrong,James Posey,Jordan Farmar,Kobe Bryant,Lamar Odom,Pau Gasol,Ron Artest,1,1:45,LAL,sub,,,,Jordan Farmar,,Derek Fisher,,,,,,,,,,,,
Bobby Brown,Darius Songaila,Devin Brown,Hilton Armstrong,James Posey,Jordan Farmar,Kobe Bryant,Lamar Odom,Pau Gasol,Ron Artest,1,1:45,LAL,free throw,,,,,,,1,,2,Ron Artest,,,foul,made,,,,
Bobby Brown,Darius Songaila,Devin Brown,Hilton Armstrong,James Posey,Jordan Farmar,Kobe Bryant,Lamar Odom,Pau Gasol,Ron Artest,1,1:45,LAL,free throw,,,,,,,2,,2,Ron Artest,,,foul,made,,,,
Bobby Brown,Darius Songaila,Devin Brown,Hilton Armstrong,James Posey,Jordan Farmar,Kobe Bryant,Lamar Odom,Pau Gasol,Ron Artest,1,1:28,NOH,shot,Bobby Brown,,,,,,,,,Darius Songaila,2,,,made,,jump,32,18
Bobby Brown,Darius Songaila,Devin Brown,Hilton Armstrong,James Posey,Jordan Farmar,Kobe Bryant,Lamar Odom,Pau Gasol,Ron Artest,1,1:13,LAL,turnover,,,,,,,,,,Lamar Odom,,,bad pass,,James Posey,,,
Bobby Brown,Darius Songaila,Devin Brown,Hilton Armstrong,James Posey,Jordan Farmar,Kobe Bryant,Lamar Odom,Pau Gasol,Ron Artest,1,1:07,LAL,foul,,,,,,,,James Posey,,Kobe Bryant,,,,,,personal,,
Bobby Brown,Darius Songaila,Devin Brown,Hilton Armstrong,James Posey,Jordan Farmar,Lamar Odom,Pau Gasol,Ron Artest,Shannon Brown,1,1:07,LAL,sub,,,,Shannon Brown,,Kobe Bryant,,,,,,,,,,,,
Bobby Brown,Darius Songaila,Hilton Armstrong,James Posey,Marcus Thornton,Jordan Farmar,Lamar Odom,Pau Gasol,Ron Artest,Shannon Brown,1,1:07,NOH,sub,,,,Marcus Thornton,,Devin Brown,,,,,,,,,,,,
Bobby Brown,Darius Songaila,Hilton Armstrong,James Posey,Marcus Thornton,Jordan Farmar,Lamar Odom,Pau Gasol,Ron Artest,Shannon Brown,1,0:53,NOH,turnover,,,,,,,,,,Marcus Thornton,,,out of bounds lost ball turnover,,,,,
Bobby Brown,Darius Songaila,Hilton Armstrong,James Posey,Marcus Thornton,Jordan Farmar,Lamar Odom,Pau Gasol,Ron Artest,Shannon Brown,1,0:44,LAL,shot,,,,,,,,,,Lamar Odom,2,,,made,,driving slam dunk,25,6
Bobby Brown,Darius Songaila,Hilton Armstrong,James Posey,Marcus Thornton,Jordan Farmar,Lamar Odom,Pau Gasol,Ron Artest,Shannon Brown,1,0:33,NOH,foul,,,,,,,,Pau Gasol,,Hilton Armstrong,,,,,,offensive,,
Bobby Brown,Darius Songaila,Hilton Armstrong,James Posey,Marcus Thornton,Jordan Farmar,Lamar Odom,Pau Gasol,Ron Artest,Shannon Brown,1,0:33,NOH,turnover,,,,,,,,,,Hilton Armstrong,,,foul,,,,,
Bobby Brown,Darius Songaila,Hilton Armstrong,James Posey,Marcus Thornton,Jordan Farmar,Lamar Odom,Pau Gasol,Ron Artest,Shannon Brown,1,0:15,LAL,shot,,,,,,,,,,Jordan Farmar,,,,missed,,3pt,30,31
Bobby Brown,Darius Songaila,Hilton Armstrong,James Posey,Marcus Thornton,Jordan Farmar,Lamar Odom,Pau Gasol,Ron Artest,Shannon Brown,1,0:15,LAL,rebound,,,,,,,,,,,,,,,,,,
Bobby Brown,Darius Songaila,Hilton Armstrong,James Posey,Marcus Thornton,Jordan Farmar,Lamar Odom,Pau Gasol,Ron Artest,Shannon Brown,1,0:15,NOH,foul,,,,,,,,Pau Gasol,,Hilton Armstrong,,,,,,loose ball,,
Bobby Brown,Darius Songaila,Hilton Armstrong,James Posey,Marcus Thornton,Jordan Farmar,Lamar Odom,Pau Gasol,Ron Artest,Shannon Brown,1,0:15,LAL,free throw,,,,,,,1,,2,Pau Gasol,,,foul,made,,,,
Bobby Brown,Darius Songaila,Hilton Armstrong,James Posey,Marcus Thornton,Jordan Farmar,Lamar Odom,Pau Gasol,Ron Artest,Shannon Brown,1,0:15,LAL,free throw,,,,,,,2,,2,Pau Gasol,,,foul,made,,,,
Bobby Brown,Darius Songaila,Hilton Armstrong,James Posey,Marcus Thornton,Jordan Farmar,Lamar Odom,Pau Gasol,Ron Artest,Shannon Brown,1,0:00,LAL,foul,,,,,,,,Hilton Armstrong,,Shannon Brown,,,,,,shooting,,
Bobby Brown,Darius Songaila,Hilton Armstrong,James Posey,Marcus Thornton,Jordan Farmar,Lamar Odom,Pau Gasol,Ron Artest,Shannon Brown,1,0:00,NOH,free throw,,,,,,,1,,2,Hilton Armstrong,,,foul,made,,,,
Bobby Brown,Darius Songaila,Hilton Armstrong,James Posey,Marcus Thornton,Jordan Farmar,Lamar Odom,Pau Gasol,Ron Artest,Shannon Brown,1,0:00,NOH,free throw,,,,,,,2,,2,Hilton Armstrong,,,foul,missed,,,,
Bobby Brown,Darius Songaila,Hilton Armstrong,James Posey,Marcus Thornton,Jordan Farmar,Lamar Odom,Pau Gasol,Ron Artest,Shannon Brown,1,0:00,NOH,rebound,,,,,,,,,,Hilton Armstrong,,,,,,off,,
Bobby Brown,Darius Songaila,Hilton Armstrong,James Posey,Marcus Thornton,Jordan Farmar,Lamar Odom,Pau Gasol,Ron Artest,Shannon Brown,2,12:00,NOH,turnover,,,,,,,,,,James Posey,,,out of bounds lost ball turnover,,,,,
Bobby Brown,Darius Songaila,Hilton Armstrong,James Posey,Marcus Thornton,Jordan Farmar,Lamar Odom,Pau Gasol,Ron Artest,Shannon Brown,2,12:00,NOH,violation,,,,,,,,,,,,,,,,delay of game,,
Bobby Brown,Darius Songaila,Hilton Armstrong,James Posey,Marcus Thornton,Jordan Farmar,Lamar Odom,Pau Gasol,Ron Artest,Shannon Brown,2,11:58,LAL,turnover,,,,,,,,,,Ron Artest,,,bad pass,,Bobby Brown,,,
Bobby Brown,Darius Songaila,Hilton Armstrong,James Posey,Marcus Thornton,Jordan Farmar,Lamar Odom,Pau Gasol,Ron Artest,Shannon Brown,2,11:53,NOH,shot,,,,,,,,,,Bobby Brown,,,,missed,,jump,15,25
Bobby Brown,Darius Songaila,Hilton Armstrong,James Posey,Marcus Thornton,Jordan Farmar,Lamar Odom,Pau Gasol,Ron Artest,Shannon Brown,2,11:52,LAL,rebound,,,,,,,,,,Lamar Odom,,,,,,def,,
Bobby Brown,Darius Songaila,Hilton Armstrong,James Posey,Marcus Thornton,Jordan Farmar,Lamar Odom,Pau Gasol,Ron Artest,Shannon Brown,2,11:47,LAL,shot,,,,,,,,,,Ron Artest,,,,missed,,3pt,11,28
Bobby Brown,Darius Songaila,Hilton Armstrong,James Posey,Marcus Thornton,Jordan Farmar,Lamar Odom,Pau Gasol,Ron Artest,Shannon Brown,2,11:47,LAL,rebound,,,,,,,,,,,,,,,,,,
Bobby Brown,Darius Songaila,Hilton Armstrong,James Posey,Marcus Thornton,Jordan Farmar,Lamar Odom,Pau Gasol,Ron Artest,Shannon Brown,2,11:47,NOH,foul,,,,,,,,Pau Gasol,,Darius Songaila,,,,,,loose ball,,
Bobby Brown,David West,Hilton Armstrong,James Posey,Marcus Thornton,Jordan Farmar,Lamar Odom,Pau Gasol,Ron Artest,Shannon Brown,2,11:47,NOH,sub,,,,David West,,Darius Songaila,,,,,,,,,,,,
Bobby Brown,David West,Hilton Armstrong,James Posey,Marcus Thornton,Jordan Farmar,Lamar Odom,Pau Gasol,Ron Artest,Shannon Brown,2,11:33,NOH,foul,,,,,,,,Pau Gasol,,Marcus Thornton,,,,,,shooting,,
Bobby Brown,David West,Hilton Armstrong,James Posey,Marcus Thornton,Jordan Farmar,Lamar Odom,Pau Gasol,Ron Artest,Shannon Brown,2,11:33,LAL,free throw,,,,,,,1,,2,Pau Gasol,,,foul,made,,,,
Bobby Brown,David West,Hilton Armstrong,James Posey,Marcus Thornton,Jordan Farmar,Lamar Odom,Pau Gasol,Ron Artest,Shannon Brown,2,11:33,LAL,free throw,,,,,,,2,,2,Pau Gasol,,,foul,made,,,,
Bobby Brown,David West,Hilton Armstrong,James Posey,Marcus Thornton,Jordan Farmar,Lamar Odom,Pau Gasol,Ron Artest,Shannon Brown,2,11:21,NOH,shot,,,,,,,,,,Marcus Thornton,,,,missed,,3pt,13,28
Bobby Brown,David West,Hilton Armstrong,James Posey,Marcus Thornton,Jordan Farmar,Lamar Odom,Pau Gasol,Ron Artest,Shannon Brown,2,11:19,LAL,rebound,,,,,,,,,,Jordan Farmar,,,,,,def,,
Bobby Brown,David West,Hilton Armstrong,James Posey,Marcus Thornton,Jordan Farmar,Lamar Odom,Pau Gasol,Ron Artest,Shannon Brown,2,11:00,LAL,shot,Jordan Farmar,,,,,,,,,Ron Artest,2,,,made,,reverse layup,25,6
Bobby Brown,David West,Hilton Armstrong,James Posey,Marcus Thornton,Jordan Farmar,Lamar Odom,Pau Gasol,Ron Artest,Shannon Brown,2,10:38,NOH,shot,,,,,,,,,,Bobby Brown,,,,missed,,3pt,42,24
Bobby Brown,David West,Hilton Armstrong,James Posey,Marcus Thornton,Jordan Farmar,Lamar Odom,Pau Gasol,Ron Artest,Shannon Brown,2,10:37,LAL,rebound,,,,,,,,,,Lamar Odom,,,,,,def,,
Bobby Brown,David West,Hilton Armstrong,James Posey,Marcus Thornton,Jordan Farmar,Lamar Odom,Pau Gasol,Ron Artest,Shannon Brown,2,10:34,LAL,turnover,,,,,,,,,,Lamar Odom,,,bad pass,,Bobby Brown,,,
Bobby Brown,David West,Hilton Armstrong,James Posey,Marcus Thornton,Jordan Farmar,Lamar Odom,Pau Gasol,Ron Artest,Shannon Brown,2,10:26,NOH,shot,,,,,,,,,,Bobby Brown,2,,,made,,pullup jump,32,21
Bobby Brown,David West,Hilton Armstrong,James Posey,Marcus Thornton,Jordan Farmar,Lamar Odom,Pau Gasol,Ron Artest,Shannon Brown,2,10:11,LAL,foul,,,,,,,,Hilton Armstrong,,Pau Gasol,,,,,,offensive,,
Bobby Brown,David West,Hilton Armstrong,James Posey,Marcus Thornton,Jordan Farmar,Lamar Odom,Pau Gasol,Ron Artest,Shannon Brown,2,10:11,LAL,turnover,,,,,,,,,,Pau Gasol,,,foul,,,,,
Bobby Brown,David West,Hilton Armstrong,James Posey,Marcus Thornton,Jordan Farmar,Lamar Odom,Pau Gasol,Ron Artest,Shannon Brown,2,9:56,NOH,shot,,,,,,,,,,David West,2,,,made,,driving layup,25,6
Bobby Brown,David West,Hilton Armstrong,James Posey,Marcus Thornton,Jordan Farmar,Lamar Odom,Pau Gasol,Ron Artest,Shannon Brown,2,9:35,LAL,shot,,,,,,,,,,Lamar Odom,,,,missed,,jump,12,22
Bobby Brown,David West,Hilton Armstrong,James Posey,Marcus Thornton,Jordan Farmar,Lamar Odom,Pau Gasol,Ron Artest,Shannon Brown,2,9:34,NOH,rebound,,,,,,,,,,Hilton Armstrong,,,,,,def,,
Bobby Brown,David West,Hilton Armstrong,James Posey,Marcus Thornton,Jordan Farmar,Lamar Odom,Pau Gasol,Ron Artest,Shannon Brown,2,9:34,LAL,foul,,,,,,,,Hilton Armstrong,,Ron Artest,,,,,,loose ball,,
Bobby Brown,David West,Hilton Armstrong,James Posey,Marcus Thornton,Jordan Farmar,Lamar Odom,Pau Gasol,Ron Artest,Shannon Brown,2,9:14,NOH,shot,,,,,,,,,,David West,,,,missed,,hook,30,12
Bobby Brown,David West,Hilton Armstrong,James Posey,Marcus Thornton,Jordan Farmar,Lamar Odom,Pau Gasol,Ron Artest,Shannon Brown,2,9:12,NOH,rebound,,,,,,,,,,Hilton Armstrong,,,,,,off,,