a1,a2,a3,a4,a5,h1,h2,h3,h4,h5,period,time,team,etype,assist,away,block,entered,home,left,num,opponent,outof,player,points,possession,reason,result,steal,type,x,y
Marc Gasol,Mike Conley,O.J. Mayo,Rudy Gay,Zach Randolph,Al Thornton,Baron Davis,Chris Kaman,Eric Gordon,Marcus Camby,1,12:00,OFF,jump ball,,Marc Gasol,,,Marcus Camby,,,,,,,Mike Conley,,,,,,
Marc Gasol,Mike Conley,O.J. Mayo,Rudy Gay,Zach Randolph,Al Thornton,Baron Davis,Chris Kaman,Eric Gordon,Marcus Camby,1,11:37,MEM,shot,,,,,,,,,,Rudy Gay,2,,,made,,jump,10,15
Marc Gasol,Mike Conley,O.J. Mayo,Rudy Gay,Zach Randolph,Al Thornton,Baron Davis,Chris Kaman,Eric Gordon,Marcus Camby,1,11:21,LAC,shot,,,Marc Gasol,,,,,,,Al Thornton,,,,missed,,jump,17,9
Marc Gasol,Mike Conley,O.J. Mayo,Rudy Gay,Zach Randolph,Al Thornton,Baron Davis,Chris Kaman,Eric Gordon,Marcus Camby,1,11:19,MEM,rebound,,,,,,,,,,Zach Randolph,,,,,,def,,
Marc Gasol,Mike Conley,O.J. Mayo,Rudy Gay,Zach Randolph,Al Thornton,Baron Davis,Chris Kaman,Eric Gordon,Marcus Camby,1,11:14,MEM,shot,Mike Conley,,,,,,,,,Rudy Gay,2,,,made,,running jump,13,24
Marc Gasol,Mike Conley,O.J. Mayo,Rudy Gay,Zach Randolph,Al Thornton,Baron Davis,Chris Kaman,Eric Gordon,Marcus Camby,1,10:53,LAC,turnover,,,,,,,,,,Baron Davis,,,bad pass,,Rudy Gay,,,
Marc Gasol,Mike Conley,O.J. Mayo,Rudy Gay,Zach Randolph,Al Thornton,Baron Davis,Chris Kaman,Eric Gordon,Marcus Camby,1,10:49,MEM,turnover,,,,,,,,,,Rudy Gay,,,bad pass,,Eric Gordon,,,
Marc Gasol,Mike Conley,O.J. Mayo,Rudy Gay,Zach Randolph,Al Thornton,Baron Davis,Chris Kaman,Eric Gordon,Marcus Camby,1,10:44,LAC,shot,Eric Gordon,,,,,,,,,Marcus Camby,2,,,made,,jump,44,6
Marc Gasol,Mike Conley,O.J. Mayo,Rudy Gay,Zach Randolph,Al Thornton,Baron Davis,Chris Kaman,Eric Gordon,Marcus Camby,1,10:20,MEM,shot,,,,,,,,,,Zach Randolph,,,,missed,,jump,41,18
Marc Gasol,Mike Conley,O.J. Mayo,Rudy Gay,Zach Randolph,Al Thornton,Baron Davis,Chris Kaman,Eric Gordon,Marcus Camby,1,10:19,LAC,rebound,,,,,,,,,,Chris Kaman,,,,,,def,,
Marc Gasol,Mike Conley,O.J. Mayo,Rudy Gay,Zach Randolph,Al Thornton,Baron Davis,Chris Kaman,Eric Gordon,Marcus Camby,1,10:11,LAC,turnover,,,,,,,,,,Baron Davis,,,bad pass,,O.J. Mayo,,,
Marc Gasol,Mike Conley,O.J. Mayo,Rudy Gay,Zach Randolph,Al Thornton,Baron Davis,Chris Kaman,Eric Gordon,Marcus Camby,1,10:05,MEM,shot,O.J. Mayo,,,,,,,,,Rudy Gay,2,,,made,,driving dunk,25,6
Marc Gasol,Mike Conley,O.J. Mayo,Rudy Gay,Zach Randolph,Al Thornton,Baron Davis,Chris Kaman,Eric Gordon,Marcus Camby,1,9:51,MEM,foul,,,,,,,,Baron Davis,,Mike Conley,,,,,,personal,,
Marc Gasol,Mike Conley,O.J. Mayo,Rudy Gay,Zach Randolph,Al Thornton,Baron Davis,Chris Kaman,Eric Gordon,Marcus Camby,1,9:47,LAC,turnover,,,,,,,,,,Marcus Camby,,,bad pass,,,,,
Marc Gasol,Mike Conley,O.J. Mayo,Rudy Gay,Zach Randolph,Al Thornton,Baron Davis,Chris Kaman,Eric Gordon,Marcus Camby,1,9:29,MEM,shot,,,Marcus Camby,,,,,,,Zach Randolph,,,,missed,,jump,26,10
Marc Gasol,Mike Conley,O.J. Mayo,Rudy Gay,Zach Randolph,Al Thornton,Baron Davis,Chris Kaman,Eric Gordon,Marcus Camby,1,9:27,LAC,rebound,,,,,,,,,,Eric Gordon,,,,,,def,,
Marc Gasol,Mike Conley,O.J. Mayo,Rudy Gay,Zach Randolph,Al Thornton,Baron Davis,Chris Kaman,Eric Gordon,Marcus Camby,1,9:25,LAC,turnover,,,,,,,,,,Eric Gordon,,,bad pass,,Rudy Gay,,,
Marc Gasol,Mike Conley,O.J. Mayo,Rudy Gay,Zach Randolph,Al Thornton,Baron Davis,Chris Kaman,Eric Gordon,Marcus Camby,1,9:20,MEM,shot,,,,,,,,,,Rudy Gay,2,,,made,,driving dunk,25,6
Marc Gasol,Mike Conley,O.J. Mayo,Rudy Gay,Zach Randolph,Al Thornton,Baron Davis,Chris Kaman,Eric Gordon,Marcus Camby,1,8:56,LAC,shot,,,,,,,,,,Marcus Camby,,,,missed,,jump,17,20
Marc Gasol,Mike Conley,O.J. Mayo,Rudy Gay,Zach Randolph,Al Thornton,Baron Davis,Chris Kaman,Eric Gordon,Marcus Camby,1,8:54,MEM,rebound,,,,,,,,,,Marc Gasol,,,,,,def,,
Marc Gasol,Mike Conley,O.J. Mayo,Rudy Gay,Zach Randolph,Al Thornton,Baron Davis,Chris Kaman,Eric Gordon,Marcus Camby,1,8:37,MEM,shot,Marc Gasol,,,,,,,,,Mike Conley,3,,,made,,3pt,48,10
Marc Gasol,Mike Conley,O.J. Mayo,Rudy Gay,Zach Randolph,Al Thornton,Baron Davis,Chris Kaman,Eric Gordon,Marcus Camby,1,8:30,LAC,timeout,,,,,,,,,,,,,,,,regular,,
Marc Gasol,Mike Conley,O.J. Mayo,Rudy Gay,Zach Randolph,Al Thornton,Baron Davis,Chris Kaman,Eric Gordon,Marcus Camby,1,8:24,LAC,turnover,,,,,,,,,,Chris Kaman,,,lost ball,,Zach Randolph,,,
Marc Gasol,Mike Conley,O.J. Mayo,Rudy Gay,Zach Randolph,Al Thornton,Baron Davis,Chris Kaman,Eric Gordon,Marcus Camby,1,8:08,MEM,turnover,,,,,,,,,,O.J. Mayo,,,lost ball,,Baron Davis,,,
Marc Gasol,Mike Conley,O.J. Mayo,Rudy Gay,Zach Randolph,Al Thornton,Baron Davis,Chris Kaman,Eric Gordon,Marcus Camby,1,8:04,LAC,shot,Chris Kaman,,,,,,,,,Eric Gordon,2,,,made,,driving layup,25,6
Marc Gasol,Mike Conley,O.J. Mayo,Rudy Gay,Zach Randolph,Al Thornton,Baron Davis,Chris Kaman,Eric Gordon,Marcus Camby,1,7:54,MEM,foul,,,,,,,,Eric Gordon,,Zach Randolph,,,,,,offensive,,
Marc Gasol,Mike Conley,O.J. Mayo,Rudy Gay,Zach Randolph,Al Thornton,Baron Davis,Chris Kaman,Eric Gordon,Marcus Camby,1,7:54,MEM,turnover,,,,,,,,,,Zach Randolph,,,foul,,,,,
Marc Gasol,Mike Conley,O.J. Mayo,Rudy Gay,Zach Randolph,Al Thornton,Baron Davis,Chris Kaman,Eric Gordon,Marcus Camby,1,7:32,LAC,shot,,,,,,,,,,Al Thornton,,,,missed,,layup,25,6
Marc Gasol,Mike Conley,O.J. Mayo,Rudy Gay,Zach Randolph,Al Thornton,Baron Davis,Chris Kaman,Eric Gordon,Marcus Camby,1,7:31,LAC,rebound,,,,,,,,,,Chris Kaman,,,,,,off,,
Marc Gasol,Mike Conley,O.J. Mayo,Rudy Gay,Zach Randolph,Al Thornton,Baron Davis,Chris Kaman,Eric Gordon,Marcus Camby,1,7:31,LAC,shot,,,,,,,,,,Chris Kaman,,,,missed,,tip,25,6
Marc Gasol,Mike Conley,O.J. Mayo,Rudy Gay,Zach Randolph,Al Thornton,Baron Davis,Chris Kaman,Eric Gordon,Marcus Camby,1,7:29,LAC,rebound,,,,,,,,,,Al Thornton,,,,,,off,,
Marc Gasol,Mike Conley,O.J. Mayo,Rudy Gay,Zach Randolph,Al Thornton,Baron Davis,Chris Kaman,Eric Gordon,Marcus Camby,1,7:27,LAC,shot,,,,,,,,,,Al Thornton,2,,,made,,fade away jumper,26,16
Marc Gasol,Mike Conley,O.J. Mayo,Rudy Gay,Zach Randolph,Al Thornton,Baron Davis,Chris Kaman,Eric Gordon,Marcus Camby,1,7:14,MEM,shot,,,,,,,,,,Mike Conley,2,,,made,,jump,25,23
Marc Gasol,Mike Conley,O.J. Mayo,Rudy Gay,Zach Randolph,Al Thornton,Baron Davis,Chris Kaman,Eric Gordon,Marcus Camby,1,7:05,LAC,shot,,,,,,,,,,Eric Gordon,,,,missed,,running jump,22,10
Marc Gasol,Mike Conley,O.J. Mayo,Rudy Gay,Zach Randolph,Al Thornton,Baron Davis,Chris Kaman,Eric Gordon,Marcus Camby,1,7:02,LAC,rebound,,,,,,,,,,Chris Kaman,,,,,,off,,
Marc Gasol,Mike Conley,O.J. Mayo,Rudy Gay,Zach Randolph,Al Thornton,Baron Davis,Chris Kaman,Eric Gordon,Marcus Camby,1,7:01,LAC,shot,,,,,,,,,,Al Thornton,2,,,made,,layup,25,6
Marc Gasol,Mike Conley,O.J. Mayo,Rudy Gay,Zach Randolph,Al Thornton,Baron Davis,Chris Kaman,Eric Gordon,Marcus Camby,1,6:34,MEM,shot,,,,,,,,,,Mike Conley,2,,,made,,jump bank,35,17
Marc Gasol,Mike Conley,O.J. Mayo,Rudy Gay,Zach Randolph,Al Thornton,Baron Davis,Chris Kaman,Eric Gordon,Marcus Camby,1,6:22,LAC,shot,,,,,,,,,,Chris Kaman,,,,missed,,jump,19,10
Marc Gasol,Mike Conley,O.J. Mayo,Rudy Gay,Zach Randolph,Al Thornton,Baron Davis,Chris Kaman,Eric Gordon,Marcus Camby,1,6:20,MEM,rebound,,,,,,,,,,Zach Randolph,,,,,,def,,
Marc Gasol,Mike Conley,O.J. Mayo,Rudy Gay,Zach Randolph,Al Thornton,Baron Davis,Chris Kaman,Eric Gordon,Marcus Camby,1,6:10,MEM,shot,Zach Randolph,,,,,,,,,Marc Gasol,2,,,made,,fade away jumper,37,14
Marc Gasol,Mike Conley,O.J. Mayo,Rudy Gay,Zach Randolph,Al Thornton,Baron Davis,Chris Kaman,Eric Gordon,Marcus Camby,1,5:52,LAC,shot,Marcus Camby,,,,,,,,,Chris Kaman,2,,,made,,jump,8,6
Marc Gasol,Mike Conley,O.J. Mayo,Rudy Gay,Zach Randolph,Al Thornton,Baron Davis,Chris Kaman,Eric Gordon,Marcus Camby,1,5:26,MEM,shot,,,,,,,,,,Rudy Gay,,,,missed,,jump,5,8
Marc Gasol,Mike Conley,O.J. Mayo,Rudy Gay,Zach Randolph,Al Thornton,Baron Davis,Chris Kaman,Eric Gordon,Marcus Camby,1,5:24,LAC,rebound,,,,,,,,,,Eric Gordon,,,,,,def,,
Marc Gasol,Mike Conley,O.J. Mayo,Rudy Gay,Zach Randolph,Al Thornton,Baron Davis,Chris Kaman,Eric Gordon,Marcus Camby,1,5:14,LAC,shot,,,,,,,,,,Chris Kaman,,,,missed,,jump,38,18
Marc Gasol,Mike Conley,O.J. Mayo,Rudy Gay,Zach Randolph,Al Thornton,Baron Davis,Chris Kaman,Eric Gordon,Marcus Camby,1,5:13,MEM,rebound,,,,,,,,,,Mike Conley,,,,,,def,,
Marc Gasol,Mike Conley,O.J. Mayo,Rudy Gay,Zach Randolph,Al Thornton,Baron Davis,Chris Kaman,Eric Gordon,Marcus Camby,1,5:11,LAC,foul,,,,,,,,Zach Randolph,,Chris Kaman,,,,,,personal,,
Marc Gasol,Mike Conley,O.J. Mayo,Rudy Gay,Zach Randolph,Al Thornton,Baron Davis,Chris Kaman,Eric Gordon,Marcus Camby,1,4:59,MEM,shot,,,,,,,,,,Marc Gasol,2,,,made,,fade away jumper,36,6
Marc Gasol,Mike Conley,O.J. Mayo,Rudy Gay,Zach Randolph,Al Thornton,Baron Davis,Chris Kaman,Eric Gordon,Marcus Camby,1,4:40,LAC,shot,Marcus Camby,,,,,,,,,Eric Gordon,2,,,made,,jump,12,26
Marc Gasol,Mike Conley,O.J. Mayo,Rudy Gay,Zach Randolph,Al Thornton,Baron Davis,Chris Kaman,Eric Gordon,Marcus Camby,1,4:12,MEM,shot,,,,,,,,,,Mike Conley,,,,missed,,3pt,45,25
Marc Gasol,Mike Conley,O.J. Mayo,Rudy Gay,Zach Randolph,Al Thornton,Baron Davis,Chris Kaman,Eric Gordon,Marcus Camby,1,4:11,LAC,rebound,,,,,,,,,,Marcus Camby,,,,,,def,,
Marc Gasol,Mike Conley,O.J. Mayo,Rudy Gay,Zach Randolph,Al Thornton,Baron Davis,Chris Kaman,Eric Gordon,Marcus Camby,1,4:03,LAC,shot,Baron Davis,,,,,,,,,Marcus Camby,2,,,made,,alley oop layup,25,6
Marc Gasol,Mike Conley,O.J. Mayo,Rudy Gay,Zach Randolph,Al Thornton,Baron Davis,Chris Kaman,Eric Gordon,Marcus Camby,1,3:42,MEM,turnover,,,,,,,,,,Rudy Gay,,,bad pass,,,,,
Marc Gasol,Mike Conley,O.J. Mayo,Rudy Gay,Zach Randolph,Al Thornton,Baron Davis,Chris Kaman,Eric Gordon,Marcus Camby,1,3:26,LAC,shot,,,Marc Gasol,,,,,,,Eric Gordon,,,,missed,,jump,23,15
Marc Gasol,Mike Conley,O.J. Mayo,Rudy Gay,Zach Randolph,Al Thornton,Baron Davis,Chris Kaman,Eric Gordon,Marcus Camby,1,3:24,MEM,rebound,,,,,,,,,,Rudy Gay,,,,,,def,,
Marc Gasol,Mike Conley,O.J. Mayo,Rudy Gay,Zach Randolph,Al Thornton,Baron Davis,Chris Kaman,Eric Gordon,Marcus Camby,1,3:18,MEM,shot,,,,,,,,,,Mike Conley,,,,missed,,3pt,8,27
Marc Gasol,Mike Conley,O.J. Mayo,Rudy Gay,Zach Randolph,Al Thornton,Baron Davis,Chris Kaman,Eric Gordon,Marcus Camby,1,3:17,LAC,rebound,,,,,,,,,,Marcus Camby,,,,,,def,,
Marc Gasol,Mike Conley,O.J. Mayo,Rudy Gay,Zach Randolph,Al Thornton,Baron Davis,Chris Kaman,Eric Gordon,Marcus Camby,1,3:11,MEM,foul,,,,,,,,Baron Davis,,Rudy Gay,,,,,,personal,,
Jamaal Tinsley,Marc Gasol,O.J. Mayo,Rudy Gay,Zach Randolph,Al Thornton,Baron Davis,Chris Kaman,Eric Gordon,Marcus Camby,1,3:11,MEM,sub,,,,Jamaal Tinsley,,Mike Conley,,,,,,,,,,,,
Jamaal Tinsley,Marc Gasol,O.J. Mayo,Rudy Gay,Zach Randolph,Al Thornton,Baron Davis,Chris Kaman,Eric Gordon,Marcus Camby,1,3:02,LAC,shot,,,,,,,,,,Chris Kaman,,,,missed,,jump,10,7
Jamaal Tinsley,Marc Gasol,O.J. Mayo,Rudy Gay,Zach Randolph,Al Thornton,Baron Davis,Chris Kaman,Eric Gordon,Marcus Camby,1,3:00,MEM,rebound,,,,,,,,,,Zach Randolph,,,,,,def,,
Jamaal Tinsley,Marc Gasol,O.J. Mayo,Rudy Gay,Zach Randolph,Al Thornton,Baron Davis,Chris Kaman,Eric Gordon,Marcus Camby,1,2:52,LAC,foul,,,,,,,,Zach Randolph,,Marcus Camby,,,,,,personal,,
Jamaal Tinsley,Marc Gasol,O.J. Mayo,Rudy Gay,Zach Randolph,Al Thornton,Baron Davis,Chris Kaman,Eric Gordon,Marcus Camby,1,2:52,MEM,timeout,,,,,,,,,,,,,,,,regular,,
Jamaal Tinsley,Marc Gasol,O.J. Mayo,Rudy Gay,Zach Randolph,Al Thornton,Baron Davis,DeAndre Jordan,Eric Gordon,Marcus Camby,1,2:52,LAC,sub,,,,DeAndre Jordan,,Chris Kaman,,,,,,,,,,,,
Jamaal Tinsley,Marc Gasol,Rudy Gay,Sam Young,Zach Randolph,Al Thornton,Baron Davis,DeAndre Jordan,Eric Gordon,Marcus Camby,1,2:52,MEM,sub,,,,Sam Young,,O.J. Mayo,,,,,,,,,,,,
Jamaal Tinsley,Marc Gasol,Rudy Gay,Sam Young,Zach Randolph,Al Thornton,Baron Davis,DeAndre Jordan,Eric Gordon,Marcus Camby,1,2:42,MEM,shot,,,,,,,,,,Sam Young,,,,missed,,layup,25,6
Jamaal Tinsley,Marc Gasol,Rudy Gay,Sam Young,Zach Randolph,Al Thornton,Baron Davis,DeAndre Jordan,Eric Gordon,Marcus Camby,1,2:39,LAC,rebound,,,,,,,,,,Marcus Camby,,,,,,def,,
Jamaal Tinsley,Marc Gasol,Rudy Gay,Sam Young,Zach Randolph,Al Thornton,Baron Davis,DeAndre Jordan,Eric Gordon,Marcus Camby,1,2:34,LAC,shot,Baron Davis,,,,,,,,,Eric Gordon,3,,,made,,3pt,9,28
Jamaal Tinsley,Marc Gasol,Rudy Gay,Sam Young,Zach Randolph,Al Thornton,Baron Davis,DeAndre Jordan,Eric Gordon,Marcus Camby,1,2:12,MEM,shot,Marc Gasol,,,,,,,,,Jamaal Tinsley,3,,,made,,3pt,22,32
Jamaal Tinsley,Marc Gasol,Rudy Gay,Sam Young,Zach Randolph,Al Thornton,Baron Davis,DeAndre Jordan,Eric Gordon,Marcus Camby,1,1:50,LAC,shot,,,,,,,,,,Al Thornton,,,,missed,,jump,10,14
Jamaal Tinsley,Marc Gasol,Rudy Gay,Sam Young,Zach Randolph,Al Thornton,Baron Davis,DeAndre Jordan,Eric Gordon,Marcus Camby,1,1:49,MEM,rebound,,,,,,,,,,Rudy Gay,,,,,,def,,
Jamaal Tinsley,Marc Gasol,Rudy Gay,Sam Young,Zach Randolph,Al Thornton,Baron Davis,DeAndre Jordan,Eric Gordon,Marcus Camby,1,1:40,MEM,shot,,,,,,,,,,Zach Randolph,,,,missed,,jump,37,6
Jamaal Tinsley,Marc Gasol,Rudy Gay,Sam Young,Zach Randolph,Al Thornton,Baron Davis,DeAndre Jordan,Eric Gordon,Marcus Camby,1,1:39,LAC,rebound,,,,,,,,,,Marcus Camby,,,,,,def,,
Jamaal Tinsley,Marc Gasol,Rudy Gay,Sam Young,Zach Randolph,Al Thornton,Baron Davis,DeAndre Jordan,Eric Gordon,Marcus Camby,1,1:32,LAC,shot,,,,,,,,,,Baron Davis,2,,,made,,jump,17,25
Jamaal Tinsley,Marc Gasol,Rudy Gay,Sam Young,Zach Randolph,Al Thornton,Baron Davis,DeAndre Jordan,Eric Gordon,Marcus Camby,1,1:20,MEM,shot,,,,,,,,,,Zach Randolph,,,,missed,,jump,7,8
Jamaal Tinsley,Marc Gasol,Rudy Gay,Sam Young,Zach Randolph,Al Thornton,Baron Davis,DeAndre Jordan,Eric Gordon,Marcus Camby,1,1:18,LAC,rebound,,,,,,,,,,DeAndre Jordan,,,,,,def,,
Jamaal Tinsley,Marc Gasol,Rudy Gay,Sam Young,Zach Randolph,Al Thornton,Baron Davis,DeAndre Jordan,Eric Gordon,Marcus Camby,1,1:09,LAC,shot,,,,,,,,,,Baron Davis,2,,,made,,jump,21,21
Jamaal Tinsley,Marc Gasol,Rudy Gay,Sam Young,Zach Randolph,Al Thornton,Baron Davis,DeAndre Jordan,Eric Gordon,Marcus Camby,1,0:45,MEM,shot,,,,,,,,,,Sam Young,2,,,made,,jump hook,30,13
Jamaal Tinsley,Marc Gasol,Rudy Gay,Sam Young,Zach Randolph,Al Thornton,Baron Davis,DeAndre Jordan,Eric Gordon,Marcus Camby,1,0:35,LAC,shot,,,,,,,,,,Al Thornton,,,,missed,,jump,25,10
Jamaal Tinsley,Marc Gasol,Rudy Gay,Sam Young,Zach Randolph,Al Thornton,Baron Davis,DeAndre Jordan,Eric Gordon,Marcus Camby,1,0:32,MEM,rebound,,,,,,,,,,Zach Randolph,,,,,,def,,
Jamaal Tinsley,Marc Gasol,Rudy Gay,Sam Young,Zach Randolph,Al Thornton,Baron Davis,DeAndre Jordan,Eric Gordon,Marcus Camby,1,0:30,MEM,shot,Jamaal Tinsley,,,,,,,,,Marc Gasol,2,,,made,,layup,25,6
Jamaal Tinsley,Marc Gasol,Rudy Gay,Sam Young,Zach Randolph,Al Thornton,Baron Davis,DeAndre Jordan,Eric Gordon,Marcus Camby,1,0:12,LAC,shot,,,,,,,,,,Baron Davis,,,,missed,,jump,24,24
Jamaal Tinsley,Marc Gasol,Rudy Gay,Sam Young,Zach Randolph,Al Thornton,Baron Davis,DeAndre Jordan,Eric Gordon,Marcus Camby,1,0:11,MEM,rebound,,,,,,,,,,Marc Gasol,,,,,,def,,
Jamaal Tinsley,Marc Gasol,Rudy Gay,Sam Young,Zach Randolph,Al Thornton,Baron Davis,DeAndre Jordan,Eric Gordon,Marcus Camby,1,0:00,MEM,shot,,,,,,,,,,Jamaal Tinsley,2,,,made,,layup,25,6
Hasheem Thabeet,Jamaal Tinsley,O.J. Mayo,Sam Young,Zach Randolph,Al Thornton,Baron Davis,Craig Smith,DeAndre Jordan,Eric Gordon,2,11:39,LAC,shot,,,,,,,,,,Baron Davis,2,,,made,,driving layup,25,6
Hasheem Thabeet,Jamaal Tinsley,O.J. Mayo,Sam Young,Zach Randolph,Al Thornton,Baron Davis,Craig Smith,DeAndre Jordan,Eric Gordon,2,11:10,MEM,shot,,,,,,,,,,Jamaal Tinsley,,,,missed,,3pt,46,22
Hasheem Thabeet,Jamaal Tinsley,O.J. Mayo,Sam Young,Zach Randolph,Al Thornton,Baron Davis,Craig Smith,DeAndre Jordan,Eric Gordon,2,11:10,MEM,rebound,,,,,,,,,,Hasheem Thabeet,,,,,,off,,
Hasheem Thabeet,Jamaal Tinsley,O.J. Mayo,Sam Young,Zach Randolph,Al Thornton,Baron Davis,Craig Smith,DeAndre Jordan,Eric Gordon,2,11:10,MEM,turnover,,,,,,,,,,Hasheem Thabeet,,,traveling,,,,,
Hasheem Thabeet,Jamaal Tinsley,O.J. Mayo,Sam Young,Zach Randolph,Al Thornton,Craig Smith,DeAndre Jordan,Eric Gordon,Sebastian Telfair,2,11:10,LAC,sub,,,,Sebastian Telfair,,Baron Davis,,,,,,,,,,,,
Hasheem Thabeet,Jamaal Tinsley,O.J. Mayo,Sam Young,Zach Randolph,Al Thornton,Craig Smith,DeAndre Jordan,Rasual Butler,Sebastian Telfair,2,11:10,LAC,sub,,,,Rasual Butler,,Eric Gordon,,,,,,,,,,,,
Hasheem Thabeet,Jamaal Tinsley,O.J. Mayo,Sam Young,Zach Randolph,Al Thornton,Craig Smith,DeAndre Jordan,Rasual Butler,Sebastian Telfair,2,10:52,LAC,shot,Craig Smith,,,,,,,,,Rasual Butler,2,,,made,,jump,43,6
Hasheem Thabeet,Jamaal Tinsley,O.J. Mayo,Sam Young,Zach Randolph,Al Thornton,Craig Smith,DeAndre Jordan,Rasual Butler,Sebastian Telfair,2,10:35,MEM,shot,O.J. Mayo,,,,,,,,,Sam Young,2,,,made,,jump,47,5
Hasheem Thabeet,Jamaal Tinsley,O.J. Mayo,Sam Young,Zach Randolph,Al Thornton,Craig Smith,DeAndre Jordan,Rasual Butler,Sebastian Telfair,2,10:15,LAC,shot,,,,,,,,,,Al Thornton,,,,missed,,layup,25,6
Hasheem Thabeet,Jamaal Tinsley,O.J. Mayo,Sam Young,Zach Randolph,Al Thornton,Craig Smith,DeAndre Jordan,Rasual Butler,Sebastian Telfair,2,10:14,MEM,rebound,,,,,,,,,,Zach Randolph,,,,,,def,,
Hasheem Thabeet,Jamaal Tinsley,O.J. Mayo,Sam Young,Zach Randolph,Al Thornton,Craig Smith,DeAndre Jordan,Rasual Butler,Sebastian Telfair,2,10:00,LAC,foul,,,,,,,,Zach Randolph,,DeAndre Jordan,,,,,,shooting,,
Hasheem Thabeet,Jamaal Tinsley,O.J. Mayo,Sam Young,Zach Randolph,Al Thornton,Craig Smith,DeAndre Jordan,Rasual Butler,Sebastian Telfair,2,10:00,MEM,free throw,,,,,,,1,,2,Zach Randolph,,,foul,made,,,,
Hasheem Thabeet,Jamaal Tinsley,O.J. Mayo,Sam Young,Zach Randolph,Al Thornton,Chris Kaman,Craig Smith,Rasual Butler,Sebastian Telfair,2,10:00,LAC,sub,,,,Chris Kaman,,DeAndre Jordan,,,,,,,,,,,,
Hasheem Thabeet,Jamaal Tinsley,O.J. Mayo,Sam Young,Zach Randolph,Al Thornton,Chris Kaman,Craig Smith,Rasual Butler,Sebastian Telfair,2,10:00,MEM,free throw,,,,,,,2,,2,Zach Randolph,,,foul,missed,,,,
Hasheem Thabeet,Jamaal Tinsley,O.J. Mayo,Sam Young,Zach Randolph,Al Thornton,Chris Kaman,Craig Smith,Rasual Butler,Sebastian Telfair,2,10:00,LAC,rebound,,,,,,,,,,Chris Kaman,,,,,,def,,
Hasheem Thabeet,Jamaal Tinsley,O.J. Mayo,Sam Young,Zach Randolph,Al Thornton,Chris Kaman,Craig Smith,Rasual Butler,Sebastian Telfair,2,9:48,LAC,shot,,,,,,,,,,Rasual Butler,,,,missed,,jump,12,19
Hasheem Thabeet,Jamaal Tinsley,O.J. Mayo,Sam Young,Zach Randolph,Al Thornton,Chris Kaman,Craig Smith,Rasual Butler,Sebastian Telfair,2,9:47,MEM,rebound,,,,,,,,,,Jamaal Tinsley,,,,,,def,,
Hasheem Thabeet,Jamaal Tinsley,O.J. Mayo,Sam Young,Zach Randolph,Al Thornton,Chris Kaman,Craig Smith,Rasual Butler,Sebastian Telfair,2,9:26,LAC,foul,,,,,,,,Hasheem Thabeet,,Craig Smith,,,,,,personal,,
Hasheem Thabeet,Jamaal Tinsley,Marc Gasol,O.J. Mayo,Sam Young,Al Thornton,Chris Kaman,Craig Smith,Rasual Butler,Sebastian Telfair,2,9:26,MEM,sub,,,,Marc Gasol,,Zach Randolph,,,,,,,,,,,,
Hasheem Thabeet,Jamaal Tinsley,Marc Gasol,O.J. Mayo,Sam Young,Al Thornton,Chris Kaman,Craig Smith,Rasual Butler,Sebastian Telfair,2,9:13,MEM,shot,Marc Gasol,,,,,,,,,Sam Young,2,,,made,,jump,23,26
Hasheem Thabeet,Jamaal Tinsley,Marc Gasol,O.J. Mayo,Sam Young,Al Thornton,Chris Kaman,Craig Smith,Rasual Butler,Sebastian Telfair,2,8:57,LAC,shot,,,,,,,,,,Craig Smith,,,,missed,,layup,25,6
Hasheem Thabeet,Jamaal Tinsley,Marc Gasol,O.J. Mayo,Sam Young,Al Thornton,Chris Kaman,Craig Smith,Rasual Butler,Sebastian Telfair,2,8:55,MEM,rebound,,,,,,,,,,Marc Gasol,,,,,,def,,
Hasheem Thabeet,Jamaal Tinsley,Marc Gasol,O.J. Mayo,Sam Young,Al Thornton,Chris Kaman,Craig Smith,Rasual Butler,Sebastian Telfair,2,8:52,MEM,shot,Jamaal Tinsley,,,,,,,,,Hasheem Thabeet,2,,,made,,driving dunk,25,6
Hasheem Thabeet,Jamaal Tinsley,Marc Gasol,O.J. Mayo,Sam Young,Al Thornton,Chris Kaman,Craig Smith,Rasual Butler,Sebastian Telfair,2,8:42,LAC,timeout,,,,,,,,,,,,,,,,regular,,
Hasheem Thabeet,Jamaal Tinsley,Marc Gasol,O.J. Mayo,Sam Young,Chris Kaman,Craig Smith,Eric Gordon,Rasual Butler,Sebastian Telfair,2,8:42,LAC,sub,,,,Eric Gordon,,Al Thornton,,,,,,,,,,,,
Hasheem Thabeet,Jamaal Tinsley,Marc Gasol,O.J. Mayo,Sam Young,Chris Kaman,Craig Smith,Eric Gordon,Rasual Butler,Sebastian Telfair,2,8:34,LAC,foul,,,,,,,,Sam Young,,Chris Kaman,,,,,,offensive,,
Hasheem Thabeet,Jamaal Tinsley,Marc Gasol,O.J. Mayo,Sam Young,Chris Kaman,Craig Smith,Eric Gordon,Rasual Butler,Sebastian Telfair,2,8:34,LAC,turnover,,,,,,,,,,Chris Kaman,,,foul,,,,,
Hasheem Thabeet,Jamaal Tinsley,Marc Gasol,O.J. Mayo,Sam Young,Chris Kaman,Craig Smith,Eric Gordon,Rasual Butler,Sebastian Telfair,2,8:15,LAC,foul,,,,,,,,,,Craig Smith,,,,,,defense 3 second,,
Hasheem Thabeet,Jamaal Tinsley,Marc Gasol,O.J. Mayo,Sam Young,Chris Kaman,Craig Smith,Eric Gordon,Rasual Butler,Sebastian Telfair,2,8:15,MEM,free throw,,,,,,,1,,1,O.J. Mayo,,,technical,made,,,,
Hasheem Thabeet,Jamaal Tinsley,Marc Gasol,O.J. Mayo,Sam Young,Chris Kaman,Craig Smith,Eric Gordon,Rasual Butler,Sebastian Telfair,2,8:08,MEM,shot,Jamaal Tinsley,,,,,,,,,Marc Gasol,2,,,made,,jump,26,27
Hasheem Thabeet,Jamaal Tinsley,Marc Gasol,O.J. Mayo,Sam Young,Chris Kaman,Craig Smith,Eric Gordon,Rasual Butler,Sebastian Telfair,2,7:56,LAC,shot,,,,,,,,,,Eric Gordon,2,,,made,,driving layup,25,6
Hasheem Thabeet,Jamaal Tinsley,Marc Gasol,O.J. Mayo,Sam Young,Chris Kaman,Craig Smith,Eric Gordon,Rasual Butler,Sebastian Telfair,2,7:37,MEM,shot,,,Rasual Butler,,,,,,,Sam Young,,,,missed,,layup,25,6
Hasheem Thabeet,Jamaal Tinsley,Marc Gasol,O.J. Mayo,Sam Young,Chris Kaman,Craig Smith,Eric Gordon,Rasual Butler,Sebastian Telfair,2,7:37,MEM,rebound,,,,,,,,,,,,,,,,,,
Hasheem Thabeet,Jamaal Tinsley,Marc Gasol,O.J. Mayo,Sam Young,Chris Kaman,Eric Gordon,Marcus Camby,Rasual Butler,Sebastian Telfair,2,7:37,LAC,sub,,,,Marcus Camby,,Craig Smith,,,,,,,,,,,,
Hasheem Thabeet,Jamaal Tinsley,Marc Gasol,O.J. Mayo,Sam Young,Baron Davis,Chris Kaman,Eric Gordon,Marcus Camby,Rasual Butler,2,7:37,LAC,sub,,,,Baron Davis,,Sebastian Telfair,,,,,,,,,,,,
Hasheem Thabeet,Jamaal Tinsley,Marc Gasol,O.J. Mayo,Sam Young,Baron Davis,Chris Kaman,Eric Gordon,Marcus Camby,Rasual Butler,2,7:34,LAC,foul,,,,,,,,Hasheem Thabeet,,Chris Kaman,,,,,,shooting,,
Hasheem Thabeet,Jamaal Tinsley,Marc Gasol,O.J. Mayo,Sam Young,Baron Davis,DeAndre Jordan,Eric Gordon,Marcus Camby,Rasual Butler,2,7:34,LAC,sub,,,,DeAndre Jordan,,Chris Kaman,,,,,,,,,,,,
Hasheem Thabeet,Jamaal Tinsley,Marc Gasol,O.J. Mayo,Sam Young,Baron Davis,DeAndre Jordan,Eric Gordon,Marcus Camby,Rasual Butler,2,7:34,MEM,free throw,,,,,,,1,,2,Hasheem Thabeet,,,foul,missed,,,,
Hasheem Thabeet,Jamaal Tinsley,Marc Gasol,O.J. Mayo,Sam Young,Baron Davis,DeAndre Jordan,Eric Gordon,Marcus Camby,Rasual Butler,2,7:34,MEM,rebound,,,,,,,,,,,,,,,,,,
Hasheem Thabeet,Jamaal Tinsley,Marc Gasol,O.J. Mayo,Sam Young,Baron Davis,DeAndre Jordan,Eric Gordon,Marcus Camby,Rasual Butler,2,7:34,MEM,free throw,,,,,,,2,,2,Hasheem Thabeet,,,foul,made,,,,
Hasheem Thabeet,Jamaal Tinsley,Marc Gasol,O.J. Mayo,Sam Young,Baron Davis,DeAndre Jordan,Eric Gordon,Marcus Camby,Rasual Butler,2,7:20,LAC,turnover,,,,,,,,,,Eric Gordon,,,bad pass,,Sam Young,,,
Hasheem Thabeet,Jamaal Tinsley,Marc Gasol,O.J. Mayo,Sam Young,Baron Davis,DeAndre Jordan,Eric Gordon,Marcus Camby,Rasual Butler,2,7:07,MEM,shot,,,,,,,,,,Marc Gasol,2,,,made,,hook,27,13
Hasheem Thabeet,Jamaal Tinsley,Marc Gasol,O.J. Mayo,Sam Young,Baron Davis,DeAndre Jordan,Eric Gordon,Marcus Camby,Rasual Butler,2,6:52,LAC,shot,Eric Gordon,,,,,,,,,Baron Davis,2,,,made,,jump,34,25
Hasheem Thabeet,Jamaal Tinsley,Marc Gasol,O.J. Mayo,Sam Young,Baron Davis,DeAndre Jordan,Eric Gordon,Marcus Camby,Rasual Butler,2,6:46,MEM,shot,Jamaal Tinsley,,,,,,,,,Marc Gasol,2,,,made,,driving dunk,25,6
Hasheem Thabeet,Jamaal Tinsley,Marc Gasol,O.J. Mayo,Sam Young,Baron Davis,DeAndre Jordan,Eric Gordon,Marcus Camby,Rasual Butler,2,6:30,MEM,foul,,,,,,,,DeAndre Jordan,,Hasheem Thabeet,,,,,,shooting,,
Hasheem Thabeet,Jamaal Tinsley,Marc Gasol,O.J. Mayo,Sam Young,Baron Davis,DeAndre Jordan,Eric Gordon,Marcus Camby,Rasual Butler,2,6:30,LAC,free throw,,,,,,,1,,2,DeAndre Jordan,,,foul,made,,,,