a1,a2,a3,a4,a5,h1,h2,h3,h4,h5,period,time,team,etype,assist,away,block,entered,home,left,num,opponent,outof,player,points,possession,reason,result,steal,type,x,y
Marc Gasol,Mike Conley,O.J. Mayo,Rudy Gay,Zach Randolph,Brandon Roy,Greg Oden,LaMarcus Aldridge,Martell Webster,Steve Blake,1,12:00,OFF,jump ball,,Marc Gasol,,,Greg Oden,,,,,,,O.J. Mayo,,,,,,
Marc Gasol,Mike Conley,O.J. Mayo,Rudy Gay,Zach Randolph,Brandon Roy,Greg Oden,LaMarcus Aldridge,Martell Webster,Steve Blake,1,11:39,MEM,shot,,,,,,,,,,Marc Gasol,2,,,made,,turnaround fade away,15,11
Marc Gasol,Mike Conley,O.J. Mayo,Rudy Gay,Zach Randolph,Brandon Roy,Greg Oden,LaMarcus Aldridge,Martell Webster,Steve Blake,1,11:23,POR,shot,,,,,,,,,,LaMarcus Aldridge,,,,missed,,jump,35,24
Marc Gasol,Mike Conley,O.J. Mayo,Rudy Gay,Zach Randolph,Brandon Roy,Greg Oden,LaMarcus Aldridge,Martell Webster,Steve Blake,1,11:22,POR,rebound,,,,,,,,,,Brandon Roy,,,,,,off,,
Marc Gasol,Mike Conley,O.J. Mayo,Rudy Gay,Zach Randolph,Brandon Roy,Greg Oden,LaMarcus Aldridge,Martell Webster,Steve Blake,1,10:58,POR,shot,Greg Oden,,,,,,,,,Brandon Roy,3,,,made,,3pt,24,30
Marc Gasol,Mike Conley,O.J. Mayo,Rudy Gay,Zach Randolph,Brandon Roy,Greg Oden,LaMarcus Aldridge,Martell Webster,Steve Blake,1,10:31,MEM,shot,,,,,,,,,,Zach Randolph,,,,missed,,jump,11,19
Marc Gasol,Mike Conley,O.J. Mayo,Rudy Gay,Zach Randolph,Brandon Roy,Greg Oden,LaMarcus Aldridge,Martell Webster,Steve Blake,1,10:30,POR,rebound,,,,,,,,,,Brandon Roy,,,,,,def,,
Marc Gasol,Mike Conley,O.J. Mayo,Rudy Gay,Zach Randolph,Brandon Roy,Greg Oden,LaMarcus Aldridge,Martell Webster,Steve Blake,1,10:20,POR,shot,Brandon Roy,,,,,,,,,Martell Webster,2,,,made,,reverse layup,25,6
Marc Gasol,Mike Conley,O.J. Mayo,Rudy Gay,Zach Randolph,Brandon Roy,Greg Oden,LaMarcus Aldridge,Martell Webster,Steve Blake,1,10:07,MEM,shot,O.J. Mayo,,,,,,,,,Marc Gasol,2,,,made,,driving layup,25,6
Marc Gasol,Mike Conley,O.J. Mayo,Rudy Gay,Zach Randolph,Brandon Roy,Greg Oden,LaMarcus Aldridge,Martell Webster,Steve Blake,1,9:48,POR,shot,,,,,,,,,,Steve Blake,,,,missed,,running jump,23,13
Marc Gasol,Mike Conley,O.J. Mayo,Rudy Gay,Zach Randolph,Brandon Roy,Greg Oden,LaMarcus Aldridge,Martell Webster,Steve Blake,1,9:47,MEM,rebound,,,,,,,,,,Marc Gasol,,,,,,def,,
Marc Gasol,Mike Conley,O.J. Mayo,Rudy Gay,Zach Randolph,Brandon Roy,Greg Oden,LaMarcus Aldridge,Martell Webster,Steve Blake,1,9:41,MEM,shot,,,Martell Webster,,,,,,,Rudy Gay,,,,missed,,driving layup,25,6
Marc Gasol,Mike Conley,O.J. Mayo,Rudy Gay,Zach Randolph,Brandon Roy,Greg Oden,LaMarcus Aldridge,Martell Webster,Steve Blake,1,9:41,POR,rebound,,,,,,,,,,,,,,,,,,
Marc Gasol,Mike Conley,O.J. Mayo,Rudy Gay,Zach Randolph,Brandon Roy,Greg Oden,LaMarcus Aldridge,Martell Webster,Steve Blake,1,9:29,POR,shot,,,,,,,,,,Greg Oden,,,,missed,,jump,23,24
Marc Gasol,Mike Conley,O.J. Mayo,Rudy Gay,Zach Randolph,Brandon Roy,Greg Oden,LaMarcus Aldridge,Martell Webster,Steve Blake,1,9:27,POR,rebound,,,,,,,,,,LaMarcus Aldridge,,,,,,off,,
Marc Gasol,Mike Conley,O.J. Mayo,Rudy Gay,Zach Randolph,Brandon Roy,Greg Oden,LaMarcus Aldridge,Martell Webster,Steve Blake,1,9:20,POR,shot,Brandon Roy,,,,,,,,,Martell Webster,3,,,made,,3pt,15,28
Marc Gasol,Mike Conley,O.J. Mayo,Rudy Gay,Zach Randolph,Brandon Roy,Greg Oden,LaMarcus Aldridge,Martell Webster,Steve Blake,1,9:00,MEM,shot,,,,,,,,,,O.J. Mayo,2,,,made,,driving jump,24,13
Marc Gasol,Mike Conley,O.J. Mayo,Rudy Gay,Zach Randolph,Brandon Roy,Greg Oden,LaMarcus Aldridge,Martell Webster,Steve Blake,1,8:45,POR,turnover,,,,,,,,,,LaMarcus Aldridge,,,bad pass,,,,,
Marc Gasol,Mike Conley,O.J. Mayo,Rudy Gay,Zach Randolph,Brandon Roy,Greg Oden,LaMarcus Aldridge,Martell Webster,Steve Blake,1,8:29,MEM,shot,,,,,,,,,,Zach Randolph,,,,missed,,jump,8,9
Marc Gasol,Mike Conley,O.J. Mayo,Rudy Gay,Zach Randolph,Brandon Roy,Greg Oden,LaMarcus Aldridge,Martell Webster,Steve Blake,1,8:28,MEM,rebound,,,,,,,,,,Zach Randolph,,,,,,off,,
Marc Gasol,Mike Conley,O.J. Mayo,Rudy Gay,Zach Randolph,Brandon Roy,Greg Oden,LaMarcus Aldridge,Martell Webster,Steve Blake,1,8:17,MEM,shot,Mike Conley,,,,,,,,,Zach Randolph,2,,,made,,jump,7,7
Marc Gasol,Mike Conley,O.J. Mayo,Rudy Gay,Zach Randolph,Brandon Roy,Greg Oden,LaMarcus Aldridge,Martell Webster,Steve Blake,1,8:03,POR,shot,Greg Oden,,,,,,,,,Martell Webster,3,,,made,,3pt,46,17
Marc Gasol,Mike Conley,O.J. Mayo,Rudy Gay,Zach Randolph,Brandon Roy,Greg Oden,LaMarcus Aldridge,Martell Webster,Steve Blake,1,7:54,MEM,shot,O.J. Mayo,,,,,,,,,Marc Gasol,2,,,made,,driving layup,25,6
Marc Gasol,Mike Conley,O.J. Mayo,Rudy Gay,Zach Randolph,Brandon Roy,Greg Oden,LaMarcus Aldridge,Martell Webster,Steve Blake,1,7:54,POR,foul,,,,,,,,Marc Gasol,,Greg Oden,,,,,,shooting,,
Marc Gasol,Mike Conley,O.J. Mayo,Rudy Gay,Zach Randolph,Brandon Roy,Greg Oden,LaMarcus Aldridge,Martell Webster,Steve Blake,1,7:54,MEM,free throw,,,,,,,1,,1,Marc Gasol,,,foul,made,,,,
Marc Gasol,Mike Conley,O.J. Mayo,Rudy Gay,Zach Randolph,Brandon Roy,Greg Oden,LaMarcus Aldridge,Martell Webster,Steve Blake,1,7:39,POR,shot,Brandon Roy,,,,,,,,,LaMarcus Aldridge,2,,,made,,turnaround fade away,37,9
Marc Gasol,Mike Conley,O.J. Mayo,Rudy Gay,Zach Randolph,Brandon Roy,Greg Oden,LaMarcus Aldridge,Martell Webster,Steve Blake,1,7:21,MEM,shot,,,,,,,,,,Mike Conley,,,,missed,,running jump,25,13
Marc Gasol,Mike Conley,O.J. Mayo,Rudy Gay,Zach Randolph,Brandon Roy,Greg Oden,LaMarcus Aldridge,Martell Webster,Steve Blake,1,7:21,POR,rebound,,,,,,,,,,Greg Oden,,,,,,def,,
Marc Gasol,Mike Conley,O.J. Mayo,Rudy Gay,Zach Randolph,Brandon Roy,Greg Oden,LaMarcus Aldridge,Martell Webster,Steve Blake,1,7:03,POR,shot,,,,,,,,,,Brandon Roy,,,,missed,,turnaround jump,17,19
Marc Gasol,Mike Conley,O.J. Mayo,Rudy Gay,Zach Randolph,Brandon Roy,Greg Oden,LaMarcus Aldridge,Martell Webster,Steve Blake,1,7:02,MEM,rebound,,,,,,,,,,Zach Randolph,,,,,,def,,
Marc Gasol,Mike Conley,O.J. Mayo,Rudy Gay,Zach Randolph,Brandon Roy,Greg Oden,LaMarcus Aldridge,Martell Webster,Steve Blake,1,6:57,MEM,foul,,,,,,,,Steve Blake,,Mike Conley,,,,,,offensive,,
Marc Gasol,Mike Conley,O.J. Mayo,Rudy Gay,Zach Randolph,Brandon Roy,Greg Oden,LaMarcus Aldridge,Martell Webster,Steve Blake,1,6:57,MEM,turnover,,,,,,,,,,Mike Conley,,,foul,,,,,
Marc Gasol,Mike Conley,O.J. Mayo,Rudy Gay,Zach Randolph,Brandon Roy,Greg Oden,LaMarcus Aldridge,Martell Webster,Steve Blake,1,6:36,POR,shot,,,,,,,,,,Martell Webster,,,,missed,,3pt,43,24
Marc Gasol,Mike Conley,O.J. Mayo,Rudy Gay,Zach Randolph,Brandon Roy,Greg Oden,LaMarcus Aldridge,Martell Webster,Steve Blake,1,6:35,POR,rebound,,,,,,,,,,Brandon Roy,,,,,,off,,
Marc Gasol,Mike Conley,O.J. Mayo,Rudy Gay,Zach Randolph,Brandon Roy,Greg Oden,LaMarcus Aldridge,Martell Webster,Steve Blake,1,6:34,POR,shot,,,,,,,,,,Brandon Roy,2,,,made,,layup,25,6
Marc Gasol,Mike Conley,O.J. Mayo,Rudy Gay,Zach Randolph,Brandon Roy,Greg Oden,LaMarcus Aldridge,Martell Webster,Steve Blake,1,6:06,MEM,shot,,,,,,,,,,Marc Gasol,,,,missed,,running jump,32,6
Marc Gasol,Mike Conley,O.J. Mayo,Rudy Gay,Zach Randolph,Brandon Roy,Greg Oden,LaMarcus Aldridge,Martell Webster,Steve Blake,1,6:05,POR,rebound,,,,,,,,,,Greg Oden,,,,,,def,,
Marc Gasol,Mike Conley,O.J. Mayo,Rudy Gay,Zach Randolph,Brandon Roy,Greg Oden,LaMarcus Aldridge,Martell Webster,Steve Blake,1,5:52,POR,shot,,,,,,,,,,LaMarcus Aldridge,,,,missed,,turnaround fade away,15,7
Marc Gasol,Mike Conley,O.J. Mayo,Rudy Gay,Zach Randolph,Brandon Roy,Greg Oden,LaMarcus Aldridge,Martell Webster,Steve Blake,1,5:52,MEM,rebound,,,,,,,,,,Rudy Gay,,,,,,def,,
Marc Gasol,Mike Conley,O.J. Mayo,Rudy Gay,Zach Randolph,Brandon Roy,Greg Oden,LaMarcus Aldridge,Martell Webster,Steve Blake,1,5:43,MEM,foul,,,,,,,,LaMarcus Aldridge,,Rudy Gay,,,,,,offensive,,
Marc Gasol,Mike Conley,O.J. Mayo,Rudy Gay,Zach Randolph,Brandon Roy,Greg Oden,LaMarcus Aldridge,Martell Webster,Steve Blake,1,5:43,MEM,turnover,,,,,,,,,,Rudy Gay,,,foul,,,,,
Marc Gasol,Mike Conley,O.J. Mayo,Rudy Gay,Zach Randolph,Brandon Roy,Greg Oden,LaMarcus Aldridge,Martell Webster,Steve Blake,1,5:43,POR,timeout,,,,,,,,,,,,,,,,regular,,
Marc Gasol,Mike Conley,O.J. Mayo,Rudy Gay,Zach Randolph,Brandon Roy,Joel Przybilla,LaMarcus Aldridge,Martell Webster,Steve Blake,1,5:43,POR,sub,,,,Joel Przybilla,,Greg Oden,,,,,,,,,,,,
Marc Gasol,Mike Conley,O.J. Mayo,Rudy Gay,Zach Randolph,Brandon Roy,Joel Przybilla,LaMarcus Aldridge,Martell Webster,Steve Blake,1,5:21,POR,turnover,,,,,,,,,,Steve Blake,,,bad pass,,Marc Gasol,,,
Marc Gasol,Mike Conley,O.J. Mayo,Rudy Gay,Zach Randolph,Brandon Roy,Joel Przybilla,LaMarcus Aldridge,Martell Webster,Steve Blake,1,5:17,MEM,shot,Marc Gasol,,,,,,,,,Mike Conley,2,,,made,,driving layup,25,6
Marc Gasol,Mike Conley,O.J. Mayo,Rudy Gay,Zach Randolph,Brandon Roy,Joel Przybilla,LaMarcus Aldridge,Martell Webster,Steve Blake,1,4:56,POR,shot,,,,,,,,,,Brandon Roy,,,,missed,,3pt,40,26
Marc Gasol,Mike Conley,O.J. Mayo,Rudy Gay,Zach Randolph,Brandon Roy,Joel Przybilla,LaMarcus Aldridge,Martell Webster,Steve Blake,1,4:55,MEM,rebound,,,,,,,,,,Zach Randolph,,,,,,def,,
Marc Gasol,Mike Conley,O.J. Mayo,Rudy Gay,Zach Randolph,Brandon Roy,Joel Przybilla,LaMarcus Aldridge,Martell Webster,Steve Blake,1,4:43,POR,foul,,,,,,,,Marc Gasol,,Brandon Roy,,,,,,shooting,,
Marc Gasol,Mike Conley,O.J. Mayo,Rudy Gay,Zach Randolph,Brandon Roy,Joel Przybilla,LaMarcus Aldridge,Rudy Fernandez,Steve Blake,1,4:43,POR,sub,,,,Rudy Fernandez,,Martell Webster,,,,,,,,,,,,
Marc Gasol,Mike Conley,O.J. Mayo,Rudy Gay,Zach Randolph,Brandon Roy,Joel Przybilla,LaMarcus Aldridge,Rudy Fernandez,Steve Blake,1,4:43,MEM,free throw,,,,,,,1,,2,Marc Gasol,,,foul,made,,,,
Marc Gasol,Mike Conley,O.J. Mayo,Rudy Gay,Zach Randolph,Brandon Roy,Joel Przybilla,LaMarcus Aldridge,Rudy Fernandez,Steve Blake,1,4:43,MEM,free throw,,,,,,,2,,2,Marc Gasol,,,foul,made,,,,
Marc Gasol,Mike Conley,O.J. Mayo,Rudy Gay,Zach Randolph,Brandon Roy,Joel Przybilla,LaMarcus Aldridge,Rudy Fernandez,Steve Blake,1,4:25,POR,turnover,,,,,,,,,,Steve Blake,,,out of bounds lost ball turnover,,,,,
Marc Gasol,Mike Conley,O.J. Mayo,Rudy Gay,Zach Randolph,Brandon Roy,Joel Przybilla,LaMarcus Aldridge,Rudy Fernandez,Steve Blake,1,4:07,MEM,shot,,,,,,,,,,Zach Randolph,,,,missed,,jump,42,10
Marc Gasol,Mike Conley,O.J. Mayo,Rudy Gay,Zach Randolph,Brandon Roy,Joel Przybilla,LaMarcus Aldridge,Rudy Fernandez,Steve Blake,1,4:06,MEM,rebound,,,,,,,,,,Marc Gasol,,,,,,off,,
Marc Gasol,Mike Conley,O.J. Mayo,Rudy Gay,Zach Randolph,Brandon Roy,Joel Przybilla,LaMarcus Aldridge,Rudy Fernandez,Steve Blake,1,3:49,MEM,shot,Rudy Gay,,,,,,,,,Zach Randolph,2,,,made,,jump,4,6
Marc Gasol,Mike Conley,O.J. Mayo,Rudy Gay,Zach Randolph,Brandon Roy,Joel Przybilla,LaMarcus Aldridge,Rudy Fernandez,Steve Blake,1,3:45,POR,turnover,,,,,,,,,,Brandon Roy,,,lost ball,,Mike Conley,,,
Marc Gasol,Mike Conley,O.J. Mayo,Rudy Gay,Zach Randolph,Brandon Roy,Joel Przybilla,LaMarcus Aldridge,Rudy Fernandez,Steve Blake,1,3:38,MEM,shot,Mike Conley,,,,,,,,,Zach Randolph,2,,,made,,jump,19,9
Marc Gasol,Mike Conley,O.J. Mayo,Rudy Gay,Zach Randolph,Andre Miller,Brandon Roy,Joel Przybilla,LaMarcus Aldridge,Rudy Fernandez,1,3:15,POR,sub,,,,Andre Miller,,Steve Blake,,,,,,,,,,,,
Marc Gasol,Mike Conley,O.J. Mayo,Rudy Gay,Zach Randolph,Andre Miller,Brandon Roy,Joel Przybilla,LaMarcus Aldridge,Rudy Fernandez,1,3:13,POR,shot,,,,,,,,,,Brandon Roy,,,,missed,,jump,13,16
Marc Gasol,Mike Conley,O.J. Mayo,Rudy Gay,Zach Randolph,Andre Miller,Brandon Roy,Joel Przybilla,LaMarcus Aldridge,Rudy Fernandez,1,3:12,POR,rebound,,,,,,,,,,Joel Przybilla,,,,,,off,,
Marc Gasol,Mike Conley,O.J. Mayo,Rudy Gay,Zach Randolph,Andre Miller,Brandon Roy,Joel Przybilla,LaMarcus Aldridge,Rudy Fernandez,1,2:59,POR,shot,,,,,,,,,,Rudy Fernandez,,,,missed,,3pt,48,6
Marc Gasol,Mike Conley,O.J. Mayo,Rudy Gay,Zach Randolph,Andre Miller,Brandon Roy,Joel Przybilla,LaMarcus Aldridge,Rudy Fernandez,1,2:59,MEM,rebound,,,,,,,,,,Marc Gasol,,,,,,def,,
Marc Gasol,Mike Conley,O.J. Mayo,Rudy Gay,Zach Randolph,Andre Miller,Brandon Roy,Joel Przybilla,LaMarcus Aldridge,Rudy Fernandez,1,2:53,MEM,shot,,,,,,,,,,O.J. Mayo,2,,,made,,driving reverse layup,25,6
Marc Gasol,Mike Conley,O.J. Mayo,Rudy Gay,Zach Randolph,Andre Miller,Brandon Roy,Joel Przybilla,LaMarcus Aldridge,Rudy Fernandez,1,2:30,POR,shot,,,Rudy Gay,,,,,,,Brandon Roy,,,,missed,,pullup jump,9,9
Marc Gasol,Mike Conley,O.J. Mayo,Rudy Gay,Zach Randolph,Andre Miller,Brandon Roy,Joel Przybilla,LaMarcus Aldridge,Rudy Fernandez,1,2:27,MEM,rebound,,,,,,,,,,Marc Gasol,,,,,,def,,
Marc Gasol,Mike Conley,O.J. Mayo,Rudy Gay,Zach Randolph,Andre Miller,Brandon Roy,Joel Przybilla,LaMarcus Aldridge,Rudy Fernandez,1,2:15,POR,foul,,,,,,,,Rudy Gay,,Joel Przybilla,,,,,,personal,,
Marc Gasol,Mike Conley,O.J. Mayo,Rudy Gay,Zach Randolph,Andre Miller,Brandon Roy,Joel Przybilla,LaMarcus Aldridge,Rudy Fernandez,1,2:15,MEM,timeout,,,,,,,,,,,,,,,,regular,,
Marc Gasol,Mike Conley,O.J. Mayo,Rudy Gay,Zach Randolph,Andre Miller,Brandon Roy,Joel Przybilla,LaMarcus Aldridge,Rudy Fernandez,1,2:15,MEM,free throw,,,,,,,1,,2,Rudy Gay,,,foul,made,,,,
Hasheem Thabeet,Mike Conley,O.J. Mayo,Rudy Gay,Zach Randolph,Andre Miller,Brandon Roy,Joel Przybilla,LaMarcus Aldridge,Rudy Fernandez,1,2:15,MEM,sub,,,,Hasheem Thabeet,,Marc Gasol,,,,,,,,,,,,
Hasheem Thabeet,Mike Conley,O.J. Mayo,Rudy Gay,Zach Randolph,Andre Miller,Brandon Roy,Joel Przybilla,LaMarcus Aldridge,Rudy Fernandez,1,2:15,MEM,free throw,,,,,,,2,,2,Rudy Gay,,,foul,made,,,,
Hasheem Thabeet,Mike Conley,O.J. Mayo,Rudy Gay,Zach Randolph,Andre Miller,Brandon Roy,Joel Przybilla,LaMarcus Aldridge,Rudy Fernandez,1,1:56,POR,turnover,,,,,,,,,,Andre Miller,,,bad pass,,Mike Conley,,,
Hasheem Thabeet,Mike Conley,O.J. Mayo,Rudy Gay,Zach Randolph,Andre Miller,Brandon Roy,Joel Przybilla,LaMarcus Aldridge,Rudy Fernandez,1,1:53,MEM,shot,,,,,,,,,,O.J. Mayo,2,,,made,,driving layup,25,6
Hasheem Thabeet,Mike Conley,O.J. Mayo,Rudy Gay,Zach Randolph,Andre Miller,Brandon Roy,Joel Przybilla,LaMarcus Aldridge,Rudy Fernandez,1,1:30,POR,shot,,,Mike Conley,,,,,,,Andre Miller,,,,missed,,jump,33,10
Hasheem Thabeet,Mike Conley,O.J. Mayo,Rudy Gay,Zach Randolph,Andre Miller,Brandon Roy,Joel Przybilla,LaMarcus Aldridge,Rudy Fernandez,1,1:29,POR,rebound,,,,,,,,,,Andre Miller,,,,,,off,,
Hasheem Thabeet,Mike Conley,O.J. Mayo,Rudy Gay,Zach Randolph,Andre Miller,Brandon Roy,Joel Przybilla,LaMarcus Aldridge,Rudy Fernandez,1,1:17,POR,shot,,,Hasheem Thabeet,,,,,,,Brandon Roy,,,,missed,,driving layup,25,6
Hasheem Thabeet,Mike Conley,O.J. Mayo,Rudy Gay,Zach Randolph,Andre Miller,Brandon Roy,Joel Przybilla,LaMarcus Aldridge,Rudy Fernandez,1,1:15,MEM,rebound,,,,,,,,,,Hasheem Thabeet,,,,,,def,,
Hasheem Thabeet,Mike Conley,O.J. Mayo,Rudy Gay,Zach Randolph,Andre Miller,Brandon Roy,Joel Przybilla,LaMarcus Aldridge,Rudy Fernandez,1,1:07,MEM,shot,,,,,,,,,,Rudy Gay,,,,missed,,driving layup,25,6
Hasheem Thabeet,Mike Conley,O.J. Mayo,Rudy Gay,Zach Randolph,Andre Miller,Brandon Roy,Joel Przybilla,LaMarcus Aldridge,Rudy Fernandez,1,1:06,MEM,rebound,,,,,,,,,,Zach Randolph,,,,,,off,,
Hasheem Thabeet,Mike Conley,O.J. Mayo,Rudy Gay,Zach Randolph,Andre Miller,Brandon Roy,Joel Przybilla,LaMarcus Aldridge,Rudy Fernandez,1,1:06,MEM,shot,,,,,,,,,,Zach Randolph,2,,,made,,layup,25,6
Hasheem Thabeet,Mike Conley,O.J. Mayo,Rudy Gay,Zach Randolph,Andre Miller,Brandon Roy,Joel Przybilla,LaMarcus Aldridge,Rudy Fernandez,1,0:52,POR,shot,,,,,,,,,,Rudy Fernandez,,,,missed,,jump,35,11
Hasheem Thabeet,Mike Conley,O.J. Mayo,Rudy Gay,Zach Randolph,Andre Miller,Brandon Roy,Joel Przybilla,LaMarcus Aldridge,Rudy Fernandez,1,0:49,POR,rebound,,,,,,,,,,LaMarcus Aldridge,,,,,,off,,
Hasheem Thabeet,Mike Conley,O.J. Mayo,Rudy Gay,Zach Randolph,Andre Miller,Brandon Roy,Joel Przybilla,LaMarcus Aldridge,Rudy Fernandez,1,0:49,POR,shot,,,,,,,,,,LaMarcus Aldridge,,,,missed,,tip,25,6
Hasheem Thabeet,Mike Conley,O.J. Mayo,Rudy Gay,Zach Randolph,Andre Miller,Brandon Roy,Joel Przybilla,LaMarcus Aldridge,Rudy Fernandez,1,0:49,MEM,rebound,,,,,,,,,,Zach Randolph,,,,,,def,,
Hasheem Thabeet,Mike Conley,O.J. Mayo,Rudy Gay,Zach Randolph,Andre Miller,Brandon Roy,Joel Przybilla,LaMarcus Aldridge,Rudy Fernandez,1,0:34,MEM,shot,,,,,,,,,,Mike Conley,,,,missed,,pullup jump,26,20
Hasheem Thabeet,Mike Conley,O.J. Mayo,Rudy Gay,Zach Randolph,Andre Miller,Brandon Roy,Joel Przybilla,LaMarcus Aldridge,Rudy Fernandez,1,0:33,POR,rebound,,,,,,,,,,Joel Przybilla,,,,,,def,,
Hasheem Thabeet,Mike Conley,O.J. Mayo,Rudy Gay,Zach Randolph,Andre Miller,Brandon Roy,Joel Przybilla,LaMarcus Aldridge,Rudy Fernandez,1,0:13,POR,shot,,,Hasheem Thabeet,,,,,,,Rudy Fernandez,,,,missed,,driving layup,25,6
Hasheem Thabeet,Mike Conley,O.J. Mayo,Rudy Gay,Zach Randolph,Andre Miller,Brandon Roy,Joel Przybilla,LaMarcus Aldridge,Rudy Fernandez,1,0:11,MEM,rebound,,,,,,,,,,Rudy Gay,,,,,,def,,
Hasheem Thabeet,Mike Conley,O.J. Mayo,Rudy Gay,Zach Randolph,Andre Miller,Brandon Roy,Joel Przybilla,LaMarcus Aldridge,Rudy Fernandez,1,0:07,MEM,shot,Rudy Gay,,,,,,,,,Mike Conley,2,,,made,,driving reverse layup,25,6
Hasheem Thabeet,Jamaal Tinsley,Marc Gasol,O.J. Mayo,Rudy Gay,Andre Miller,Joel Przybilla,LaMarcus Aldridge,Martell Webster,Rudy Fernandez,2,11:41,POR,shot,,,,,,,,,,Rudy Fernandez,,,,missed,,3pt,16,28
Hasheem Thabeet,Jamaal Tinsley,Marc Gasol,O.J. Mayo,Rudy Gay,Andre Miller,Joel Przybilla,LaMarcus Aldridge,Martell Webster,Rudy Fernandez,2,11:39,POR,rebound,,,,,,,,,,LaMarcus Aldridge,,,,,,off,,
Hasheem Thabeet,Jamaal Tinsley,Marc Gasol,O.J. Mayo,Rudy Gay,Andre Miller,Joel Przybilla,LaMarcus Aldridge,Martell Webster,Rudy Fernandez,2,11:30,POR,shot,,,Hasheem Thabeet,,,,,,,LaMarcus Aldridge,,,,missed,,alley oop layup,25,6
Hasheem Thabeet,Jamaal Tinsley,Marc Gasol,O.J. Mayo,Rudy Gay,Andre Miller,Joel Przybilla,LaMarcus Aldridge,Martell Webster,Rudy Fernandez,2,11:30,POR,rebound,,,,,,,,,,,,,,,,,,
Hasheem Thabeet,Jamaal Tinsley,Marc Gasol,O.J. Mayo,Rudy Gay,Andre Miller,Joel Przybilla,LaMarcus Aldridge,Martell Webster,Rudy Fernandez,2,11:24,POR,shot,,,,,,,,,,Andre Miller,,,,missed,,jump,38,22
Hasheem Thabeet,Jamaal Tinsley,Marc Gasol,O.J. Mayo,Rudy Gay,Andre Miller,Joel Przybilla,LaMarcus Aldridge,Martell Webster,Rudy Fernandez,2,11:23,MEM,rebound,,,,,,,,,,Marc Gasol,,,,,,def,,
Hasheem Thabeet,Jamaal Tinsley,Marc Gasol,O.J. Mayo,Rudy Gay,Andre Miller,Joel Przybilla,LaMarcus Aldridge,Martell Webster,Rudy Fernandez,2,11:09,MEM,shot,Marc Gasol,,,,,,,,,O.J. Mayo,2,,,made,,jump,6,13
Hasheem Thabeet,Jamaal Tinsley,Marc Gasol,O.J. Mayo,Rudy Gay,Andre Miller,Joel Przybilla,LaMarcus Aldridge,Martell Webster,Rudy Fernandez,2,10:51,POR,shot,,,,,,,,,,Andre Miller,,,,missed,,jump,30,25
Hasheem Thabeet,Jamaal Tinsley,Marc Gasol,O.J. Mayo,Rudy Gay,Andre Miller,Joel Przybilla,LaMarcus Aldridge,Martell Webster,Rudy Fernandez,2,10:51,MEM,rebound,,,,,,,,,,Marc Gasol,,,,,,def,,
Hasheem Thabeet,Jamaal Tinsley,Marc Gasol,O.J. Mayo,Rudy Gay,Andre Miller,Joel Przybilla,LaMarcus Aldridge,Martell Webster,Rudy Fernandez,2,10:31,MEM,shot,,,,,,,,,,Hasheem Thabeet,,,,missed,,layup,25,6
Hasheem Thabeet,Jamaal Tinsley,Marc Gasol,O.J. Mayo,Rudy Gay,Andre Miller,Joel Przybilla,LaMarcus Aldridge,Martell Webster,Rudy Fernandez,2,10:30,MEM,rebound,,,,,,,,,,Hasheem Thabeet,,,,,,off,,
Hasheem Thabeet,Jamaal Tinsley,Marc Gasol,O.J. Mayo,Rudy Gay,Andre Miller,Joel Przybilla,LaMarcus Aldridge,Martell Webster,Rudy Fernandez,2,10:30,MEM,shot,,,,,,,,,,Hasheem Thabeet,,,,missed,,tip,25,6
Hasheem Thabeet,Jamaal Tinsley,Marc Gasol,O.J. Mayo,Rudy Gay,Andre Miller,Joel Przybilla,LaMarcus Aldridge,Martell Webster,Rudy Fernandez,2,10:29,MEM,rebound,,,,,,,,,,Hasheem Thabeet,,,,,,off,,
Hasheem Thabeet,Jamaal Tinsley,Marc Gasol,O.J. Mayo,Rudy Gay,Andre Miller,Joel Przybilla,LaMarcus Aldridge,Martell Webster,Rudy Fernandez,2,10:29,POR,foul,,,,,,,,Hasheem Thabeet,,Joel Przybilla,,,,,,shooting,,
Hasheem Thabeet,Jamaal Tinsley,Marc Gasol,O.J. Mayo,Rudy Gay,Andre Miller,Greg Oden,LaMarcus Aldridge,Martell Webster,Rudy Fernandez,2,10:29,POR,sub,,,,Greg Oden,,Joel Przybilla,,,,,,,,,,,,
Hasheem Thabeet,Jamaal Tinsley,Marc Gasol,O.J. Mayo,Rudy Gay,Andre Miller,Dante Cunningham,Greg Oden,Martell Webster,Rudy Fernandez,2,10:29,POR,sub,,,,Dante Cunningham,,LaMarcus Aldridge,,,,,,,,,,,,
Hasheem Thabeet,Jamaal Tinsley,Marc Gasol,O.J. Mayo,Rudy Gay,Andre Miller,Dante Cunningham,Greg Oden,Martell Webster,Rudy Fernandez,2,10:29,MEM,free throw,,,,,,,1,,2,Hasheem Thabeet,,,foul,made,,,,
Hasheem Thabeet,Jamaal Tinsley,Marc Gasol,O.J. Mayo,Rudy Gay,Andre Miller,Dante Cunningham,Greg Oden,Martell Webster,Rudy Fernandez,2,10:29,MEM,free throw,,,,,,,2,,2,Hasheem Thabeet,,,foul,missed,,,,
Hasheem Thabeet,Jamaal Tinsley,Marc Gasol,O.J. Mayo,Rudy Gay,Andre Miller,Dante Cunningham,Greg Oden,Martell Webster,Rudy Fernandez,2,10:28,POR,rebound,,,,,,,,,,Greg Oden,,,,,,def,,
Hasheem Thabeet,Jamaal Tinsley,Marc Gasol,O.J. Mayo,Rudy Gay,Andre Miller,Dante Cunningham,Greg Oden,Martell Webster,Rudy Fernandez,2,10:04,POR,shot,,,,,,,,,,Andre Miller,2,,,made,,driving layup,25,6
Hasheem Thabeet,Jamaal Tinsley,Marc Gasol,O.J. Mayo,Rudy Gay,Andre Miller,Dante Cunningham,Greg Oden,Martell Webster,Rudy Fernandez,2,10:04,MEM,foul,,,,,,,,Andre Miller,,Hasheem Thabeet,,,,,,shooting,,
Hasheem Thabeet,Jamaal Tinsley,Marc Gasol,O.J. Mayo,Rudy Gay,Andre Miller,Dante Cunningham,Greg Oden,Martell Webster,Rudy Fernandez,2,10:04,POR,free throw,,,,,,,1,,1,Andre Miller,,,foul,missed,,,,
Hasheem Thabeet,Jamaal Tinsley,Marc Gasol,O.J. Mayo,Rudy Gay,Andre Miller,Dante Cunningham,Greg Oden,Martell Webster,Rudy Fernandez,2,10:03,MEM,rebound,,,,,,,,,,Marc Gasol,,,,,,def,,
Hasheem Thabeet,Jamaal Tinsley,Marc Gasol,O.J. Mayo,Rudy Gay,Andre Miller,Dante Cunningham,Greg Oden,Martell Webster,Rudy Fernandez,2,9:47,MEM,shot,Jamaal Tinsley,,,,,,,,,O.J. Mayo,3,,,made,,3pt,5,20
Hasheem Thabeet,Jamaal Tinsley,Marc Gasol,O.J. Mayo,Rudy Gay,Andre Miller,Dante Cunningham,Greg Oden,Martell Webster,Rudy Fernandez,2,9:29,POR,shot,,,,,,,,,,Greg Oden,,,,missed,,jump,35,8
Hasheem Thabeet,Jamaal Tinsley,Marc Gasol,O.J. Mayo,Rudy Gay,Andre Miller,Dante Cunningham,Greg Oden,Martell Webster,Rudy Fernandez,2,9:28,POR,rebound,,,,,,,,,,Dante Cunningham,,,,,,off,,
Hasheem Thabeet,Jamaal Tinsley,Marc Gasol,O.J. Mayo,Rudy Gay,Andre Miller,Dante Cunningham,Greg Oden,Martell Webster,Rudy Fernandez,2,9:28,MEM,foul,,,,,,,,Dante Cunningham,,Marc Gasol,,,,,,personal,,
DeMarre Carroll,Hasheem Thabeet,Jamaal Tinsley,Marc Gasol,O.J. Mayo,Andre Miller,Dante Cunningham,Greg Oden,Martell Webster,Rudy Fernandez,2,9:28,MEM,sub,,,,DeMarre Carroll,,Rudy Gay,,,,,,,,,,,,
DeMarre Carroll,Hasheem Thabeet,Jamaal Tinsley,Marc Gasol,O.J. Mayo,Dante Cunningham,Greg Oden,Jerryd Bayless,Martell Webster,Rudy Fernandez,2,9:28,POR,sub,,,,Jerryd Bayless,,Andre Miller,,,,,,,,,,,,
DeMarre Carroll,Hasheem Thabeet,Jamaal Tinsley,Marc Gasol,O.J. Mayo,Dante Cunningham,Greg Oden,Jerryd Bayless,Martell Webster,Rudy Fernandez,2,9:14,POR,shot,,,Jamaal Tinsley,,,,,,,Jerryd Bayless,,,,missed,,layup,25,6
DeMarre Carroll,Hasheem Thabeet,Jamaal Tinsley,Marc Gasol,O.J. Mayo,Dante Cunningham,Greg Oden,Jerryd Bayless,Martell Webster,Rudy Fernandez,2,9:13,MEM,rebound,,,,,,,,,,Jamaal Tinsley,,,,,,def,,
DeMarre Carroll,Hasheem Thabeet,Jamaal Tinsley,Marc Gasol,O.J. Mayo,Dante Cunningham,Greg Oden,Jerryd Bayless,Martell Webster,Rudy Fernandez,2,8:55,MEM,timeout,,,,,,,,,,,,,,,,official,,
DeMarre Carroll,Hasheem Thabeet,Jamaal Tinsley,Marc Gasol,O.J. Mayo,Brandon Roy,Dante Cunningham,Greg Oden,Jerryd Bayless,Martell Webster,2,8:55,POR,sub,,,,Brandon Roy,,Rudy Fernandez,,,,,,,,,,,,
DeMarre Carroll,Hasheem Thabeet,Jamaal Tinsley,Marc Gasol,O.J. Mayo,Brandon Roy,Dante Cunningham,Greg Oden,Jerryd Bayless,Martell Webster,2,8:49,MEM,shot,O.J. Mayo,,,,,,,,,Jamaal Tinsley,3,,,made,,3pt,11,29
DeMarre Carroll,Hasheem Thabeet,Jamaal Tinsley,Marc Gasol,O.J. Mayo,Brandon Roy,Dante Cunningham,Greg Oden,Jerryd Bayless,Martell Webster,2,8:32,POR,shot,,,,,,,,,,Dante Cunningham,,,,missed,,jump,38,23
DeMarre Carroll,Hasheem Thabeet,Jamaal Tinsley,Marc Gasol,O.J. Mayo,Brandon Roy,Dante Cunningham,Greg Oden,Jerryd Bayless,Martell Webster,2,8:31,MEM,rebound,,,,,,,,,,O.J. Mayo,,,,,,def,,