a1,a2,a3,a4,a5,h1,h2,h3,h4,h5,period,time,team,etype,assist,away,block,entered,home,left,num,opponent,outof,player,points,possession,reason,result,steal,type,x,y
Brandon Jennings,Carlos Delfino,Charlie Bell,Dan Gadzuric,Ersan Ilyasova,Marc Gasol,Mike Conley,O.J. Mayo,Rudy Gay,Zach Randolph,1,12:00,OFF,jump ball,,Dan Gadzuric,,,Marc Gasol,,,,,,,Zach Randolph,,,,,,
Brandon Jennings,Carlos Delfino,Charlie Bell,Dan Gadzuric,Ersan Ilyasova,Marc Gasol,Mike Conley,O.J. Mayo,Rudy Gay,Zach Randolph,1,11:38,MEM,turnover,,,,,,,,,,Rudy Gay,,,out of bounds lost ball turnover,,,,,
Brandon Jennings,Carlos Delfino,Charlie Bell,Dan Gadzuric,Ersan Ilyasova,Marc Gasol,Mike Conley,O.J. Mayo,Rudy Gay,Zach Randolph,1,11:21,MIL,shot,Ersan Ilyasova,,,,,,,,,Charlie Bell,3,,,made,,3pt,2,6
Brandon Jennings,Carlos Delfino,Charlie Bell,Dan Gadzuric,Ersan Ilyasova,Marc Gasol,Mike Conley,O.J. Mayo,Rudy Gay,Zach Randolph,1,11:10,MEM,turnover,,,,,,,,,,Zach Randolph,,,,,,,,
Brandon Jennings,Carlos Delfino,Charlie Bell,Dan Gadzuric,Ersan Ilyasova,Marc Gasol,Mike Conley,O.J. Mayo,Rudy Gay,Zach Randolph,1,10:57,MIL,shot,,,,,,,,,,Brandon Jennings,,,,missed,,3pt,20,32
Brandon Jennings,Carlos Delfino,Charlie Bell,Dan Gadzuric,Ersan Ilyasova,Marc Gasol,Mike Conley,O.J. Mayo,Rudy Gay,Zach Randolph,1,10:56,MEM,rebound,,,,,,,,,,Rudy Gay,,,,,,def,,
Brandon Jennings,Carlos Delfino,Charlie Bell,Dan Gadzuric,Ersan Ilyasova,Marc Gasol,Mike Conley,O.J. Mayo,Rudy Gay,Zach Randolph,1,10:49,MEM,shot,,,,,,,,,,Rudy Gay,3,,,made,,3pt,14,29
Brandon Jennings,Carlos Delfino,Charlie Bell,Dan Gadzuric,Ersan Ilyasova,Marc Gasol,Mike Conley,O.J. Mayo,Rudy Gay,Zach Randolph,1,10:28,MIL,shot,,,,,,,,,,Charlie Bell,,,,missed,,3pt,1,7
Brandon Jennings,Carlos Delfino,Charlie Bell,Dan Gadzuric,Ersan Ilyasova,Marc Gasol,Mike Conley,O.J. Mayo,Rudy Gay,Zach Randolph,1,10:27,MEM,rebound,,,,,,,,,,Zach Randolph,,,,,,def,,
Brandon Jennings,Carlos Delfino,Charlie Bell,Dan Gadzuric,Ersan Ilyasova,Marc Gasol,Mike Conley,O.J. Mayo,Rudy Gay,Zach Randolph,1,10:14,MIL,foul,,,,,,,,Rudy Gay,,Carlos Delfino,,,,,,shooting,,
Brandon Jennings,Carlos Delfino,Charlie Bell,Dan Gadzuric,Ersan Ilyasova,Marc Gasol,Mike Conley,O.J. Mayo,Rudy Gay,Zach Randolph,1,10:14,MEM,free throw,,,,,,,1,,2,Rudy Gay,,,foul,made,,,,
Brandon Jennings,Carlos Delfino,Charlie Bell,Dan Gadzuric,Ersan Ilyasova,Marc Gasol,Mike Conley,O.J. Mayo,Rudy Gay,Zach Randolph,1,10:14,MEM,free throw,,,,,,,2,,2,Rudy Gay,,,foul,made,,,,
Brandon Jennings,Carlos Delfino,Charlie Bell,Dan Gadzuric,Ersan Ilyasova,Marc Gasol,Mike Conley,O.J. Mayo,Rudy Gay,Zach Randolph,1,9:59,MIL,shot,,,,,,,,,,Carlos Delfino,,,,missed,,jump,19,24
Brandon Jennings,Carlos Delfino,Charlie Bell,Dan Gadzuric,Ersan Ilyasova,Marc Gasol,Mike Conley,O.J. Mayo,Rudy Gay,Zach Randolph,1,9:58,MEM,rebound,,,,,,,,,,O.J. Mayo,,,,,,def,,
Brandon Jennings,Carlos Delfino,Charlie Bell,Dan Gadzuric,Ersan Ilyasova,Marc Gasol,Mike Conley,O.J. Mayo,Rudy Gay,Zach Randolph,1,9:53,MEM,shot,,,,,,,,,,O.J. Mayo,,,,missed,,layup,25,6
Brandon Jennings,Carlos Delfino,Charlie Bell,Dan Gadzuric,Ersan Ilyasova,Marc Gasol,Mike Conley,O.J. Mayo,Rudy Gay,Zach Randolph,1,9:50,MIL,rebound,,,,,,,,,,Ersan Ilyasova,,,,,,def,,
Brandon Jennings,Carlos Delfino,Charlie Bell,Dan Gadzuric,Ersan Ilyasova,Marc Gasol,Mike Conley,O.J. Mayo,Rudy Gay,Zach Randolph,1,9:36,MIL,shot,,,,,,,,,,Dan Gadzuric,2,,,made,,running bank hook,24,11
Brandon Jennings,Carlos Delfino,Charlie Bell,Dan Gadzuric,Ersan Ilyasova,Marc Gasol,Mike Conley,O.J. Mayo,Rudy Gay,Zach Randolph,1,9:19,MEM,turnover,,,,,,,,,,Zach Randolph,,,lost ball,,Charlie Bell,,,
Brandon Jennings,Carlos Delfino,Charlie Bell,Dan Gadzuric,Ersan Ilyasova,Marc Gasol,Mike Conley,O.J. Mayo,Rudy Gay,Zach Randolph,1,9:16,MEM,foul,,,,,,,,Brandon Jennings,,Mike Conley,,,,,,shooting,,
Brandon Jennings,Carlos Delfino,Charlie Bell,Dan Gadzuric,Ersan Ilyasova,Marc Gasol,Mike Conley,O.J. Mayo,Rudy Gay,Zach Randolph,1,9:16,MIL,free throw,,,,,,,1,,2,Brandon Jennings,,,foul,made,,,,
Brandon Jennings,Carlos Delfino,Charlie Bell,Dan Gadzuric,Ersan Ilyasova,Marc Gasol,Mike Conley,O.J. Mayo,Rudy Gay,Zach Randolph,1,9:16,MIL,free throw,,,,,,,2,,2,Brandon Jennings,,,foul,made,,,,
Brandon Jennings,Carlos Delfino,Charlie Bell,Dan Gadzuric,Ersan Ilyasova,Marc Gasol,Mike Conley,O.J. Mayo,Rudy Gay,Zach Randolph,1,9:04,MEM,shot,O.J. Mayo,,,,,,,,,Zach Randolph,2,,,made,,jump,22,27
Brandon Jennings,Carlos Delfino,Charlie Bell,Dan Gadzuric,Ersan Ilyasova,Marc Gasol,Mike Conley,O.J. Mayo,Rudy Gay,Zach Randolph,1,8:49,MIL,turnover,,,,,,,,,,Carlos Delfino,,,bad pass,,O.J. Mayo,,,
Brandon Jennings,Carlos Delfino,Charlie Bell,Dan Gadzuric,Ersan Ilyasova,Marc Gasol,Mike Conley,O.J. Mayo,Rudy Gay,Zach Randolph,1,8:46,MIL,foul,,,,,,,,O.J. Mayo,,Ersan Ilyasova,,,,,,shooting,,
Brandon Jennings,Carlos Delfino,Charlie Bell,Dan Gadzuric,Ersan Ilyasova,Marc Gasol,Mike Conley,O.J. Mayo,Rudy Gay,Zach Randolph,1,8:46,MEM,free throw,,,,,,,1,,2,O.J. Mayo,,,foul,missed,,,,
Brandon Jennings,Carlos Delfino,Charlie Bell,Dan Gadzuric,Ersan Ilyasova,Marc Gasol,Mike Conley,O.J. Mayo,Rudy Gay,Zach Randolph,1,8:46,MEM,rebound,,,,,,,,,,,,,,,,,,
Brandon Jennings,Carlos Delfino,Charlie Bell,Dan Gadzuric,Ersan Ilyasova,Marc Gasol,Mike Conley,O.J. Mayo,Rudy Gay,Zach Randolph,1,8:46,MEM,free throw,,,,,,,2,,2,O.J. Mayo,,,foul,missed,,,,
Brandon Jennings,Carlos Delfino,Charlie Bell,Dan Gadzuric,Ersan Ilyasova,Marc Gasol,Mike Conley,O.J. Mayo,Rudy Gay,Zach Randolph,1,8:44,MIL,rebound,,,,,,,,,,Ersan Ilyasova,,,,,,def,,
Brandon Jennings,Carlos Delfino,Charlie Bell,Dan Gadzuric,Ersan Ilyasova,Marc Gasol,Mike Conley,O.J. Mayo,Rudy Gay,Zach Randolph,1,8:29,MIL,shot,,,,,,,,,,Brandon Jennings,,,,missed,,running jump,17,10
Brandon Jennings,Carlos Delfino,Charlie Bell,Dan Gadzuric,Ersan Ilyasova,Marc Gasol,Mike Conley,O.J. Mayo,Rudy Gay,Zach Randolph,1,8:26,MEM,rebound,,,,,,,,,,Marc Gasol,,,,,,def,,
Brandon Jennings,Carlos Delfino,Charlie Bell,Dan Gadzuric,Ersan Ilyasova,Marc Gasol,Mike Conley,O.J. Mayo,Rudy Gay,Zach Randolph,1,8:22,MIL,foul,,,,,,,,Mike Conley,,Ersan Ilyasova,,,,,,shooting,,
Brandon Jennings,Carlos Delfino,Charlie Bell,Dan Gadzuric,Ersan Ilyasova,Marc Gasol,Mike Conley,O.J. Mayo,Rudy Gay,Zach Randolph,1,8:22,MEM,free throw,,,,,,,1,,2,Mike Conley,,,foul,made,,,,
Brandon Jennings,Carlos Delfino,Charlie Bell,Dan Gadzuric,Hakim Warrick,Marc Gasol,Mike Conley,O.J. Mayo,Rudy Gay,Zach Randolph,1,8:22,MIL,sub,,,,Hakim Warrick,,Ersan Ilyasova,,,,,,,,,,,,
Brandon Jennings,Carlos Delfino,Charlie Bell,Dan Gadzuric,Hakim Warrick,Marc Gasol,Mike Conley,O.J. Mayo,Rudy Gay,Zach Randolph,1,8:22,MEM,free throw,,,,,,,2,,2,Mike Conley,,,foul,made,,,,
Brandon Jennings,Carlos Delfino,Charlie Bell,Dan Gadzuric,Hakim Warrick,Marc Gasol,Mike Conley,O.J. Mayo,Rudy Gay,Zach Randolph,1,8:08,MIL,turnover,,,,,,,,,,Dan Gadzuric,,,lost ball,,Mike Conley,,,
Brandon Jennings,Carlos Delfino,Charlie Bell,Dan Gadzuric,Hakim Warrick,Marc Gasol,Mike Conley,O.J. Mayo,Rudy Gay,Zach Randolph,1,8:02,MEM,shot,Mike Conley,,,,,,,,,Zach Randolph,2,,,made,,layup,25,6
Brandon Jennings,Carlos Delfino,Charlie Bell,Dan Gadzuric,Hakim Warrick,Marc Gasol,Mike Conley,O.J. Mayo,Rudy Gay,Zach Randolph,1,7:43,MIL,shot,,,,,,,,,,Charlie Bell,,,,missed,,3pt,2,7
Brandon Jennings,Carlos Delfino,Charlie Bell,Dan Gadzuric,Hakim Warrick,Marc Gasol,Mike Conley,O.J. Mayo,Rudy Gay,Zach Randolph,1,7:41,MIL,rebound,,,,,,,,,,Dan Gadzuric,,,,,,off,,
Brandon Jennings,Carlos Delfino,Charlie Bell,Dan Gadzuric,Hakim Warrick,Marc Gasol,Mike Conley,O.J. Mayo,Rudy Gay,Zach Randolph,1,7:41,MIL,shot,,,,,,,,,,Dan Gadzuric,,,,missed,,tip,25,6
Brandon Jennings,Carlos Delfino,Charlie Bell,Dan Gadzuric,Hakim Warrick,Marc Gasol,Mike Conley,O.J. Mayo,Rudy Gay,Zach Randolph,1,7:39,MIL,rebound,,,,,,,,,,Dan Gadzuric,,,,,,off,,
Brandon Jennings,Carlos Delfino,Charlie Bell,Dan Gadzuric,Hakim Warrick,Marc Gasol,Mike Conley,O.J. Mayo,Rudy Gay,Zach Randolph,1,7:39,MIL,shot,,,,,,,,,,Dan Gadzuric,,,,missed,,tip,25,6
Brandon Jennings,Carlos Delfino,Charlie Bell,Dan Gadzuric,Hakim Warrick,Marc Gasol,Mike Conley,O.J. Mayo,Rudy Gay,Zach Randolph,1,7:37,MEM,rebound,,,,,,,,,,Marc Gasol,,,,,,def,,
Brandon Jennings,Carlos Delfino,Charlie Bell,Dan Gadzuric,Hakim Warrick,Marc Gasol,Mike Conley,O.J. Mayo,Rudy Gay,Zach Randolph,1,7:31,MEM,shot,O.J. Mayo,,,,,,,,,Marc Gasol,2,,,made,,layup,25,6
Brandon Jennings,Carlos Delfino,Charlie Bell,Dan Gadzuric,Hakim Warrick,Marc Gasol,Mike Conley,O.J. Mayo,Rudy Gay,Zach Randolph,1,7:18,MIL,shot,,,,,,,,,,Hakim Warrick,,,,missed,,jump,38,21
Brandon Jennings,Carlos Delfino,Charlie Bell,Dan Gadzuric,Hakim Warrick,Marc Gasol,Mike Conley,O.J. Mayo,Rudy Gay,Zach Randolph,1,7:17,MEM,rebound,,,,,,,,,,Rudy Gay,,,,,,def,,
Brandon Jennings,Carlos Delfino,Charlie Bell,Dan Gadzuric,Hakim Warrick,Marc Gasol,Mike Conley,O.J. Mayo,Rudy Gay,Zach Randolph,1,6:57,MEM,shot,Rudy Gay,,,,,,,,,Marc Gasol,2,,,made,,dunk,25,6
Brandon Jennings,Carlos Delfino,Charlie Bell,Dan Gadzuric,Hakim Warrick,Marc Gasol,Mike Conley,O.J. Mayo,Rudy Gay,Zach Randolph,1,6:44,MIL,shot,,,,,,,,,,Carlos Delfino,,,,missed,,jump,12,21
Brandon Jennings,Carlos Delfino,Charlie Bell,Dan Gadzuric,Hakim Warrick,Marc Gasol,Mike Conley,O.J. Mayo,Rudy Gay,Zach Randolph,1,6:43,MEM,rebound,,,,,,,,,,Marc Gasol,,,,,,def,,
Brandon Jennings,Carlos Delfino,Charlie Bell,Dan Gadzuric,Hakim Warrick,Marc Gasol,Mike Conley,O.J. Mayo,Rudy Gay,Zach Randolph,1,6:31,MEM,shot,,,,,,,,,,Rudy Gay,,,,missed,,jump,37,9
Brandon Jennings,Carlos Delfino,Charlie Bell,Dan Gadzuric,Hakim Warrick,Marc Gasol,Mike Conley,O.J. Mayo,Rudy Gay,Zach Randolph,1,6:30,MEM,rebound,,,,,,,,,,Marc Gasol,,,,,,off,,
Brandon Jennings,Carlos Delfino,Charlie Bell,Dan Gadzuric,Hakim Warrick,Marc Gasol,Mike Conley,O.J. Mayo,Rudy Gay,Zach Randolph,1,6:30,MEM,shot,,,,,,,,,,Marc Gasol,2,,,made,,layup,25,6
Brandon Jennings,Carlos Delfino,Charlie Bell,Dan Gadzuric,Hakim Warrick,Marc Gasol,Mike Conley,O.J. Mayo,Rudy Gay,Zach Randolph,1,6:30,MIL,foul,,,,,,,,Marc Gasol,,Dan Gadzuric,,,,,,shooting,,
Carlos Delfino,Charlie Bell,Dan Gadzuric,Hakim Warrick,Luke Ridnour,Marc Gasol,Mike Conley,O.J. Mayo,Rudy Gay,Zach Randolph,1,6:30,MIL,sub,,,,Luke Ridnour,,Brandon Jennings,,,,,,,,,,,,
Carlos Delfino,Charlie Bell,Hakim Warrick,Kurt Thomas,Luke Ridnour,Marc Gasol,Mike Conley,O.J. Mayo,Rudy Gay,Zach Randolph,1,6:30,MIL,sub,,,,Kurt Thomas,,Dan Gadzuric,,,,,,,,,,,,
Charlie Bell,Hakim Warrick,Jodie Meeks,Kurt Thomas,Luke Ridnour,Marc Gasol,Mike Conley,O.J. Mayo,Rudy Gay,Zach Randolph,1,6:30,MIL,sub,,,,Jodie Meeks,,Carlos Delfino,,,,,,,,,,,,
Charlie Bell,Hakim Warrick,Jodie Meeks,Kurt Thomas,Luke Ridnour,Marc Gasol,Mike Conley,O.J. Mayo,Rudy Gay,Zach Randolph,1,6:30,MEM,free throw,,,,,,,1,,1,Marc Gasol,,,foul,missed,,,,
Charlie Bell,Hakim Warrick,Jodie Meeks,Kurt Thomas,Luke Ridnour,Marc Gasol,Mike Conley,O.J. Mayo,Rudy Gay,Zach Randolph,1,6:28,MIL,rebound,,,,,,,,,,Hakim Warrick,,,,,,def,,
Charlie Bell,Hakim Warrick,Jodie Meeks,Kurt Thomas,Luke Ridnour,Marc Gasol,Mike Conley,O.J. Mayo,Rudy Gay,Zach Randolph,1,6:12,MIL,shot,,,Zach Randolph,,,,,,,Charlie Bell,,,,missed,,driving layup,25,6
Charlie Bell,Hakim Warrick,Jodie Meeks,Kurt Thomas,Luke Ridnour,Marc Gasol,Mike Conley,O.J. Mayo,Rudy Gay,Zach Randolph,1,6:09,MEM,rebound,,,,,,,,,,Zach Randolph,,,,,,def,,
Charlie Bell,Hakim Warrick,Jodie Meeks,Kurt Thomas,Luke Ridnour,Marc Gasol,Mike Conley,O.J. Mayo,Rudy Gay,Zach Randolph,1,6:05,MEM,shot,,,,,,,,,,O.J. Mayo,,,,missed,,3pt,40,25
Charlie Bell,Hakim Warrick,Jodie Meeks,Kurt Thomas,Luke Ridnour,Marc Gasol,Mike Conley,O.J. Mayo,Rudy Gay,Zach Randolph,1,6:02,MIL,rebound,,,,,,,,,,Jodie Meeks,,,,,,def,,
Charlie Bell,Hakim Warrick,Jodie Meeks,Kurt Thomas,Luke Ridnour,Marc Gasol,Mike Conley,O.J. Mayo,Rudy Gay,Zach Randolph,1,5:52,MIL,shot,Luke Ridnour,,,,,,,,,Jodie Meeks,2,,,made,,jump,44,9
Charlie Bell,Hakim Warrick,Jodie Meeks,Kurt Thomas,Luke Ridnour,Marc Gasol,Mike Conley,O.J. Mayo,Rudy Gay,Zach Randolph,1,5:34,MEM,shot,,,,,,,,,,Zach Randolph,2,,,made,,turnaround jump,36,11
Charlie Bell,Hakim Warrick,Jodie Meeks,Kurt Thomas,Luke Ridnour,Marc Gasol,Mike Conley,O.J. Mayo,Rudy Gay,Zach Randolph,1,5:21,MIL,shot,Luke Ridnour,,,,,,,,,Kurt Thomas,2,,,made,,jump,24,24
Charlie Bell,Hakim Warrick,Jodie Meeks,Kurt Thomas,Luke Ridnour,Marc Gasol,Mike Conley,O.J. Mayo,Rudy Gay,Zach Randolph,1,5:08,MEM,turnover,,,,,,,,,,Marc Gasol,,,traveling,,,,,
Charlie Bell,Hakim Warrick,Jodie Meeks,Kurt Thomas,Luke Ridnour,Marc Gasol,Mike Conley,O.J. Mayo,Rudy Gay,Zach Randolph,1,5:08,MEM,timeout,,,,,,,,,,,,,,,,regular,,
Hakim Warrick,Jodie Meeks,Kurt Thomas,Luke Ridnour,Roko Ukic,Marc Gasol,Mike Conley,O.J. Mayo,Rudy Gay,Zach Randolph,1,5:08,MIL,sub,,,,Roko Ukic,,Charlie Bell,,,,,,,,,,,,
Hakim Warrick,Jodie Meeks,Kurt Thomas,Luke Ridnour,Roko Ukic,Marc Gasol,Mike Conley,O.J. Mayo,Rudy Gay,Zach Randolph,1,4:54,MIL,shot,,,,,,,,,,Roko Ukic,2,,,made,,running jump,34,5
Hakim Warrick,Jodie Meeks,Kurt Thomas,Luke Ridnour,Roko Ukic,Marc Gasol,Mike Conley,O.J. Mayo,Rudy Gay,Zach Randolph,1,4:38,MEM,shot,Marc Gasol,,,,,,,,,O.J. Mayo,2,,,made,,jump,41,19
Hakim Warrick,Jodie Meeks,Kurt Thomas,Luke Ridnour,Roko Ukic,Marc Gasol,Mike Conley,O.J. Mayo,Rudy Gay,Zach Randolph,1,4:23,MIL,shot,,,,,,,,,,Kurt Thomas,,,,missed,,jump,32,22
Hakim Warrick,Jodie Meeks,Kurt Thomas,Luke Ridnour,Roko Ukic,Marc Gasol,Mike Conley,O.J. Mayo,Rudy Gay,Zach Randolph,1,4:22,MEM,rebound,,,,,,,,,,,,,,,,,,
Hakim Warrick,Jodie Meeks,Kurt Thomas,Luke Ridnour,Roko Ukic,Marc Gasol,Mike Conley,O.J. Mayo,Rudy Gay,Zach Randolph,1,4:04,MEM,turnover,,,,,,,,,,Marc Gasol,,,bad pass,,Hakim Warrick,,,
Hakim Warrick,Jodie Meeks,Kurt Thomas,Luke Ridnour,Roko Ukic,Marc Gasol,Mike Conley,O.J. Mayo,Rudy Gay,Zach Randolph,1,3:58,MIL,shot,Luke Ridnour,,,,,,,,,Hakim Warrick,2,,,made,,jump,40,9
Hakim Warrick,Jodie Meeks,Kurt Thomas,Luke Ridnour,Roko Ukic,Marc Gasol,Mike Conley,O.J. Mayo,Rudy Gay,Zach Randolph,1,3:40,MEM,shot,,,,,,,,,,Mike Conley,,,,missed,,layup,25,6
Hakim Warrick,Jodie Meeks,Kurt Thomas,Luke Ridnour,Roko Ukic,Marc Gasol,Mike Conley,O.J. Mayo,Rudy Gay,Zach Randolph,1,3:39,MIL,rebound,,,,,,,,,,Jodie Meeks,,,,,,def,,
Hakim Warrick,Jodie Meeks,Kurt Thomas,Luke Ridnour,Roko Ukic,Marc Gasol,Mike Conley,O.J. Mayo,Rudy Gay,Zach Randolph,1,3:27,MIL,shot,,,,,,,,,,Luke Ridnour,2,,,made,,pullup jump,39,18
Hakim Warrick,Jodie Meeks,Kurt Thomas,Luke Ridnour,Roko Ukic,Marc Gasol,Mike Conley,O.J. Mayo,Rudy Gay,Zach Randolph,1,3:15,MEM,shot,O.J. Mayo,,,,,,,,,Marc Gasol,2,,,made,,layup,25,6
Hakim Warrick,Jodie Meeks,Kurt Thomas,Luke Ridnour,Roko Ukic,Marc Gasol,Mike Conley,O.J. Mayo,Rudy Gay,Zach Randolph,1,3:07,MIL,turnover,,,,,,,,,,Jodie Meeks,,,lost ball,,Mike Conley,,,
Hakim Warrick,Jodie Meeks,Kurt Thomas,Luke Ridnour,Roko Ukic,Marc Gasol,Mike Conley,O.J. Mayo,Rudy Gay,Zach Randolph,1,3:04,MIL,foul,,,,,,,,O.J. Mayo,,Luke Ridnour,,,,,,shooting,,
Hakim Warrick,Jodie Meeks,Kurt Thomas,Luke Ridnour,Roko Ukic,Marc Gasol,Mike Conley,O.J. Mayo,Rudy Gay,Zach Randolph,1,3:04,MEM,free throw,,,,,,,1,,2,O.J. Mayo,,,foul,made,,,,
Hakim Warrick,Jodie Meeks,Kurt Thomas,Luke Ridnour,Roko Ukic,Marc Gasol,Marcus Williams,O.J. Mayo,Rudy Gay,Zach Randolph,1,3:04,MEM,sub,,,,Marcus Williams,,Mike Conley,,,,,,,,,,,,
Hakim Warrick,Jodie Meeks,Kurt Thomas,Luke Ridnour,Roko Ukic,Marc Gasol,Marcus Williams,O.J. Mayo,Rudy Gay,Zach Randolph,1,3:04,MEM,free throw,,,,,,,2,,2,O.J. Mayo,,,foul,made,,,,
Hakim Warrick,Jodie Meeks,Kurt Thomas,Luke Ridnour,Roko Ukic,Marc Gasol,Marcus Williams,O.J. Mayo,Rudy Gay,Zach Randolph,1,2:48,MIL,shot,,,,,,,,,,Jodie Meeks,,,,missed,,3pt,21,31
Hakim Warrick,Jodie Meeks,Kurt Thomas,Luke Ridnour,Roko Ukic,Marc Gasol,Marcus Williams,O.J. Mayo,Rudy Gay,Zach Randolph,1,2:45,MIL,rebound,,,,,,,,,,Luke Ridnour,,,,,,off,,
Hakim Warrick,Jodie Meeks,Kurt Thomas,Luke Ridnour,Roko Ukic,Marc Gasol,Marcus Williams,O.J. Mayo,Rudy Gay,Zach Randolph,1,2:29,MIL,shot,,,,,,,,,,Roko Ukic,,,,missed,,running jump,23,14
Hakim Warrick,Jodie Meeks,Kurt Thomas,Luke Ridnour,Roko Ukic,Marc Gasol,Marcus Williams,O.J. Mayo,Rudy Gay,Zach Randolph,1,2:27,MEM,rebound,,,,,,,,,,Marc Gasol,,,,,,def,,
Hakim Warrick,Jodie Meeks,Kurt Thomas,Luke Ridnour,Roko Ukic,Marc Gasol,Marcus Williams,O.J. Mayo,Rudy Gay,Zach Randolph,1,2:22,MEM,shot,Marcus Williams,,,,,,,,,Zach Randolph,2,,,made,,layup,25,6
Hakim Warrick,Jodie Meeks,Kurt Thomas,Luke Ridnour,Roko Ukic,Marc Gasol,Marcus Williams,O.J. Mayo,Rudy Gay,Zach Randolph,1,2:09,MIL,shot,,,Zach Randolph,,,,,,,Jodie Meeks,,,,missed,,reverse layup,25,6
Hakim Warrick,Jodie Meeks,Kurt Thomas,Luke Ridnour,Roko Ukic,Marc Gasol,Marcus Williams,O.J. Mayo,Rudy Gay,Zach Randolph,1,2:06,MEM,rebound,,,,,,,,,,Zach Randolph,,,,,,def,,
Hakim Warrick,Jodie Meeks,Kurt Thomas,Luke Ridnour,Roko Ukic,Marc Gasol,Marcus Williams,O.J. Mayo,Rudy Gay,Zach Randolph,1,2:03,MIL,timeout,,,,,,,,,,,,,,,,regular,,
Hakim Warrick,Jodie Meeks,Kurt Thomas,Luke Ridnour,Roko Ukic,Marc Gasol,Marcus Williams,O.J. Mayo,Rudy Gay,Zach Randolph,1,1:54,MEM,shot,,,,,,,,,,O.J. Mayo,2,,,made,,step back jump,26,22
Hakim Warrick,Jodie Meeks,Kurt Thomas,Luke Ridnour,Roko Ukic,Marc Gasol,Marcus Williams,O.J. Mayo,Rudy Gay,Zach Randolph,1,1:36,MIL,shot,,,,,,,,,,Luke Ridnour,,,,missed,,jump,45,6
Hakim Warrick,Jodie Meeks,Kurt Thomas,Luke Ridnour,Roko Ukic,Marc Gasol,Marcus Williams,O.J. Mayo,Rudy Gay,Zach Randolph,1,1:35,MEM,rebound,,,,,,,,,,Marc Gasol,,,,,,def,,
Hakim Warrick,Jodie Meeks,Kurt Thomas,Luke Ridnour,Roko Ukic,Marc Gasol,Marcus Williams,O.J. Mayo,Rudy Gay,Zach Randolph,1,1:20,MEM,turnover,,,,,,,,,,O.J. Mayo,,,out of bounds lost ball turnover,,,,,
Hakim Warrick,Jodie Meeks,Kurt Thomas,Luke Ridnour,Roko Ukic,DeMarre Carroll,Marc Gasol,Marcus Williams,O.J. Mayo,Zach Randolph,1,1:20,MEM,sub,,,,DeMarre Carroll,,Rudy Gay,,,,,,,,,,,,
Hakim Warrick,Jodie Meeks,Kurt Thomas,Luke Ridnour,Roko Ukic,DeMarre Carroll,Marc Gasol,Marcus Williams,O.J. Mayo,Zach Randolph,1,1:08,MIL,shot,,,,,,,,,,Hakim Warrick,,,,missed,,jump,36,12
Hakim Warrick,Jodie Meeks,Kurt Thomas,Luke Ridnour,Roko Ukic,DeMarre Carroll,Marc Gasol,Marcus Williams,O.J. Mayo,Zach Randolph,1,1:07,MEM,rebound,,,,,,,,,,Marcus Williams,,,,,,def,,
Hakim Warrick,Jodie Meeks,Kurt Thomas,Luke Ridnour,Roko Ukic,DeMarre Carroll,Marc Gasol,Marcus Williams,O.J. Mayo,Zach Randolph,1,0:54,MEM,shot,,,,,,,,,,Marcus Williams,,,,missed,,layup,25,6
Hakim Warrick,Jodie Meeks,Kurt Thomas,Luke Ridnour,Roko Ukic,DeMarre Carroll,Marc Gasol,Marcus Williams,O.J. Mayo,Zach Randolph,1,0:53,MIL,rebound,,,,,,,,,,Jodie Meeks,,,,,,def,,
Hakim Warrick,Jodie Meeks,Kurt Thomas,Luke Ridnour,Roko Ukic,DeMarre Carroll,Marc Gasol,Marcus Williams,O.J. Mayo,Zach Randolph,1,0:42,MEM,foul,,,,,,,,Hakim Warrick,,Zach Randolph,,,,,,personal,,
Hakim Warrick,Jodie Meeks,Kurt Thomas,Luke Ridnour,Roko Ukic,DeMarre Carroll,Marc Gasol,Marcus Williams,O.J. Mayo,Zach Randolph,1,0:35,MIL,turnover,,,,,,,,,,Kurt Thomas,,,bad pass,,Zach Randolph,,,
Hakim Warrick,Jodie Meeks,Kurt Thomas,Luke Ridnour,Roko Ukic,DeMarre Carroll,Marc Gasol,Marcus Williams,O.J. Mayo,Zach Randolph,1,0:21,MEM,shot,,,,,,,,,,O.J. Mayo,,,,missed,,3pt,11,29
Hakim Warrick,Jodie Meeks,Kurt Thomas,Luke Ridnour,Roko Ukic,DeMarre Carroll,Marc Gasol,Marcus Williams,O.J. Mayo,Zach Randolph,1,0:20,MEM,rebound,,,,,,,,,,Zach Randolph,,,,,,off,,
Hakim Warrick,Jodie Meeks,Kurt Thomas,Luke Ridnour,Roko Ukic,DeMarre Carroll,Marc Gasol,Marcus Williams,O.J. Mayo,Zach Randolph,1,0:17,MEM,shot,,,,,,,,,,Zach Randolph,,,,missed,,jump,23,11
Hakim Warrick,Jodie Meeks,Kurt Thomas,Luke Ridnour,Roko Ukic,DeMarre Carroll,Marc Gasol,Marcus Williams,O.J. Mayo,Zach Randolph,1,0:15,MIL,rebound,,,,,,,,,,Jodie Meeks,,,,,,def,,
Hakim Warrick,Jodie Meeks,Kurt Thomas,Luke Ridnour,Roko Ukic,DeMarre Carroll,Marc Gasol,Marcus Williams,O.J. Mayo,Zach Randolph,1,0:15,MEM,foul,,,,,,,,Jodie Meeks,,DeMarre Carroll,,,,,,personal,,
Hakim Warrick,Jodie Meeks,Kurt Thomas,Luke Ridnour,Roko Ukic,DeMarre Carroll,Marc Gasol,Marcus Williams,O.J. Mayo,Zach Randolph,1,0:15,MIL,free throw,,,,,,,1,,2,Jodie Meeks,,,foul,made,,,,
Hakim Warrick,Jodie Meeks,Kurt Thomas,Luke Ridnour,Roko Ukic,DeMarre Carroll,Marc Gasol,Marcus Williams,O.J. Mayo,Sam Young,1,0:15,MEM,sub,,,,Sam Young,,Zach Randolph,,,,,,,,,,,,
Hakim Warrick,Jodie Meeks,Kurt Thomas,Luke Ridnour,Roko Ukic,DeMarre Carroll,Marc Gasol,Marcus Williams,O.J. Mayo,Sam Young,1,0:15,MIL,free throw,,,,,,,2,,2,Jodie Meeks,,,foul,made,,,,
Hakim Warrick,Jodie Meeks,Kurt Thomas,Luke Ridnour,Roko Ukic,DeMarre Carroll,Marc Gasol,Marcus Williams,O.J. Mayo,Sam Young,1,0:01,MEM,shot,,,,,,,,,,DeMarre Carroll,,,,missed,,jump,5,5
Hakim Warrick,Jodie Meeks,Kurt Thomas,Luke Ridnour,Roko Ukic,DeMarre Carroll,Marc Gasol,Marcus Williams,O.J. Mayo,Sam Young,1,0:00,MIL,rebound,,,,,,,,,,Kurt Thomas,,,,,,def,,
Hakim Warrick,Jodie Meeks,Kurt Thomas,Luke Ridnour,Roko Ukic,DeMarre Carroll,Marc Gasol,Marcus Williams,Rudy Gay,Sam Young,2,11:54,MEM,foul,,,,,,,,Luke Ridnour,,Marcus Williams,,,,,,personal,,
Hakim Warrick,Jodie Meeks,Kurt Thomas,Luke Ridnour,Roko Ukic,DeMarre Carroll,Marc Gasol,Marcus Williams,Rudy Gay,Sam Young,2,11:39,MIL,shot,,,,,,,,,,Roko Ukic,,,,missed,,jump,37,13
Hakim Warrick,Jodie Meeks,Kurt Thomas,Luke Ridnour,Roko Ukic,DeMarre Carroll,Marc Gasol,Marcus Williams,Rudy Gay,Sam Young,2,11:38,MEM,rebound,,,,,,,,,,Marc Gasol,,,,,,def,,
Hakim Warrick,Jodie Meeks,Kurt Thomas,Luke Ridnour,Roko Ukic,DeMarre Carroll,Marc Gasol,Marcus Williams,Rudy Gay,Sam Young,2,11:21,MEM,turnover,,,,,,,,,,Rudy Gay,,,lost ball,,Kurt Thomas,,,
Hakim Warrick,Jodie Meeks,Kurt Thomas,Luke Ridnour,Roko Ukic,DeMarre Carroll,Marc Gasol,Marcus Williams,Rudy Gay,Sam Young,2,11:15,MIL,shot,Roko Ukic,,,,,,,,,Hakim Warrick,2,,,made,,layup,25,6
Hakim Warrick,Jodie Meeks,Kurt Thomas,Luke Ridnour,Roko Ukic,DeMarre Carroll,Marc Gasol,Marcus Williams,Rudy Gay,Sam Young,2,10:59,MEM,shot,,,,,,,,,,Rudy Gay,,,,missed,,turnaround jump,28,12
Hakim Warrick,Jodie Meeks,Kurt Thomas,Luke Ridnour,Roko Ukic,DeMarre Carroll,Marc Gasol,Marcus Williams,Rudy Gay,Sam Young,2,10:57,MEM,rebound,,,,,,,,,,Marc Gasol,,,,,,off,,
Hakim Warrick,Jodie Meeks,Kurt Thomas,Luke Ridnour,Roko Ukic,DeMarre Carroll,Marc Gasol,Marcus Williams,Rudy Gay,Sam Young,2,10:56,MEM,shot,,,Kurt Thomas,,,,,,,Marc Gasol,,,,missed,,layup,25,6
Hakim Warrick,Jodie Meeks,Kurt Thomas,Luke Ridnour,Roko Ukic,DeMarre Carroll,Marc Gasol,Marcus Williams,Rudy Gay,Sam Young,2,10:53,MEM,rebound,,,,,,,,,,Rudy Gay,,,,,,off,,
Hakim Warrick,Jodie Meeks,Kurt Thomas,Luke Ridnour,Roko Ukic,DeMarre Carroll,Marc Gasol,Marcus Williams,Rudy Gay,Sam Young,2,10:53,MEM,shot,,,,,,,,,,Rudy Gay,2,,,made,,dunk,25,6
Hakim Warrick,Jodie Meeks,Kurt Thomas,Luke Ridnour,Roko Ukic,DeMarre Carroll,Marc Gasol,Marcus Williams,Rudy Gay,Sam Young,2,10:41,MIL,shot,,,,,,,,,,Luke Ridnour,2,,,made,,jump,38,18
Charlie Bell,Hakim Warrick,Jodie Meeks,Kurt Thomas,Luke Ridnour,DeMarre Carroll,Marc Gasol,Marcus Williams,Rudy Gay,Sam Young,2,10:26,MIL,sub,,,,Charlie Bell,,Roko Ukic,,,,,,,,,,,,
Charlie Bell,Hakim Warrick,Jodie Meeks,Kurt Thomas,Luke Ridnour,DeMarre Carroll,Marc Gasol,Marcus Williams,Rudy Gay,Sam Young,2,10:16,MEM,shot,,,,,,,,,,Marcus Williams,,,,missed,,3pt,38,30
Charlie Bell,Hakim Warrick,Jodie Meeks,Kurt Thomas,Luke Ridnour,DeMarre Carroll,Marc Gasol,Marcus Williams,Rudy Gay,Sam Young,2,10:14,MIL,rebound,,,,,,,,,,Kurt Thomas,,,,,,def,,
Charlie Bell,Hakim Warrick,Jodie Meeks,Kurt Thomas,Luke Ridnour,DeMarre Carroll,Marc Gasol,Marcus Williams,Rudy Gay,Sam Young,2,10:09,MIL,shot,Luke Ridnour,,,,,,,,,Hakim Warrick,2,,,made,,slam dunk,25,6
Charlie Bell,Hakim Warrick,Jodie Meeks,Kurt Thomas,Luke Ridnour,DeMarre Carroll,Marc Gasol,Marcus Williams,Rudy Gay,Sam Young,2,9:46,MEM,shot,,,,,,,,,,Sam Young,2,,,made,,pullup bank,35,10
Charlie Bell,Hakim Warrick,Jodie Meeks,Kurt Thomas,Luke Ridnour,DeMarre Carroll,Marc Gasol,Marcus Williams,Rudy Gay,Sam Young,2,9:33,MIL,turnover,,,,,,,,,,Kurt Thomas,,,3 second violation,,,,,