a1,a2,a3,a4,a5,h1,h2,h3,h4,h5,period,time,team,etype,assist,away,block,entered,home,left,num,opponent,outof,player,points,possession,reason,result,steal,type,x,y
Corey Brewer,Jonny Flynn,Nathan Jawai,Ryan Gomes,Ryan Hollins,Marc Gasol,Mike Conley,O.J. Mayo,Rudy Gay,Zach Randolph,1,12:00,OFF,jump ball,,Ryan Hollins,,,Marc Gasol,,,,,,,O.J. Mayo,,,,,,
Corey Brewer,Jonny Flynn,Nathan Jawai,Ryan Gomes,Ryan Hollins,Marc Gasol,Mike Conley,O.J. Mayo,Rudy Gay,Zach Randolph,1,11:43,MEM,shot,,,,,,,,,,Zach Randolph,,,,missed,,jump,36,6
Corey Brewer,Jonny Flynn,Nathan Jawai,Ryan Gomes,Ryan Hollins,Marc Gasol,Mike Conley,O.J. Mayo,Rudy Gay,Zach Randolph,1,11:41,MEM,rebound,,,,,,,,,,Marc Gasol,,,,,,off,,
Corey Brewer,Jonny Flynn,Nathan Jawai,Ryan Gomes,Ryan Hollins,Marc Gasol,Mike Conley,O.J. Mayo,Rudy Gay,Zach Randolph,1,11:36,MEM,shot,,,,,,,,,,Mike Conley,,,,missed,,3pt,6,23
Corey Brewer,Jonny Flynn,Nathan Jawai,Ryan Gomes,Ryan Hollins,Marc Gasol,Mike Conley,O.J. Mayo,Rudy Gay,Zach Randolph,1,11:35,MIN,rebound,,,,,,,,,,Jonny Flynn,,,,,,def,,
Corey Brewer,Jonny Flynn,Nathan Jawai,Ryan Gomes,Ryan Hollins,Marc Gasol,Mike Conley,O.J. Mayo,Rudy Gay,Zach Randolph,1,11:20,MIN,turnover,,,,,,,,,,Ryan Gomes,,,bad pass,,Rudy Gay,,,
Corey Brewer,Jonny Flynn,Nathan Jawai,Ryan Gomes,Ryan Hollins,Marc Gasol,Mike Conley,O.J. Mayo,Rudy Gay,Zach Randolph,1,11:14,MEM,shot,,,,,,,,,,Mike Conley,2,,,made,,reverse layup,25,6
Corey Brewer,Jonny Flynn,Nathan Jawai,Ryan Gomes,Ryan Hollins,Marc Gasol,Mike Conley,O.J. Mayo,Rudy Gay,Zach Randolph,1,10:59,MIN,shot,Ryan Hollins,,,,,,,,,Corey Brewer,2,,,made,,pullup jump,39,18
Corey Brewer,Jonny Flynn,Nathan Jawai,Ryan Gomes,Ryan Hollins,Marc Gasol,Mike Conley,O.J. Mayo,Rudy Gay,Zach Randolph,1,10:40,MEM,shot,,,,,,,,,,Rudy Gay,2,,,made,,running jump,18,16
Corey Brewer,Jonny Flynn,Nathan Jawai,Ryan Gomes,Ryan Hollins,Marc Gasol,Mike Conley,O.J. Mayo,Rudy Gay,Zach Randolph,1,10:17,MIN,turnover,,,,,,,,,,Ryan Gomes,,,out of bounds lost ball turnover,,,,,
Corey Brewer,Jonny Flynn,Nathan Jawai,Ryan Gomes,Ryan Hollins,Marc Gasol,Mike Conley,O.J. Mayo,Rudy Gay,Zach Randolph,1,9:59,MEM,shot,,,,,,,,,,Rudy Gay,,,,missed,,step back jump,10,19
Corey Brewer,Jonny Flynn,Nathan Jawai,Ryan Gomes,Ryan Hollins,Marc Gasol,Mike Conley,O.J. Mayo,Rudy Gay,Zach Randolph,1,9:56,MIN,rebound,,,,,,,,,,Ryan Hollins,,,,,,def,,
Corey Brewer,Jonny Flynn,Nathan Jawai,Ryan Gomes,Ryan Hollins,Marc Gasol,Mike Conley,O.J. Mayo,Rudy Gay,Zach Randolph,1,9:53,MIN,turnover,,,,,,,,,,Jonny Flynn,,,palming turnover,,,,,
Corey Brewer,Jonny Flynn,Nathan Jawai,Ryan Gomes,Ryan Hollins,Marc Gasol,Mike Conley,O.J. Mayo,Rudy Gay,Zach Randolph,1,9:34,MEM,shot,,,,,,,,,,Zach Randolph,,,,missed,,jump,23,27
Corey Brewer,Jonny Flynn,Nathan Jawai,Ryan Gomes,Ryan Hollins,Marc Gasol,Mike Conley,O.J. Mayo,Rudy Gay,Zach Randolph,1,9:33,MIN,rebound,,,,,,,,,,Corey Brewer,,,,,,def,,
Corey Brewer,Jonny Flynn,Nathan Jawai,Ryan Gomes,Ryan Hollins,Marc Gasol,Mike Conley,O.J. Mayo,Rudy Gay,Zach Randolph,1,9:16,MIN,shot,Nathan Jawai,,,,,,,,,Ryan Hollins,2,,,made,,jump,27,19
Corey Brewer,Jonny Flynn,Nathan Jawai,Ryan Gomes,Ryan Hollins,Marc Gasol,Mike Conley,O.J. Mayo,Rudy Gay,Zach Randolph,1,8:57,MEM,turnover,,,,,,,,,,Mike Conley,,,traveling,,,,,
Corey Brewer,Jonny Flynn,Nathan Jawai,Ryan Gomes,Ryan Hollins,Marc Gasol,Mike Conley,O.J. Mayo,Rudy Gay,Zach Randolph,1,8:43,MIN,shot,,,,,,,,,,Ryan Hollins,,,,missed,,running bank,17,9
Corey Brewer,Jonny Flynn,Nathan Jawai,Ryan Gomes,Ryan Hollins,Marc Gasol,Mike Conley,O.J. Mayo,Rudy Gay,Zach Randolph,1,8:42,MIN,rebound,,,,,,,,,,Ryan Hollins,,,,,,off,,
Corey Brewer,Jonny Flynn,Nathan Jawai,Ryan Gomes,Ryan Hollins,Marc Gasol,Mike Conley,O.J. Mayo,Rudy Gay,Zach Randolph,1,8:42,MIN,shot,,,,,,,,,,Ryan Hollins,2,,,made,,tip,25,6
Corey Brewer,Jonny Flynn,Nathan Jawai,Ryan Gomes,Ryan Hollins,Marc Gasol,Mike Conley,O.J. Mayo,Rudy Gay,Zach Randolph,1,8:26,MIN,foul,,,,,,,,Rudy Gay,,Ryan Hollins,,,,,,shooting,,
Corey Brewer,Jonny Flynn,Nathan Jawai,Ryan Gomes,Ryan Hollins,Marc Gasol,Mike Conley,O.J. Mayo,Rudy Gay,Zach Randolph,1,8:26,MEM,free throw,,,,,,,1,,2,Rudy Gay,,,foul,missed,,,,
Corey Brewer,Jonny Flynn,Nathan Jawai,Ryan Gomes,Ryan Hollins,Marc Gasol,Mike Conley,O.J. Mayo,Rudy Gay,Zach Randolph,1,8:26,MEM,rebound,,,,,,,,,,,,,,,,,,
Corey Brewer,Jonny Flynn,Nathan Jawai,Ryan Gomes,Ryan Hollins,Marc Gasol,Mike Conley,O.J. Mayo,Rudy Gay,Zach Randolph,1,8:26,MEM,free throw,,,,,,,2,,2,Rudy Gay,,,foul,made,,,,
Corey Brewer,Jonny Flynn,Nathan Jawai,Ryan Gomes,Ryan Hollins,Marc Gasol,Mike Conley,O.J. Mayo,Rudy Gay,Zach Randolph,1,8:10,MIN,shot,,,,,,,,,,Corey Brewer,2,,,made,,layup,25,6
Corey Brewer,Jonny Flynn,Nathan Jawai,Ryan Gomes,Ryan Hollins,Marc Gasol,Mike Conley,O.J. Mayo,Rudy Gay,Zach Randolph,1,8:04,MEM,shot,,,,,,,,,,O.J. Mayo,,,,missed,,jump,22,10
Corey Brewer,Jonny Flynn,Nathan Jawai,Ryan Gomes,Ryan Hollins,Marc Gasol,Mike Conley,O.J. Mayo,Rudy Gay,Zach Randolph,1,7:58,MIN,rebound,,,,,,,,,,Ryan Hollins,,,,,,def,,
Corey Brewer,Jonny Flynn,Nathan Jawai,Ryan Gomes,Ryan Hollins,Marc Gasol,Mike Conley,O.J. Mayo,Rudy Gay,Zach Randolph,1,7:52,MIN,shot,,,,,,,,,,Jonny Flynn,,,,missed,,jump,18,12
Corey Brewer,Jonny Flynn,Nathan Jawai,Ryan Gomes,Ryan Hollins,Marc Gasol,Mike Conley,O.J. Mayo,Rudy Gay,Zach Randolph,1,7:46,MEM,rebound,,,,,,,,,,Zach Randolph,,,,,,def,,
Corey Brewer,Jonny Flynn,Nathan Jawai,Ryan Gomes,Ryan Hollins,Marc Gasol,Mike Conley,O.J. Mayo,Rudy Gay,Zach Randolph,1,7:35,MEM,shot,,,,,,,,,,Mike Conley,2,,,made,,layup,25,6
Corey Brewer,Jonny Flynn,Nathan Jawai,Ryan Gomes,Ryan Hollins,Marc Gasol,Mike Conley,O.J. Mayo,Rudy Gay,Zach Randolph,1,7:26,MIN,shot,,,,,,,,,,Ryan Gomes,2,,,made,,pullup jump,25,21
Corey Brewer,Jonny Flynn,Nathan Jawai,Ryan Gomes,Ryan Hollins,Marc Gasol,Mike Conley,O.J. Mayo,Rudy Gay,Zach Randolph,1,7:07,MEM,shot,,,,,,,,,,Rudy Gay,,,,missed,,layup,25,6
Corey Brewer,Jonny Flynn,Nathan Jawai,Ryan Gomes,Ryan Hollins,Marc Gasol,Mike Conley,O.J. Mayo,Rudy Gay,Zach Randolph,1,7:06,MIN,rebound,,,,,,,,,,Ryan Gomes,,,,,,def,,
Corey Brewer,Jonny Flynn,Nathan Jawai,Ryan Gomes,Ryan Hollins,Marc Gasol,Mike Conley,O.J. Mayo,Rudy Gay,Zach Randolph,1,7:01,MEM,foul,,,,,,,,Corey Brewer,,O.J. Mayo,,,,,,personal,,
Corey Brewer,Jonny Flynn,Nathan Jawai,Ryan Gomes,Ryan Hollins,Marc Gasol,Mike Conley,O.J. Mayo,Rudy Gay,Zach Randolph,1,6:56,MIN,shot,Ryan Hollins,,,,,,,,,Corey Brewer,2,,,made,,pullup jump,38,20
Corey Brewer,Jonny Flynn,Nathan Jawai,Ryan Gomes,Ryan Hollins,Marc Gasol,Mike Conley,O.J. Mayo,Rudy Gay,Zach Randolph,1,6:36,MEM,turnover,,,,,,,,,,Marc Gasol,,,traveling,,,,,
Corey Brewer,Jonny Flynn,Nathan Jawai,Ryan Gomes,Ryan Hollins,Marc Gasol,Mike Conley,O.J. Mayo,Rudy Gay,Zach Randolph,1,6:24,MEM,foul,,,,,,,,Corey Brewer,,O.J. Mayo,,,,,,personal,,
Corey Brewer,Jonny Flynn,Nathan Jawai,Ryan Gomes,Ryan Hollins,Marc Gasol,Mike Conley,Rudy Gay,Sam Young,Zach Randolph,1,6:24,MEM,sub,,,,Sam Young,,O.J. Mayo,,,,,,,,,,,,
Corey Brewer,Jonny Flynn,Nathan Jawai,Ryan Gomes,Ryan Hollins,Marc Gasol,Mike Conley,Rudy Gay,Sam Young,Zach Randolph,1,6:18,MIN,shot,,,,,,,,,,Corey Brewer,2,,,made,,jump,29,22
Corey Brewer,Jonny Flynn,Nathan Jawai,Ryan Gomes,Ryan Hollins,Marc Gasol,Mike Conley,Rudy Gay,Sam Young,Zach Randolph,1,6:18,MEM,foul,,,,,,,,Corey Brewer,,Sam Young,,,,,,shooting,,
Corey Brewer,Jonny Flynn,Nathan Jawai,Ryan Gomes,Ryan Hollins,Marc Gasol,Mike Conley,Rudy Gay,Sam Young,Zach Randolph,1,6:18,MIN,free throw,,,,,,,1,,1,Corey Brewer,,,foul,made,,,,
Corey Brewer,Jonny Flynn,Nathan Jawai,Ryan Gomes,Ryan Hollins,Marc Gasol,Mike Conley,Rudy Gay,Sam Young,Zach Randolph,1,6:14,MEM,timeout,,,,,,,,,,,,,,,,regular,,
Corey Brewer,Jonny Flynn,Nathan Jawai,Ryan Gomes,Ryan Hollins,Marc Gasol,Mike Conley,Rudy Gay,Sam Young,Zach Randolph,1,6:06,MEM,shot,,,,,,,,,,Sam Young,,,,missed,,pullup jump,12,21
Corey Brewer,Jonny Flynn,Nathan Jawai,Ryan Gomes,Ryan Hollins,Marc Gasol,Mike Conley,Rudy Gay,Sam Young,Zach Randolph,1,6:04,MEM,rebound,,,,,,,,,,Marc Gasol,,,,,,off,,
Corey Brewer,Jonny Flynn,Nathan Jawai,Ryan Gomes,Ryan Hollins,Marc Gasol,Mike Conley,Rudy Gay,Sam Young,Zach Randolph,1,6:04,MIN,foul,,,,,,,,Marc Gasol,,Nathan Jawai,,,,,,personal,,
Corey Brewer,Jonny Flynn,Nathan Jawai,Ryan Gomes,Ryan Hollins,Marc Gasol,Mike Conley,Rudy Gay,Sam Young,Zach Randolph,1,5:54,MEM,shot,,,,,,,,,,Sam Young,2,,,made,,jump,18,18
Corey Brewer,Jonny Flynn,Nathan Jawai,Ryan Gomes,Ryan Hollins,Marc Gasol,Mike Conley,Rudy Gay,Sam Young,Zach Randolph,1,5:27,MIN,turnover,,,,,,,,,,Jonny Flynn,,,bad pass,,Sam Young,,,
Corey Brewer,Jonny Flynn,Nathan Jawai,Ryan Gomes,Ryan Hollins,Marc Gasol,Mike Conley,Rudy Gay,Sam Young,Zach Randolph,1,5:19,MEM,shot,,,,,,,,,,Sam Young,2,,,made,,dunk,25,6
Corey Brewer,Jonny Flynn,Nathan Jawai,Ryan Gomes,Ryan Hollins,Marc Gasol,Mike Conley,Rudy Gay,Sam Young,Zach Randolph,1,5:10,MIN,turnover,,,,,,,,,,Ryan Gomes,,,bad pass,,Zach Randolph,,,
Corey Brewer,Jonny Flynn,Nathan Jawai,Ryan Gomes,Ryan Hollins,Marc Gasol,Mike Conley,Rudy Gay,Sam Young,Zach Randolph,1,4:56,MEM,foul,,,,,,,,Corey Brewer,,Sam Young,,,,,,offensive,,
Corey Brewer,Jonny Flynn,Nathan Jawai,Ryan Gomes,Ryan Hollins,Marc Gasol,Mike Conley,Rudy Gay,Sam Young,Zach Randolph,1,4:56,MEM,turnover,,,,,,,,,,Sam Young,,,foul,,,,,
Corey Brewer,Jonny Flynn,Nathan Jawai,Ryan Gomes,Ryan Hollins,DeMarre Carroll,Marc Gasol,Mike Conley,Rudy Gay,Zach Randolph,1,4:56,MEM,sub,,,,DeMarre Carroll,,Sam Young,,,,,,,,,,,,
Corey Brewer,Jonny Flynn,Nathan Jawai,Ryan Gomes,Ryan Hollins,DeMarre Carroll,Marc Gasol,Mike Conley,Rudy Gay,Zach Randolph,1,4:45,MIN,shot,,,,,,,,,,Ryan Gomes,,,,missed,,jump,44,13
Corey Brewer,Jonny Flynn,Nathan Jawai,Ryan Gomes,Ryan Hollins,DeMarre Carroll,Marc Gasol,Mike Conley,Rudy Gay,Zach Randolph,1,4:43,MEM,rebound,,,,,,,,,,Marc Gasol,,,,,,def,,
Corey Brewer,Jonny Flynn,Nathan Jawai,Ryan Gomes,Ryan Hollins,DeMarre Carroll,Marc Gasol,Mike Conley,Rudy Gay,Zach Randolph,1,4:30,MIN,foul,,,,,,,,Marc Gasol,,Ryan Hollins,,,,,,personal,,
Corey Brewer,Jonny Flynn,Nathan Jawai,Oleksiy Pecherov,Ryan Gomes,DeMarre Carroll,Marc Gasol,Mike Conley,Rudy Gay,Zach Randolph,1,4:30,MIN,sub,,,,Oleksiy Pecherov,,Ryan Hollins,,,,,,,,,,,,
Corey Brewer,Jonny Flynn,Nathan Jawai,Oleksiy Pecherov,Ryan Gomes,DeMarre Carroll,Marc Gasol,Mike Conley,Rudy Gay,Zach Randolph,1,4:24,MEM,shot,,,,,,,,,,Marc Gasol,2,,,made,,jump,28,10
Corey Brewer,Jonny Flynn,Nathan Jawai,Oleksiy Pecherov,Ryan Gomes,DeMarre Carroll,Marc Gasol,Mike Conley,Rudy Gay,Zach Randolph,1,4:08,MIN,shot,Jonny Flynn,,,,,,,,,Oleksiy Pecherov,2,,,made,,jump,29,22
Corey Brewer,Jonny Flynn,Nathan Jawai,Oleksiy Pecherov,Ryan Gomes,DeMarre Carroll,Marc Gasol,Mike Conley,Rudy Gay,Zach Randolph,1,3:54,MEM,shot,Zach Randolph,,,,,,,,,Marc Gasol,2,,,made,,dunk,25,6
Corey Brewer,Jonny Flynn,Nathan Jawai,Oleksiy Pecherov,Ryan Gomes,DeMarre Carroll,Marc Gasol,Mike Conley,Rudy Gay,Zach Randolph,1,3:39,MIN,shot,,,,,,,,,,Oleksiy Pecherov,,,,missed,,jump,27,22
Corey Brewer,Jonny Flynn,Nathan Jawai,Oleksiy Pecherov,Ryan Gomes,DeMarre Carroll,Marc Gasol,Mike Conley,Rudy Gay,Zach Randolph,1,3:38,MEM,rebound,,,,,,,,,,DeMarre Carroll,,,,,,def,,
Corey Brewer,Jonny Flynn,Nathan Jawai,Oleksiy Pecherov,Ryan Gomes,DeMarre Carroll,Marc Gasol,Mike Conley,Rudy Gay,Zach Randolph,1,3:20,MEM,shot,Rudy Gay,,,,,,,,,DeMarre Carroll,2,,,made,,jump,30,25
Corey Brewer,Jonny Flynn,Nathan Jawai,Oleksiy Pecherov,Ryan Gomes,DeMarre Carroll,Marc Gasol,Mike Conley,Rudy Gay,Zach Randolph,1,2:55,MIN,foul,,,,,,,,Mike Conley,,Jonny Flynn,,,,,,offensive,,
Corey Brewer,Jonny Flynn,Nathan Jawai,Oleksiy Pecherov,Ryan Gomes,DeMarre Carroll,Marc Gasol,Mike Conley,Rudy Gay,Zach Randolph,1,2:55,MIN,turnover,,,,,,,,,,Jonny Flynn,,,foul,,,,,
Corey Brewer,Jonny Flynn,Nathan Jawai,Oleksiy Pecherov,Ryan Gomes,DeMarre Carroll,Marc Gasol,Mike Conley,Rudy Gay,Zach Randolph,1,2:55,MIN,timeout,,,,,,,,,,,,,,,,regular,,
Corey Brewer,Jonny Flynn,Oleksiy Pecherov,Ramon Sessions,Ryan Gomes,DeMarre Carroll,Marc Gasol,Mike Conley,Rudy Gay,Zach Randolph,1,2:55,MIN,sub,,,,Ramon Sessions,,Nathan Jawai,,,,,,,,,,,,
Brian Cardinal,Corey Brewer,Oleksiy Pecherov,Ramon Sessions,Ryan Gomes,DeMarre Carroll,Marc Gasol,Mike Conley,Rudy Gay,Zach Randolph,1,2:55,MIN,sub,,,,Brian Cardinal,,Jonny Flynn,,,,,,,,,,,,
Brian Cardinal,Corey Brewer,Oleksiy Pecherov,Ramon Sessions,Ryan Gomes,DeMarre Carroll,Marc Gasol,Mike Conley,Rudy Gay,Zach Randolph,1,2:30,MEM,shot,,,,,,,,,,Mike Conley,2,,,made,,step back jump,8,20
Brian Cardinal,Corey Brewer,Oleksiy Pecherov,Ramon Sessions,Ryan Gomes,DeMarre Carroll,Marc Gasol,Mike Conley,Rudy Gay,Zach Randolph,1,2:11,MEM,foul,,,,,,,,Ramon Sessions,,DeMarre Carroll,,,,,,personal,,
Brian Cardinal,Corey Brewer,Oleksiy Pecherov,Ramon Sessions,Ryan Gomes,DeMarre Carroll,Marc Gasol,Mike Conley,Rudy Gay,Zach Randolph,1,2:04,MIN,shot,,,,,,,,,,Corey Brewer,,,,missed,,jump,12,23
Brian Cardinal,Corey Brewer,Oleksiy Pecherov,Ramon Sessions,Ryan Gomes,DeMarre Carroll,Marc Gasol,Mike Conley,Rudy Gay,Zach Randolph,1,2:03,MIN,rebound,,,,,,,,,,Ramon Sessions,,,,,,off,,
Brian Cardinal,Corey Brewer,Oleksiy Pecherov,Ramon Sessions,Ryan Gomes,DeMarre Carroll,Marc Gasol,Mike Conley,Rudy Gay,Zach Randolph,1,1:58,MIN,shot,Ramon Sessions,,,,,,,,,Ryan Gomes,2,,,made,,jump,5,6
Brian Cardinal,Corey Brewer,Oleksiy Pecherov,Ramon Sessions,Ryan Gomes,DeMarre Carroll,Marc Gasol,Mike Conley,Rudy Gay,Zach Randolph,1,1:43,MIN,foul,,,,,,,,Rudy Gay,,Ryan Gomes,,,,,,shooting,,
Brian Cardinal,Corey Brewer,Oleksiy Pecherov,Ramon Sessions,Ryan Gomes,DeMarre Carroll,Marc Gasol,Marcus Williams,Rudy Gay,Zach Randolph,1,1:43,MEM,sub,,,,Marcus Williams,,Mike Conley,,,,,,,,,,,,
Brian Cardinal,Corey Brewer,Oleksiy Pecherov,Ramon Sessions,Ryan Gomes,DeMarre Carroll,Marc Gasol,Marcus Williams,Rudy Gay,Zach Randolph,1,1:43,MEM,free throw,,,,,,,1,,2,Rudy Gay,,,foul,made,,,,
Brian Cardinal,Corey Brewer,Oleksiy Pecherov,Ramon Sessions,Ryan Gomes,DeMarre Carroll,Marc Gasol,Marcus Williams,Rudy Gay,Zach Randolph,1,1:43,MEM,free throw,,,,,,,2,,2,Rudy Gay,,,foul,made,,,,
Brian Cardinal,Corey Brewer,Oleksiy Pecherov,Ramon Sessions,Ryan Gomes,DeMarre Carroll,Marc Gasol,Marcus Williams,Rudy Gay,Zach Randolph,1,1:31,MIN,shot,Ramon Sessions,,,,,,,,,Corey Brewer,2,,,made,,layup,25,6
Brian Cardinal,Corey Brewer,Oleksiy Pecherov,Ramon Sessions,Ryan Gomes,DeMarre Carroll,Marc Gasol,Marcus Williams,Rudy Gay,Zach Randolph,1,1:18,MEM,shot,,,,,,,,,,Zach Randolph,,,,missed,,jump,13,22
Brian Cardinal,Corey Brewer,Oleksiy Pecherov,Ramon Sessions,Ryan Gomes,DeMarre Carroll,Marc Gasol,Marcus Williams,Rudy Gay,Zach Randolph,1,1:17,MEM,rebound,,,,,,,,,,Marc Gasol,,,,,,off,,
Brian Cardinal,Corey Brewer,Oleksiy Pecherov,Ramon Sessions,Ryan Gomes,DeMarre Carroll,Marc Gasol,Marcus Williams,Rudy Gay,Zach Randolph,1,1:10,MEM,turnover,,,,,,,,,,Marc Gasol,,,lost ball,,Brian Cardinal,,,
Brian Cardinal,Corey Brewer,Oleksiy Pecherov,Ramon Sessions,Ryan Gomes,DeMarre Carroll,Marc Gasol,Marcus Williams,Rudy Gay,Zach Randolph,1,1:00,MIN,shot,,,,,,,,,,Oleksiy Pecherov,2,,,made,,jump,40,12
Brian Cardinal,Corey Brewer,Oleksiy Pecherov,Ramon Sessions,Ryan Gomes,DeMarre Carroll,Marc Gasol,Marcus Williams,Rudy Gay,Zach Randolph,1,0:48,MEM,shot,,,,,,,,,,Rudy Gay,2,,,made,,driving layup,25,6
Brian Cardinal,Corey Brewer,Oleksiy Pecherov,Ramon Sessions,Ryan Gomes,DeMarre Carroll,Marc Gasol,Marcus Williams,Rudy Gay,Zach Randolph,1,0:40,MIN,shot,,,,,,,,,,Oleksiy Pecherov,,,,missed,,3pt,17,30
Brian Cardinal,Corey Brewer,Oleksiy Pecherov,Ramon Sessions,Ryan Gomes,DeMarre Carroll,Marc Gasol,Marcus Williams,Rudy Gay,Zach Randolph,1,0:39,MEM,rebound,,,,,,,,,,Marc Gasol,,,,,,def,,
Brian Cardinal,Corey Brewer,Oleksiy Pecherov,Ramon Sessions,Ryan Gomes,DeMarre Carroll,Marc Gasol,Marcus Williams,Rudy Gay,Zach Randolph,1,0:36,MIN,foul,,,,,,,,Zach Randolph,,Oleksiy Pecherov,,,,,,personal,,
Brian Cardinal,Corey Brewer,Oleksiy Pecherov,Ramon Sessions,Ryan Gomes,DeMarre Carroll,Marc Gasol,Marcus Williams,Rudy Gay,Zach Randolph,1,0:36,MEM,free throw,,,,,,,1,,2,Zach Randolph,,,foul,made,,,,
Brian Cardinal,Corey Brewer,Oleksiy Pecherov,Ramon Sessions,Ryan Gomes,DeMarre Carroll,Marcus Williams,Rudy Gay,Steven Hunter,Zach Randolph,1,0:36,MEM,sub,,,,Steven Hunter,,Marc Gasol,,,,,,,,,,,,
Brian Cardinal,Corey Brewer,Oleksiy Pecherov,Ramon Sessions,Ryan Gomes,DeMarre Carroll,Marcus Williams,Rudy Gay,Steven Hunter,Zach Randolph,1,0:36,MEM,free throw,,,,,,,2,,2,Zach Randolph,,,foul,made,,,,
Brian Cardinal,Corey Brewer,Oleksiy Pecherov,Ramon Sessions,Ryan Gomes,DeMarre Carroll,Marcus Williams,Rudy Gay,Steven Hunter,Zach Randolph,1,0:28,MIN,shot,,,,,,,,,,Corey Brewer,,,,missed,,turnaround jump,30,14
Brian Cardinal,Corey Brewer,Oleksiy Pecherov,Ramon Sessions,Ryan Gomes,DeMarre Carroll,Marcus Williams,Rudy Gay,Steven Hunter,Zach Randolph,1,0:25,MEM,rebound,,,,,,,,,,Zach Randolph,,,,,,def,,
Brian Cardinal,Corey Brewer,Oleksiy Pecherov,Ramon Sessions,Ryan Gomes,DeMarre Carroll,Marcus Williams,Rudy Gay,Steven Hunter,Zach Randolph,1,0:03,MEM,shot,,,,,,,,,,Marcus Williams,,,,missed,,3pt,18,30
Brian Cardinal,Corey Brewer,Oleksiy Pecherov,Ramon Sessions,Ryan Gomes,DeMarre Carroll,Marcus Williams,Rudy Gay,Steven Hunter,Zach Randolph,1,0:01,MIN,rebound,,,,,,,,,,Oleksiy Pecherov,,,,,,def,,
Brian Cardinal,Corey Brewer,Oleksiy Pecherov,Ramon Sessions,Ryan Gomes,DeMarre Carroll,Marcus Williams,Rudy Gay,Steven Hunter,Zach Randolph,1,0:00,MIN,shot,,,,,,,,,,Ramon Sessions,,,,missed,,3pt,39,45
Brian Cardinal,Corey Brewer,Oleksiy Pecherov,Ramon Sessions,Ryan Gomes,DeMarre Carroll,Marcus Williams,Rudy Gay,Steven Hunter,Zach Randolph,1,0:00,MIN,rebound,,,,,,,,,,,,,,,,,,
Brian Cardinal,Corey Brewer,Oleksiy Pecherov,Ramon Sessions,Sasha Pavlovic,DeMarre Carroll,Marcus Williams,Rudy Gay,Steven Hunter,Zach Randolph,2,11:46,MIN,shot,,,,,,,,,,Sasha Pavlovic,,,,missed,,jump,27,25
Brian Cardinal,Corey Brewer,Oleksiy Pecherov,Ramon Sessions,Sasha Pavlovic,DeMarre Carroll,Marcus Williams,Rudy Gay,Steven Hunter,Zach Randolph,2,11:44,MEM,rebound,,,,,,,,,,Steven Hunter,,,,,,def,,
Brian Cardinal,Corey Brewer,Oleksiy Pecherov,Ramon Sessions,Sasha Pavlovic,DeMarre Carroll,Marcus Williams,Rudy Gay,Steven Hunter,Zach Randolph,2,11:24,MEM,shot,,,,,,,,,,Rudy Gay,,,,missed,,3pt,14,29
Brian Cardinal,Corey Brewer,Oleksiy Pecherov,Ramon Sessions,Sasha Pavlovic,DeMarre Carroll,Marcus Williams,Rudy Gay,Steven Hunter,Zach Randolph,2,11:22,MEM,rebound,,,,,,,,,,DeMarre Carroll,,,,,,off,,
Brian Cardinal,Corey Brewer,Oleksiy Pecherov,Ramon Sessions,Sasha Pavlovic,DeMarre Carroll,Marcus Williams,Rudy Gay,Steven Hunter,Zach Randolph,2,11:09,MEM,turnover,,,,,,,,,,DeMarre Carroll,,,lost ball,,Corey Brewer,,,
Brian Cardinal,Corey Brewer,Oleksiy Pecherov,Ramon Sessions,Sasha Pavlovic,DeMarre Carroll,Marcus Williams,Rudy Gay,Steven Hunter,Zach Randolph,2,11:04,MIN,shot,Ramon Sessions,,,,,,,,,Sasha Pavlovic,2,,,made,,layup,25,6
Brian Cardinal,Corey Brewer,Oleksiy Pecherov,Ramon Sessions,Sasha Pavlovic,DeMarre Carroll,Marcus Williams,Rudy Gay,Steven Hunter,Zach Randolph,2,10:54,MIN,foul,,,,,,,,DeMarre Carroll,,Corey Brewer,,,,,,personal,,
Brian Cardinal,Corey Brewer,Oleksiy Pecherov,Ramon Sessions,Sasha Pavlovic,DeMarre Carroll,Marcus Williams,O.J. Mayo,Steven Hunter,Zach Randolph,2,10:54,MEM,sub,,,,O.J. Mayo,,Rudy Gay,,,,,,,,,,,,
Brian Cardinal,Corey Brewer,Oleksiy Pecherov,Ramon Sessions,Sasha Pavlovic,DeMarre Carroll,Marcus Williams,O.J. Mayo,Steven Hunter,Zach Randolph,2,10:48,MEM,shot,,,,,,,,,,Marcus Williams,,,,missed,,running jump,17,10
Brian Cardinal,Corey Brewer,Oleksiy Pecherov,Ramon Sessions,Sasha Pavlovic,DeMarre Carroll,Marcus Williams,O.J. Mayo,Steven Hunter,Zach Randolph,2,10:44,MIN,rebound,,,,,,,,,,Corey Brewer,,,,,,def,,
Brian Cardinal,Corey Brewer,Oleksiy Pecherov,Ramon Sessions,Sasha Pavlovic,DeMarre Carroll,Marcus Williams,O.J. Mayo,Steven Hunter,Zach Randolph,2,10:40,MIN,shot,,,,,,,,,,Corey Brewer,,,,missed,,layup,25,6
Brian Cardinal,Corey Brewer,Oleksiy Pecherov,Ramon Sessions,Sasha Pavlovic,DeMarre Carroll,Marcus Williams,O.J. Mayo,Steven Hunter,Zach Randolph,2,10:35,MEM,rebound,,,,,,,,,,Steven Hunter,,,,,,def,,
Brian Cardinal,Corey Brewer,Oleksiy Pecherov,Ramon Sessions,Sasha Pavlovic,DeMarre Carroll,Marcus Williams,O.J. Mayo,Steven Hunter,Zach Randolph,2,10:19,MEM,shot,,,,,,,,,,DeMarre Carroll,,,,missed,,jump,7,18
Brian Cardinal,Corey Brewer,Oleksiy Pecherov,Ramon Sessions,Sasha Pavlovic,DeMarre Carroll,Marcus Williams,O.J. Mayo,Steven Hunter,Zach Randolph,2,10:17,MIN,rebound,,,,,,,,,,Ramon Sessions,,,,,,def,,
Brian Cardinal,Corey Brewer,Oleksiy Pecherov,Ramon Sessions,Sasha Pavlovic,DeMarre Carroll,Marcus Williams,O.J. Mayo,Steven Hunter,Zach Randolph,2,10:11,MIN,shot,Ramon Sessions,,,,,,,,,Brian Cardinal,2,,,made,,layup,25,6
Brian Cardinal,Corey Brewer,Oleksiy Pecherov,Ramon Sessions,Sasha Pavlovic,DeMarre Carroll,Marcus Williams,O.J. Mayo,Steven Hunter,Zach Randolph,2,9:58,MEM,shot,,,,,,,,,,O.J. Mayo,,,,missed,,jump,8,20
Brian Cardinal,Corey Brewer,Oleksiy Pecherov,Ramon Sessions,Sasha Pavlovic,DeMarre Carroll,Marcus Williams,O.J. Mayo,Steven Hunter,Zach Randolph,2,9:56,MIN,rebound,,,,,,,,,,Oleksiy Pecherov,,,,,,def,,
Brian Cardinal,Corey Brewer,Oleksiy Pecherov,Ramon Sessions,Sasha Pavlovic,DeMarre Carroll,Marcus Williams,O.J. Mayo,Steven Hunter,Zach Randolph,2,9:42,MIN,shot,,,,,,,,,,Corey Brewer,,,,missed,,3pt,2,9
Brian Cardinal,Corey Brewer,Oleksiy Pecherov,Ramon Sessions,Sasha Pavlovic,DeMarre Carroll,Marcus Williams,O.J. Mayo,Steven Hunter,Zach Randolph,2,9:41,MEM,rebound,,,,,,,,,,O.J. Mayo,,,,,,def,,
Brian Cardinal,Corey Brewer,Oleksiy Pecherov,Ramon Sessions,Sasha Pavlovic,DeMarre Carroll,Marcus Williams,O.J. Mayo,Steven Hunter,Zach Randolph,2,9:34,MEM,shot,,,,,,,,,,Zach Randolph,,,,missed,,turnaround jump,31,11
Brian Cardinal,Corey Brewer,Oleksiy Pecherov,Ramon Sessions,Sasha Pavlovic,DeMarre Carroll,Marcus Williams,O.J. Mayo,Steven Hunter,Zach Randolph,2,9:29,MIN,rebound,,,,,,,,,,Ramon Sessions,,,,,,def,,
Brian Cardinal,Corey Brewer,Oleksiy Pecherov,Ramon Sessions,Sasha Pavlovic,DeMarre Carroll,Marcus Williams,O.J. Mayo,Steven Hunter,Zach Randolph,2,9:27,MIN,shot,Ramon Sessions,,,,,,,,,Oleksiy Pecherov,2,,,made,,layup,25,6
Brian Cardinal,Corey Brewer,Oleksiy Pecherov,Ramon Sessions,Sasha Pavlovic,DeMarre Carroll,Marcus Williams,O.J. Mayo,Steven Hunter,Zach Randolph,2,9:18,MEM,timeout,,,,,,,,,,,,,,,,regular,,
Brian Cardinal,Oleksiy Pecherov,Ramon Sessions,Sasha Pavlovic,Wayne Ellington,DeMarre Carroll,Marcus Williams,O.J. Mayo,Steven Hunter,Zach Randolph,2,9:18,MIN,sub,,,,Wayne Ellington,,Corey Brewer,,,,,,,,,,,,
Brian Cardinal,Oleksiy Pecherov,Ramon Sessions,Sasha Pavlovic,Wayne Ellington,DeMarre Carroll,Marc Gasol,Marcus Williams,O.J. Mayo,Steven Hunter,2,9:18,MEM,sub,,,,Marc Gasol,,Zach Randolph,,,,,,,,,,,,
Brian Cardinal,Oleksiy Pecherov,Ramon Sessions,Sasha Pavlovic,Wayne Ellington,DeMarre Carroll,Marc Gasol,Marcus Williams,O.J. Mayo,Steven Hunter,2,9:05,MEM,turnover,,,,,,,,,,Marc Gasol,,,out of bounds lost ball turnover,,,,,
Brian Cardinal,Oleksiy Pecherov,Ramon Sessions,Sasha Pavlovic,Wayne Ellington,DeMarre Carroll,Marc Gasol,Marcus Williams,O.J. Mayo,Steven Hunter,2,8:56,MIN,foul,,,,,,,,O.J. Mayo,,Oleksiy Pecherov,,,,,,offensive,,
Brian Cardinal,Oleksiy Pecherov,Ramon Sessions,Sasha Pavlovic,Wayne Ellington,DeMarre Carroll,Marc Gasol,Marcus Williams,O.J. Mayo,Steven Hunter,2,8:56,MIN,turnover,,,,,,,,,,Oleksiy Pecherov,,,foul,,,,,
Brian Cardinal,Oleksiy Pecherov,Ramon Sessions,Sasha Pavlovic,Wayne Ellington,DeMarre Carroll,Marc Gasol,Marcus Williams,O.J. Mayo,Sam Young,2,8:56,MEM,sub,,,,Sam Young,,Steven Hunter,,,,,,,,,,,,
Brian Cardinal,Oleksiy Pecherov,Ramon Sessions,Sasha Pavlovic,Wayne Ellington,DeMarre Carroll,Marc Gasol,Marcus Williams,O.J. Mayo,Sam Young,2,8:53,MEM,turnover,,,,,,,,,,Marcus Williams,,,out of bounds lost ball turnover,,,,,
Brian Cardinal,Oleksiy Pecherov,Ramon Sessions,Sasha Pavlovic,Wayne Ellington,DeMarre Carroll,Marc Gasol,Marcus Williams,O.J. Mayo,Sam Young,2,8:45,MIN,shot,,,,,,,,,,Oleksiy Pecherov,,,,missed,,3pt,44,23