a1,a2,a3,a4,a5,h1,h2,h3,h4,h5,period,time,team,etype,assist,away,block,entered,home,left,num,opponent,outof,player,points,possession,reason,result,steal,type,x,y
Marc Gasol,Mike Conley,O.J. Mayo,Rudy Gay,Zach Randolph,Aaron Brooks,Chuck Hayes,Luis Scola,Shane Battier,Trevor Ariza,1,12:00,OFF,jump ball,,Marc Gasol,,,Luis Scola,,,,,,,Mike Conley,,,,,,
Marc Gasol,Mike Conley,O.J. Mayo,Rudy Gay,Zach Randolph,Aaron Brooks,Chuck Hayes,Luis Scola,Shane Battier,Trevor Ariza,1,11:40,MEM,shot,,,,,,,,,,Mike Conley,,,,missed,,jump,35,24
Marc Gasol,Mike Conley,O.J. Mayo,Rudy Gay,Zach Randolph,Aaron Brooks,Chuck Hayes,Luis Scola,Shane Battier,Trevor Ariza,1,11:39,HOU,rebound,,,,,,,,,,Luis Scola,,,,,,def,,
Marc Gasol,Mike Conley,O.J. Mayo,Rudy Gay,Zach Randolph,Aaron Brooks,Chuck Hayes,Luis Scola,Shane Battier,Trevor Ariza,1,11:27,HOU,shot,,,,,,,,,,Trevor Ariza,,,,missed,,3pt,6,22
Marc Gasol,Mike Conley,O.J. Mayo,Rudy Gay,Zach Randolph,Aaron Brooks,Chuck Hayes,Luis Scola,Shane Battier,Trevor Ariza,1,11:26,MEM,rebound,,,,,,,,,,Marc Gasol,,,,,,def,,
Marc Gasol,Mike Conley,O.J. Mayo,Rudy Gay,Zach Randolph,Aaron Brooks,Chuck Hayes,Luis Scola,Shane Battier,Trevor Ariza,1,11:08,MEM,turnover,,,,,,,,,,Rudy Gay,,,bad pass,,Luis Scola,,,
Marc Gasol,Mike Conley,O.J. Mayo,Rudy Gay,Zach Randolph,Aaron Brooks,Chuck Hayes,Luis Scola,Shane Battier,Trevor Ariza,1,11:00,HOU,turnover,,,,,,,,,,Aaron Brooks,,,bad pass,,Marc Gasol,,,
Marc Gasol,Mike Conley,O.J. Mayo,Rudy Gay,Zach Randolph,Aaron Brooks,Chuck Hayes,Luis Scola,Shane Battier,Trevor Ariza,1,10:54,MEM,shot,,,,,,,,,,Mike Conley,,,,missed,,driving layup,25,6
Marc Gasol,Mike Conley,O.J. Mayo,Rudy Gay,Zach Randolph,Aaron Brooks,Chuck Hayes,Luis Scola,Shane Battier,Trevor Ariza,1,10:53,MEM,rebound,,,,,,,,,,,,,,,,,,
Marc Gasol,Mike Conley,O.J. Mayo,Rudy Gay,Zach Randolph,Aaron Brooks,Chuck Hayes,Luis Scola,Shane Battier,Trevor Ariza,1,10:44,MEM,shot,,,,,,,,,,Marc Gasol,,,,missed,,jump hook,23,14
Marc Gasol,Mike Conley,O.J. Mayo,Rudy Gay,Zach Randolph,Aaron Brooks,Chuck Hayes,Luis Scola,Shane Battier,Trevor Ariza,1,10:43,HOU,rebound,,,,,,,,,,Shane Battier,,,,,,def,,
Marc Gasol,Mike Conley,O.J. Mayo,Rudy Gay,Zach Randolph,Aaron Brooks,Chuck Hayes,Luis Scola,Shane Battier,Trevor Ariza,1,10:32,HOU,turnover,,,,,,,,,,Aaron Brooks,,,bad pass,,Rudy Gay,,,
Marc Gasol,Mike Conley,O.J. Mayo,Rudy Gay,Zach Randolph,Aaron Brooks,Chuck Hayes,Luis Scola,Shane Battier,Trevor Ariza,1,10:29,MEM,shot,,,,,,,,,,Rudy Gay,2,,,made,,driving dunk,25,6
Marc Gasol,Mike Conley,O.J. Mayo,Rudy Gay,Zach Randolph,Aaron Brooks,Chuck Hayes,Luis Scola,Shane Battier,Trevor Ariza,1,10:06,HOU,shot,Trevor Ariza,,,,,,,,,Shane Battier,3,,,made,,3pt,27,31
Marc Gasol,Mike Conley,O.J. Mayo,Rudy Gay,Zach Randolph,Aaron Brooks,Chuck Hayes,Luis Scola,Shane Battier,Trevor Ariza,1,9:50,HOU,violation,,,,,,,,,,Shane Battier,,,,,,kicked ball,,
Marc Gasol,Mike Conley,O.J. Mayo,Rudy Gay,Zach Randolph,Aaron Brooks,Chuck Hayes,Luis Scola,Shane Battier,Trevor Ariza,1,9:43,MEM,shot,,,,,,,,,,Zach Randolph,,,,missed,,jump,17,21
Marc Gasol,Mike Conley,O.J. Mayo,Rudy Gay,Zach Randolph,Aaron Brooks,Chuck Hayes,Luis Scola,Shane Battier,Trevor Ariza,1,9:41,HOU,rebound,,,,,,,,,,,,,,,,,,
Marc Gasol,Mike Conley,O.J. Mayo,Rudy Gay,Zach Randolph,Aaron Brooks,Chuck Hayes,Luis Scola,Shane Battier,Trevor Ariza,1,9:25,HOU,shot,,,,,,,,,,Trevor Ariza,,,,missed,,3pt,37,29
Marc Gasol,Mike Conley,O.J. Mayo,Rudy Gay,Zach Randolph,Aaron Brooks,Chuck Hayes,Luis Scola,Shane Battier,Trevor Ariza,1,9:24,MEM,rebound,,,,,,,,,,O.J. Mayo,,,,,,def,,
Marc Gasol,Mike Conley,O.J. Mayo,Rudy Gay,Zach Randolph,Aaron Brooks,Chuck Hayes,Luis Scola,Shane Battier,Trevor Ariza,1,9:18,MEM,shot,,,,,,,,,,O.J. Mayo,2,,,made,,driving layup,25,6
Marc Gasol,Mike Conley,O.J. Mayo,Rudy Gay,Zach Randolph,Aaron Brooks,Chuck Hayes,Luis Scola,Shane Battier,Trevor Ariza,1,9:02,MEM,foul,,,,,,,,Aaron Brooks,,Mike Conley,,,,,,personal,,
Marc Gasol,Mike Conley,O.J. Mayo,Rudy Gay,Zach Randolph,Aaron Brooks,Chuck Hayes,Luis Scola,Shane Battier,Trevor Ariza,1,8:48,HOU,shot,,,,,,,,,,Luis Scola,2,,,made,,driving layup,25,6
Marc Gasol,Mike Conley,O.J. Mayo,Rudy Gay,Zach Randolph,Aaron Brooks,Chuck Hayes,Luis Scola,Shane Battier,Trevor Ariza,1,8:28,MEM,shot,,,Chuck Hayes,,,,,,,Marc Gasol,,,,missed,,hook,21,12
Marc Gasol,Mike Conley,O.J. Mayo,Rudy Gay,Zach Randolph,Aaron Brooks,Chuck Hayes,Luis Scola,Shane Battier,Trevor Ariza,1,8:26,HOU,rebound,,,,,,,,,,Trevor Ariza,,,,,,def,,
Marc Gasol,Mike Conley,O.J. Mayo,Rudy Gay,Zach Randolph,Aaron Brooks,Chuck Hayes,Luis Scola,Shane Battier,Trevor Ariza,1,8:11,HOU,shot,Shane Battier,,,,,,,,,Trevor Ariza,2,,,made,,slam dunk,25,6
Marc Gasol,Mike Conley,O.J. Mayo,Rudy Gay,Zach Randolph,Aaron Brooks,Chuck Hayes,Luis Scola,Shane Battier,Trevor Ariza,1,8:03,MEM,turnover,,,,,,,,,,Mike Conley,,,bad pass,,,,,
Marc Gasol,Mike Conley,O.J. Mayo,Rudy Gay,Zach Randolph,Aaron Brooks,Chuck Hayes,Luis Scola,Shane Battier,Trevor Ariza,1,7:47,HOU,shot,,,Marc Gasol,,,,,,,Luis Scola,,,,missed,,turnaround jump,25,13
Marc Gasol,Mike Conley,O.J. Mayo,Rudy Gay,Zach Randolph,Aaron Brooks,Chuck Hayes,Luis Scola,Shane Battier,Trevor Ariza,1,7:45,MEM,rebound,,,,,,,,,,Mike Conley,,,,,,def,,
Marc Gasol,Mike Conley,O.J. Mayo,Rudy Gay,Zach Randolph,Aaron Brooks,Chuck Hayes,Luis Scola,Shane Battier,Trevor Ariza,1,7:42,HOU,foul,,,,,,,,Rudy Gay,,Trevor Ariza,,,,,,shooting,,
Marc Gasol,Mike Conley,O.J. Mayo,Rudy Gay,Zach Randolph,Aaron Brooks,Chuck Hayes,Luis Scola,Shane Battier,Trevor Ariza,1,7:42,MEM,free throw,,,,,,,1,,2,Rudy Gay,,,foul,missed,,,,
Marc Gasol,Mike Conley,O.J. Mayo,Rudy Gay,Zach Randolph,Aaron Brooks,Chuck Hayes,Luis Scola,Shane Battier,Trevor Ariza,1,7:42,MEM,rebound,,,,,,,,,,,,,,,,,,
Marc Gasol,Mike Conley,O.J. Mayo,Rudy Gay,Zach Randolph,Aaron Brooks,Chuck Hayes,Luis Scola,Shane Battier,Trevor Ariza,1,7:42,MEM,free throw,,,,,,,2,,2,Rudy Gay,,,foul,made,,,,
Marc Gasol,Mike Conley,O.J. Mayo,Rudy Gay,Zach Randolph,Aaron Brooks,Chuck Hayes,Luis Scola,Shane Battier,Trevor Ariza,1,7:21,HOU,shot,,,,,,,,,,Trevor Ariza,,,,missed,,pullup jump,18,22
Marc Gasol,Mike Conley,O.J. Mayo,Rudy Gay,Zach Randolph,Aaron Brooks,Chuck Hayes,Luis Scola,Shane Battier,Trevor Ariza,1,7:20,HOU,rebound,,,,,,,,,,Luis Scola,,,,,,off,,
Marc Gasol,Mike Conley,O.J. Mayo,Rudy Gay,Zach Randolph,Aaron Brooks,Chuck Hayes,Luis Scola,Shane Battier,Trevor Ariza,1,7:18,HOU,shot,,,,,,,,,,Luis Scola,2,,,made,,putback layup,25,6
Marc Gasol,Mike Conley,O.J. Mayo,Rudy Gay,Zach Randolph,Aaron Brooks,Chuck Hayes,Luis Scola,Shane Battier,Trevor Ariza,1,7:00,MEM,shot,,,,,,,,,,Zach Randolph,,,,missed,,jump,40,8
Marc Gasol,Mike Conley,O.J. Mayo,Rudy Gay,Zach Randolph,Aaron Brooks,Chuck Hayes,Luis Scola,Shane Battier,Trevor Ariza,1,6:59,MEM,rebound,,,,,,,,,,,,,,,,,,
Marc Gasol,Mike Conley,O.J. Mayo,Rudy Gay,Zach Randolph,Aaron Brooks,Chuck Hayes,Luis Scola,Shane Battier,Trevor Ariza,1,6:59,HOU,foul,,,,,,,,Marc Gasol,,Trevor Ariza,,,,,,loose ball,,
Marc Gasol,Mike Conley,O.J. Mayo,Rudy Gay,Zach Randolph,Aaron Brooks,Chuck Hayes,Kyle Lowry,Luis Scola,Shane Battier,1,6:59,HOU,sub,,,,Kyle Lowry,,Trevor Ariza,,,,,,,,,,,,
Marc Gasol,Mike Conley,O.J. Mayo,Rudy Gay,Zach Randolph,Aaron Brooks,Chuck Hayes,Kyle Lowry,Luis Scola,Shane Battier,1,6:43,MEM,shot,,,,,,,,,,O.J. Mayo,,,,missed,,turnaround jump,34,13
Marc Gasol,Mike Conley,O.J. Mayo,Rudy Gay,Zach Randolph,Aaron Brooks,Chuck Hayes,Kyle Lowry,Luis Scola,Shane Battier,1,6:42,HOU,rebound,,,,,,,,,,Luis Scola,,,,,,def,,
Marc Gasol,Mike Conley,O.J. Mayo,Rudy Gay,Zach Randolph,Aaron Brooks,Chuck Hayes,Kyle Lowry,Luis Scola,Shane Battier,1,6:33,HOU,shot,,,,,,,,,,Shane Battier,,,,missed,,3pt,49,15
Marc Gasol,Mike Conley,O.J. Mayo,Rudy Gay,Zach Randolph,Aaron Brooks,Chuck Hayes,Kyle Lowry,Luis Scola,Shane Battier,1,6:32,MEM,rebound,,,,,,,,,,Mike Conley,,,,,,def,,
Marc Gasol,Mike Conley,O.J. Mayo,Rudy Gay,Zach Randolph,Aaron Brooks,Chuck Hayes,Kyle Lowry,Luis Scola,Shane Battier,1,6:26,MEM,shot,Mike Conley,,,,,,,,,O.J. Mayo,2,,,made,,pullup jump,14,21
Marc Gasol,Mike Conley,O.J. Mayo,Rudy Gay,Zach Randolph,Aaron Brooks,Chuck Hayes,Kyle Lowry,Luis Scola,Shane Battier,1,6:06,HOU,shot,Shane Battier,,,,,,,,,Chuck Hayes,2,,,made,,layup,25,6
Marc Gasol,Mike Conley,O.J. Mayo,Rudy Gay,Zach Randolph,Aaron Brooks,Chuck Hayes,Kyle Lowry,Luis Scola,Shane Battier,1,5:49,MEM,turnover,,,,,,,,,,Rudy Gay,,,lost ball,,Luis Scola,,,
Marc Gasol,Mike Conley,O.J. Mayo,Rudy Gay,Zach Randolph,Aaron Brooks,Chuck Hayes,Kyle Lowry,Luis Scola,Shane Battier,1,5:44,HOU,shot,Luis Scola,,,,,,,,,Aaron Brooks,2,,,made,,layup,25,6
Marc Gasol,Mike Conley,O.J. Mayo,Rudy Gay,Zach Randolph,Aaron Brooks,Chuck Hayes,Kyle Lowry,Luis Scola,Shane Battier,1,5:37,MEM,timeout,,,,,,,,,,,,,,,,regular,,
Marc Gasol,Mike Conley,O.J. Mayo,Rudy Gay,Zach Randolph,Aaron Brooks,Chuck Hayes,Kyle Lowry,Luis Scola,Shane Battier,1,5:33,HOU,foul,,,,,,,,Marc Gasol,,Luis Scola,,,,,,personal,,
Marc Gasol,Mike Conley,O.J. Mayo,Rudy Gay,Zach Randolph,Aaron Brooks,Chuck Hayes,Kyle Lowry,Luis Scola,Shane Battier,1,5:27,MEM,shot,,,,,,,,,,Marc Gasol,,,,missed,,layup,25,6
Marc Gasol,Mike Conley,O.J. Mayo,Rudy Gay,Zach Randolph,Aaron Brooks,Chuck Hayes,Kyle Lowry,Luis Scola,Shane Battier,1,5:26,HOU,rebound,,,,,,,,,,Luis Scola,,,,,,def,,
Marc Gasol,Mike Conley,O.J. Mayo,Rudy Gay,Zach Randolph,Aaron Brooks,Chuck Hayes,Kyle Lowry,Luis Scola,Shane Battier,1,5:14,HOU,shot,,,,,,,,,,Aaron Brooks,,,,missed,,running layup,25,6
Marc Gasol,Mike Conley,O.J. Mayo,Rudy Gay,Zach Randolph,Aaron Brooks,Chuck Hayes,Kyle Lowry,Luis Scola,Shane Battier,1,5:13,MEM,rebound,,,,,,,,,,Mike Conley,,,,,,def,,
Marc Gasol,Mike Conley,O.J. Mayo,Rudy Gay,Zach Randolph,Aaron Brooks,Chuck Hayes,Kyle Lowry,Luis Scola,Shane Battier,1,5:04,MEM,shot,Rudy Gay,,,,,,,,,O.J. Mayo,3,,,made,,3pt,48,8
Marc Gasol,Mike Conley,O.J. Mayo,Rudy Gay,Zach Randolph,Aaron Brooks,Chuck Hayes,Kyle Lowry,Luis Scola,Shane Battier,1,4:56,HOU,shot,,,,,,,,,,Aaron Brooks,,,,missed,,3pt,2,8
Marc Gasol,Mike Conley,O.J. Mayo,Rudy Gay,Zach Randolph,Aaron Brooks,Chuck Hayes,Kyle Lowry,Luis Scola,Shane Battier,1,4:54,MEM,rebound,,,,,,,,,,Zach Randolph,,,,,,def,,
Marc Gasol,Mike Conley,O.J. Mayo,Rudy Gay,Zach Randolph,Aaron Brooks,Chuck Hayes,Kyle Lowry,Luis Scola,Shane Battier,1,4:39,MEM,shot,,,,,,,,,,O.J. Mayo,,,,missed,,3pt,48,12
Marc Gasol,Mike Conley,O.J. Mayo,Rudy Gay,Zach Randolph,Aaron Brooks,Chuck Hayes,Kyle Lowry,Luis Scola,Shane Battier,1,4:38,HOU,rebound,,,,,,,,,,Chuck Hayes,,,,,,def,,
Marc Gasol,Mike Conley,O.J. Mayo,Rudy Gay,Zach Randolph,Aaron Brooks,Chuck Hayes,Kyle Lowry,Luis Scola,Shane Battier,1,4:32,HOU,turnover,,,,,,,,,,Kyle Lowry,,,bad pass,,Mike Conley,,,
Marc Gasol,Mike Conley,O.J. Mayo,Rudy Gay,Zach Randolph,Aaron Brooks,Chuck Hayes,Kyle Lowry,Luis Scola,Shane Battier,1,4:29,MEM,shot,,,,,,,,,,Rudy Gay,,,,missed,,layup,25,6
Marc Gasol,Mike Conley,O.J. Mayo,Rudy Gay,Zach Randolph,Aaron Brooks,Chuck Hayes,Kyle Lowry,Luis Scola,Shane Battier,1,4:28,HOU,rebound,,,,,,,,,,Kyle Lowry,,,,,,def,,
Marc Gasol,Mike Conley,O.J. Mayo,Rudy Gay,Zach Randolph,Aaron Brooks,Chuck Hayes,Kyle Lowry,Luis Scola,Shane Battier,1,4:15,HOU,shot,,,,,,,,,,Luis Scola,,,,missed,,layup,25,6
Marc Gasol,Mike Conley,O.J. Mayo,Rudy Gay,Zach Randolph,Aaron Brooks,Chuck Hayes,Kyle Lowry,Luis Scola,Shane Battier,1,4:14,MEM,rebound,,,,,,,,,,Zach Randolph,,,,,,def,,
Marc Gasol,Mike Conley,O.J. Mayo,Rudy Gay,Zach Randolph,Aaron Brooks,Chuck Hayes,Kyle Lowry,Luis Scola,Shane Battier,1,4:02,MEM,turnover,,,,,,,,,,Mike Conley,,,bad pass,,Shane Battier,,,
Marc Gasol,Mike Conley,O.J. Mayo,Rudy Gay,Zach Randolph,Aaron Brooks,Chuck Hayes,Kyle Lowry,Luis Scola,Shane Battier,1,3:57,HOU,shot,Shane Battier,,,,,,,,,Kyle Lowry,2,,,made,,layup,25,6
Marc Gasol,Mike Conley,O.J. Mayo,Rudy Gay,Zach Randolph,Aaron Brooks,Chuck Hayes,Kyle Lowry,Luis Scola,Shane Battier,1,3:57,MEM,foul,,,,,,,,Kyle Lowry,,Zach Randolph,,,,,,shooting,,
Marc Gasol,Marcus Williams,O.J. Mayo,Rudy Gay,Zach Randolph,Aaron Brooks,Chuck Hayes,Kyle Lowry,Luis Scola,Shane Battier,1,3:57,MEM,sub,,,,Marcus Williams,,Mike Conley,,,,,,,,,,,,
DeMarre Carroll,Marc Gasol,Marcus Williams,O.J. Mayo,Zach Randolph,Aaron Brooks,Chuck Hayes,Kyle Lowry,Luis Scola,Shane Battier,1,3:57,MEM,sub,,,,DeMarre Carroll,,Rudy Gay,,,,,,,,,,,,
DeMarre Carroll,Marc Gasol,Marcus Williams,O.J. Mayo,Zach Randolph,Aaron Brooks,Chuck Hayes,Kyle Lowry,Luis Scola,Shane Battier,1,3:57,HOU,free throw,,,,,,,1,,1,Kyle Lowry,,,foul,made,,,,
DeMarre Carroll,Marc Gasol,Marcus Williams,O.J. Mayo,Zach Randolph,Aaron Brooks,Chuck Hayes,Kyle Lowry,Luis Scola,Shane Battier,1,3:34,MEM,shot,DeMarre Carroll,,,,,,,,,Marc Gasol,2,,,made,,turnaround fade away,33,10
DeMarre Carroll,Marc Gasol,Marcus Williams,O.J. Mayo,Zach Randolph,Aaron Brooks,Chuck Hayes,Kyle Lowry,Luis Scola,Shane Battier,1,3:17,HOU,turnover,,,,,,,,,,Luis Scola,,,out of bounds lost ball turnover,,,,,
DeMarre Carroll,Marc Gasol,Marcus Williams,O.J. Mayo,Zach Randolph,Aaron Brooks,Chuck Hayes,Kyle Lowry,Luis Scola,Shane Battier,1,3:03,HOU,foul,,,,,,,,Marc Gasol,,Chuck Hayes,,,,,,shooting,,
DeMarre Carroll,Marc Gasol,Marcus Williams,O.J. Mayo,Zach Randolph,Aaron Brooks,Chuck Hayes,Kyle Lowry,Luis Scola,Shane Battier,1,3:03,MEM,free throw,,,,,,,1,,2,Marc Gasol,,,foul,made,,,,
DeMarre Carroll,Marc Gasol,Marcus Williams,O.J. Mayo,Zach Randolph,Aaron Brooks,Chuck Hayes,Kyle Lowry,Luis Scola,Shane Battier,1,3:03,MEM,free throw,,,,,,,2,,2,Marc Gasol,,,foul,missed,,,,
DeMarre Carroll,Marc Gasol,Marcus Williams,O.J. Mayo,Zach Randolph,Aaron Brooks,Chuck Hayes,Kyle Lowry,Luis Scola,Shane Battier,1,3:03,HOU,rebound,,,,,,,,,,Luis Scola,,,,,,def,,
DeMarre Carroll,Marc Gasol,Marcus Williams,O.J. Mayo,Zach Randolph,Aaron Brooks,Chuck Hayes,Kyle Lowry,Luis Scola,Shane Battier,1,2:50,HOU,shot,,,,,,,,,,Aaron Brooks,,,,missed,,3pt,31,31
DeMarre Carroll,Marc Gasol,Marcus Williams,O.J. Mayo,Zach Randolph,Aaron Brooks,Chuck Hayes,Kyle Lowry,Luis Scola,Shane Battier,1,2:49,MEM,rebound,,,,,,,,,,Marcus Williams,,,,,,def,,
DeMarre Carroll,Marc Gasol,Marcus Williams,O.J. Mayo,Zach Randolph,Aaron Brooks,Chuck Hayes,Kyle Lowry,Luis Scola,Shane Battier,1,2:43,MEM,shot,,,,,,,,,,Marcus Williams,,,,missed,,pullup jump,24,22
DeMarre Carroll,Marc Gasol,Marcus Williams,O.J. Mayo,Zach Randolph,Aaron Brooks,Chuck Hayes,Kyle Lowry,Luis Scola,Shane Battier,1,2:42,HOU,rebound,,,,,,,,,,Chuck Hayes,,,,,,def,,
DeMarre Carroll,Marc Gasol,Marcus Williams,O.J. Mayo,Zach Randolph,Aaron Brooks,Chuck Hayes,Kyle Lowry,Luis Scola,Shane Battier,1,2:31,HOU,shot,,,,,,,,,,Kyle Lowry,,,,missed,,3pt,23,31
DeMarre Carroll,Marc Gasol,Marcus Williams,O.J. Mayo,Zach Randolph,Aaron Brooks,Chuck Hayes,Kyle Lowry,Luis Scola,Shane Battier,1,2:30,MEM,rebound,,,,,,,,,,Zach Randolph,,,,,,def,,
DeMarre Carroll,Marc Gasol,Marcus Williams,O.J. Mayo,Zach Randolph,Aaron Brooks,Chuck Hayes,Kyle Lowry,Luis Scola,Shane Battier,1,2:15,MEM,shot,Marc Gasol,,,,,,,,,Marcus Williams,2,,,made,,jump,25,13
DeMarre Carroll,Marc Gasol,Marcus Williams,O.J. Mayo,Zach Randolph,Aaron Brooks,Chuck Hayes,Kyle Lowry,Luis Scola,Shane Battier,1,2:04,MEM,violation,,,,,,,,,,Zach Randolph,,,,,,kicked ball,,
DeMarre Carroll,Marc Gasol,Marcus Williams,O.J. Mayo,Zach Randolph,Aaron Brooks,Chuck Hayes,Kyle Lowry,Luis Scola,Shane Battier,1,2:04,HOU,timeout,,,,,,,,,,,,,,,,regular,,
DeMarre Carroll,Marc Gasol,Marcus Williams,O.J. Mayo,Zach Randolph,Aaron Brooks,Carl Landry,Chuck Hayes,Kyle Lowry,Luis Scola,1,2:04,HOU,sub,,,,Carl Landry,,Shane Battier,,,,,,,,,,,,
DeMarre Carroll,Marc Gasol,Marcus Williams,O.J. Mayo,Zach Randolph,Aaron Brooks,Carl Landry,Chase Budinger,Chuck Hayes,Kyle Lowry,1,2:04,HOU,sub,,,,Chase Budinger,,Luis Scola,,,,,,,,,,,,
DeMarre Carroll,Marc Gasol,Marcus Williams,O.J. Mayo,Zach Randolph,Aaron Brooks,Carl Landry,Chase Budinger,Chuck Hayes,Kyle Lowry,1,1:51,HOU,foul,,,,,,,,Marc Gasol,,Kyle Lowry,,,,,,offensive,,
DeMarre Carroll,Marc Gasol,Marcus Williams,O.J. Mayo,Zach Randolph,Aaron Brooks,Carl Landry,Chase Budinger,Chuck Hayes,Kyle Lowry,1,1:51,HOU,turnover,,,,,,,,,,Kyle Lowry,,,foul,,,,,
DeMarre Carroll,Marc Gasol,Marcus Williams,O.J. Mayo,Zach Randolph,Aaron Brooks,Carl Landry,Chase Budinger,Chuck Hayes,Kyle Lowry,1,1:31,MEM,shot,,,,,,,,,,DeMarre Carroll,,,,missed,,jump,7,8
DeMarre Carroll,Marc Gasol,Marcus Williams,O.J. Mayo,Zach Randolph,Aaron Brooks,Carl Landry,Chase Budinger,Chuck Hayes,Kyle Lowry,1,1:30,HOU,rebound,,,,,,,,,,Chuck Hayes,,,,,,def,,
DeMarre Carroll,Marc Gasol,Marcus Williams,O.J. Mayo,Zach Randolph,Aaron Brooks,Carl Landry,Chase Budinger,Chuck Hayes,Kyle Lowry,1,1:24,HOU,shot,Kyle Lowry,,,,,,,,,Chase Budinger,3,,,made,,3pt,43,24
DeMarre Carroll,Marc Gasol,Marcus Williams,O.J. Mayo,Zach Randolph,Aaron Brooks,Carl Landry,Chase Budinger,Chuck Hayes,Kyle Lowry,1,1:08,MEM,turnover,,,,,,,,,,DeMarre Carroll,,,bad pass,,Kyle Lowry,,,
DeMarre Carroll,Marc Gasol,Marcus Williams,O.J. Mayo,Zach Randolph,Aaron Brooks,Carl Landry,Chase Budinger,Chuck Hayes,Kyle Lowry,1,1:03,HOU,shot,,,,,,,,,,Kyle Lowry,,,,missed,,driving layup,25,6
DeMarre Carroll,Marc Gasol,Marcus Williams,O.J. Mayo,Zach Randolph,Aaron Brooks,Carl Landry,Chase Budinger,Chuck Hayes,Kyle Lowry,1,1:02,MEM,rebound,,,,,,,,,,DeMarre Carroll,,,,,,def,,
DeMarre Carroll,Marc Gasol,Marcus Williams,O.J. Mayo,Zach Randolph,Aaron Brooks,Carl Landry,Chase Budinger,Chuck Hayes,Kyle Lowry,1,0:57,MEM,shot,Marcus Williams,,,,,,,,,O.J. Mayo,2,,,made,,jump,36,20
DeMarre Carroll,Marc Gasol,Marcus Williams,O.J. Mayo,Zach Randolph,Aaron Brooks,Carl Landry,Chase Budinger,Chuck Hayes,Kyle Lowry,1,0:46,HOU,shot,,,,,,,,,,Chase Budinger,,,,missed,,jump,31,17
DeMarre Carroll,Marc Gasol,Marcus Williams,O.J. Mayo,Zach Randolph,Aaron Brooks,Carl Landry,Chase Budinger,Chuck Hayes,Kyle Lowry,1,0:45,HOU,rebound,,,,,,,,,,Chuck Hayes,,,,,,off,,
DeMarre Carroll,Marc Gasol,Marcus Williams,O.J. Mayo,Zach Randolph,Aaron Brooks,Carl Landry,Chase Budinger,Chuck Hayes,Kyle Lowry,1,0:39,HOU,turnover,,,,,,,,,,Carl Landry,,,traveling,,,,,
DeMarre Carroll,Marc Gasol,Marcus Williams,O.J. Mayo,Steven Hunter,Aaron Brooks,Carl Landry,Chase Budinger,Chuck Hayes,Kyle Lowry,1,0:39,MEM,sub,,,,Steven Hunter,,Zach Randolph,,,,,,,,,,,,
DeMarre Carroll,Marc Gasol,Marcus Williams,O.J. Mayo,Steven Hunter,Aaron Brooks,Carl Landry,Chase Budinger,Chuck Hayes,Kyle Lowry,1,0:31,MEM,turnover,,,,,,,,,,Steven Hunter,,,out of bounds lost ball turnover,,,,,
DeMarre Carroll,Marc Gasol,Marcus Williams,O.J. Mayo,Steven Hunter,Aaron Brooks,Carl Landry,Chase Budinger,Chuck Hayes,Kyle Lowry,1,0:10,MEM,foul,,,,,,,,Carl Landry,,Marcus Williams,,,,,,shooting,,
DeMarre Carroll,Marc Gasol,Marcus Williams,O.J. Mayo,Steven Hunter,Aaron Brooks,Carl Landry,Chase Budinger,Chuck Hayes,Kyle Lowry,1,0:10,HOU,free throw,,,,,,,1,,2,Carl Landry,,,foul,made,,,,
DeMarre Carroll,Marc Gasol,Marcus Williams,O.J. Mayo,Rudy Gay,Aaron Brooks,Carl Landry,Chase Budinger,Chuck Hayes,Kyle Lowry,1,0:10,MEM,sub,,,,Rudy Gay,,Steven Hunter,,,,,,,,,,,,
DeMarre Carroll,Marc Gasol,Marcus Williams,O.J. Mayo,Rudy Gay,Aaron Brooks,Carl Landry,Chase Budinger,Chuck Hayes,Kyle Lowry,1,0:10,HOU,free throw,,,,,,,2,,2,Carl Landry,,,foul,missed,,,,
DeMarre Carroll,Marc Gasol,Marcus Williams,O.J. Mayo,Rudy Gay,Aaron Brooks,Carl Landry,Chase Budinger,Chuck Hayes,Kyle Lowry,1,0:10,MEM,rebound,,,,,,,,,,Marc Gasol,,,,,,def,,
DeMarre Carroll,Marc Gasol,Marcus Williams,O.J. Mayo,Rudy Gay,Aaron Brooks,Carl Landry,Chase Budinger,Chuck Hayes,Kyle Lowry,1,0:02,MEM,shot,,,,,,,,,,Marcus Williams,,,,missed,,layup,25,6
DeMarre Carroll,Marc Gasol,Marcus Williams,O.J. Mayo,Rudy Gay,Aaron Brooks,Carl Landry,Chase Budinger,Chuck Hayes,Kyle Lowry,1,0:01,HOU,rebound,,,,,,,,,,Carl Landry,,,,,,def,,
DeMarre Carroll,Hamed Haddadi,Marcus Williams,Rudy Gay,Steven Hunter,Carl Landry,Chase Budinger,David Andersen,Kyle Lowry,Trevor Ariza,2,11:42,HOU,shot,Trevor Ariza,,,,,,,,,David Andersen,2,,,made,,pullup jump,34,19
DeMarre Carroll,Hamed Haddadi,Marcus Williams,Rudy Gay,Steven Hunter,Carl Landry,Chase Budinger,David Andersen,Kyle Lowry,Trevor Ariza,2,11:16,MEM,shot,,,,,,,,,,Steven Hunter,,,,missed,,jump hook,24,14
DeMarre Carroll,Hamed Haddadi,Marcus Williams,Rudy Gay,Steven Hunter,Carl Landry,Chase Budinger,David Andersen,Kyle Lowry,Trevor Ariza,2,11:15,HOU,rebound,,,,,,,,,,,,,,,,,,
DeMarre Carroll,Hamed Haddadi,Marcus Williams,Rudy Gay,Steven Hunter,Carl Landry,Chase Budinger,David Andersen,Kyle Lowry,Trevor Ariza,2,11:15,MEM,foul,,,,,,,,David Andersen,,Hamed Haddadi,,,,,,loose ball,,
DeMarre Carroll,Hamed Haddadi,Marcus Williams,Rudy Gay,Steven Hunter,Carl Landry,Chase Budinger,David Andersen,Kyle Lowry,Trevor Ariza,2,10:58,HOU,shot,,,,,,,,,,Trevor Ariza,,,,missed,,jump bank,34,16
DeMarre Carroll,Hamed Haddadi,Marcus Williams,Rudy Gay,Steven Hunter,Carl Landry,Chase Budinger,David Andersen,Kyle Lowry,Trevor Ariza,2,10:57,MEM,rebound,,,,,,,,,,Hamed Haddadi,,,,,,def,,
DeMarre Carroll,Hamed Haddadi,Marcus Williams,Rudy Gay,Steven Hunter,Carl Landry,Chase Budinger,David Andersen,Kyle Lowry,Trevor Ariza,2,10:44,MEM,turnover,,,,,,,,,,DeMarre Carroll,,,bad pass,,Trevor Ariza,,,
DeMarre Carroll,Hamed Haddadi,Marcus Williams,Rudy Gay,Steven Hunter,Carl Landry,Chase Budinger,David Andersen,Kyle Lowry,Trevor Ariza,2,10:41,HOU,shot,Trevor Ariza,,,,,,,,,Chase Budinger,2,,,made,,driving dunk,25,6
DeMarre Carroll,Hamed Haddadi,Marcus Williams,Rudy Gay,Steven Hunter,Carl Landry,Chase Budinger,David Andersen,Kyle Lowry,Trevor Ariza,2,10:16,MEM,shot,,,Carl Landry,,,,,,,Rudy Gay,,,,missed,,dunk,25,6
DeMarre Carroll,Hamed Haddadi,Marcus Williams,Rudy Gay,Steven Hunter,Carl Landry,Chase Budinger,David Andersen,Kyle Lowry,Trevor Ariza,2,10:15,MEM,rebound,,,,,,,,,,Steven Hunter,,,,,,off,,
DeMarre Carroll,Hamed Haddadi,Marcus Williams,Rudy Gay,Steven Hunter,Carl Landry,Chase Budinger,David Andersen,Kyle Lowry,Trevor Ariza,2,9:54,MEM,shot,,,,,,,,,,DeMarre Carroll,,,,missed,,running jump,20,15
DeMarre Carroll,Hamed Haddadi,Marcus Williams,Rudy Gay,Steven Hunter,Carl Landry,Chase Budinger,David Andersen,Kyle Lowry,Trevor Ariza,2,9:53,HOU,rebound,,,,,,,,,,Carl Landry,,,,,,def,,
DeMarre Carroll,Hamed Haddadi,Marcus Williams,Rudy Gay,Steven Hunter,Carl Landry,Chase Budinger,David Andersen,Kyle Lowry,Trevor Ariza,2,9:32,HOU,shot,,,,,,,,,,Trevor Ariza,,,,missed,,3pt,47,12
DeMarre Carroll,Hamed Haddadi,Marcus Williams,Rudy Gay,Steven Hunter,Carl Landry,Chase Budinger,David Andersen,Kyle Lowry,Trevor Ariza,2,9:31,MEM,rebound,,,,,,,,,,Steven Hunter,,,,,,def,,
DeMarre Carroll,Hamed Haddadi,Marcus Williams,Rudy Gay,Steven Hunter,Carl Landry,Chase Budinger,David Andersen,Kyle Lowry,Trevor Ariza,2,9:24,MEM,shot,,,,,,,,,,Marcus Williams,,,,missed,,layup,25,6
DeMarre Carroll,Hamed Haddadi,Marcus Williams,Rudy Gay,Steven Hunter,Carl Landry,Chase Budinger,David Andersen,Kyle Lowry,Trevor Ariza,2,9:23,MEM,rebound,,,,,,,,,,DeMarre Carroll,,,,,,off,,
DeMarre Carroll,Hamed Haddadi,Marcus Williams,Rudy Gay,Steven Hunter,Carl Landry,Chase Budinger,David Andersen,Kyle Lowry,Trevor Ariza,2,9:14,MEM,shot,,,,,,,,,,DeMarre Carroll,,,,missed,,jump,46,14
DeMarre Carroll,Hamed Haddadi,Marcus Williams,Rudy Gay,Steven Hunter,Carl Landry,Chase Budinger,David Andersen,Kyle Lowry,Trevor Ariza,2,9:14,HOU,rebound,,,,,,,,,,,,,,,,,,
DeMarre Carroll,Hamed Haddadi,Marcus Williams,Rudy Gay,Steven Hunter,Carl Landry,Chase Budinger,David Andersen,Kyle Lowry,Trevor Ariza,2,9:14,MEM,foul,,,,,,,,David Andersen,,Hamed Haddadi,,,,,,loose ball,,
DeMarre Carroll,Marcus Williams,Rudy Gay,Steven Hunter,Zach Randolph,Carl Landry,Chase Budinger,David Andersen,Kyle Lowry,Trevor Ariza,2,9:14,MEM,sub,,,,Zach Randolph,,Hamed Haddadi,,,,,,,,,,,,
DeMarre Carroll,Marcus Williams,Rudy Gay,Steven Hunter,Zach Randolph,Carl Landry,Chase Budinger,David Andersen,Kyle Lowry,Trevor Ariza,2,8:58,HOU,shot,,,,,,,,,,Carl Landry,2,,,made,,turnaround jump,32,11
DeMarre Carroll,Marcus Williams,Rudy Gay,Steven Hunter,Zach Randolph,Carl Landry,Chase Budinger,David Andersen,Kyle Lowry,Trevor Ariza,2,8:38,MEM,shot,,,,,,,,,,Rudy Gay,2,,,made,,running jump,24,12