a1,a2,a3,a4,a5,h1,h2,h3,h4,h5,period,time,team,etype,assist,away,block,entered,home,left,num,opponent,outof,player,points,possession,reason,result,steal,type,x,y
Marc Gasol,Mike Conley,O.J. Mayo,Rudy Gay,Zach Randolph,Baron Davis,Chris Kaman,Eric Gordon,Marcus Camby,Rasual Butler,1,12:00,OFF,jump ball,,Marc Gasol,,,Marcus Camby,,,,,,,Eric Gordon,,,,,,
Marc Gasol,Mike Conley,O.J. Mayo,Rudy Gay,Zach Randolph,Baron Davis,Chris Kaman,Eric Gordon,Marcus Camby,Rasual Butler,1,11:48,MEM,foul,,,,,,,,Marcus Camby,,Marc Gasol,,,,,,shooting,,
Marc Gasol,Mike Conley,O.J. Mayo,Rudy Gay,Zach Randolph,Baron Davis,Chris Kaman,Eric Gordon,Marcus Camby,Rasual Butler,1,11:48,LAC,free throw,,,,,,,1,,2,Marcus Camby,,,foul,missed,,,,
Marc Gasol,Mike Conley,O.J. Mayo,Rudy Gay,Zach Randolph,Baron Davis,Chris Kaman,Eric Gordon,Marcus Camby,Rasual Butler,1,11:48,LAC,rebound,,,,,,,,,,,,,,,,,,
Marc Gasol,Mike Conley,O.J. Mayo,Rudy Gay,Zach Randolph,Baron Davis,Chris Kaman,Eric Gordon,Marcus Camby,Rasual Butler,1,11:48,LAC,free throw,,,,,,,2,,2,Marcus Camby,,,foul,missed,,,,
Marc Gasol,Mike Conley,O.J. Mayo,Rudy Gay,Zach Randolph,Baron Davis,Chris Kaman,Eric Gordon,Marcus Camby,Rasual Butler,1,11:47,MEM,rebound,,,,,,,,,,Marc Gasol,,,,,,def,,
Marc Gasol,Mike Conley,O.J. Mayo,Rudy Gay,Zach Randolph,Baron Davis,Chris Kaman,Eric Gordon,Marcus Camby,Rasual Butler,1,11:30,MEM,shot,Mike Conley,,,,,,,,,Zach Randolph,2,,,made,,jump,14,22
Marc Gasol,Mike Conley,O.J. Mayo,Rudy Gay,Zach Randolph,Baron Davis,Chris Kaman,Eric Gordon,Marcus Camby,Rasual Butler,1,11:13,LAC,shot,,,,,,,,,,Eric Gordon,,,,missed,,3pt,34,30
Marc Gasol,Mike Conley,O.J. Mayo,Rudy Gay,Zach Randolph,Baron Davis,Chris Kaman,Eric Gordon,Marcus Camby,Rasual Butler,1,11:12,MEM,rebound,,,,,,,,,,Rudy Gay,,,,,,def,,
Marc Gasol,Mike Conley,O.J. Mayo,Rudy Gay,Zach Randolph,Baron Davis,Chris Kaman,Eric Gordon,Marcus Camby,Rasual Butler,1,11:05,MEM,shot,,,,,,,,,,Rudy Gay,2,,,made,,driving layup,25,6
Marc Gasol,Mike Conley,O.J. Mayo,Rudy Gay,Zach Randolph,Baron Davis,Chris Kaman,Eric Gordon,Marcus Camby,Rasual Butler,1,10:52,LAC,shot,,,,,,,,,,Rasual Butler,,,,missed,,3pt,10,26
Marc Gasol,Mike Conley,O.J. Mayo,Rudy Gay,Zach Randolph,Baron Davis,Chris Kaman,Eric Gordon,Marcus Camby,Rasual Butler,1,10:50,MEM,rebound,,,,,,,,,,O.J. Mayo,,,,,,def,,
Marc Gasol,Mike Conley,O.J. Mayo,Rudy Gay,Zach Randolph,Baron Davis,Chris Kaman,Eric Gordon,Marcus Camby,Rasual Butler,1,10:37,MEM,shot,,,,,,,,,,Zach Randolph,2,,,made,,layup,25,6
Marc Gasol,Mike Conley,O.J. Mayo,Rudy Gay,Zach Randolph,Baron Davis,Chris Kaman,Eric Gordon,Marcus Camby,Rasual Butler,1,10:15,LAC,shot,,,,,,,,,,Chris Kaman,2,,,made,,fade away jumper,36,8
Marc Gasol,Mike Conley,O.J. Mayo,Rudy Gay,Zach Randolph,Baron Davis,Chris Kaman,Eric Gordon,Marcus Camby,Rasual Butler,1,10:05,MEM,turnover,,,,,,,,,,Marc Gasol,,,traveling,,,,,
Marc Gasol,Mike Conley,O.J. Mayo,Rudy Gay,Zach Randolph,Baron Davis,Chris Kaman,Eric Gordon,Marcus Camby,Rasual Butler,1,9:53,LAC,turnover,,,,,,,,,,Baron Davis,,,bad pass,,Mike Conley,,,
Marc Gasol,Mike Conley,O.J. Mayo,Rudy Gay,Zach Randolph,Baron Davis,Chris Kaman,Eric Gordon,Marcus Camby,Rasual Butler,1,9:44,MEM,shot,Zach Randolph,,,,,,,,,Marc Gasol,2,,,made,,layup,25,6
Marc Gasol,Mike Conley,O.J. Mayo,Rudy Gay,Zach Randolph,Baron Davis,Chris Kaman,Eric Gordon,Marcus Camby,Rasual Butler,1,9:29,LAC,turnover,,,,,,,,,,Eric Gordon,,,lost ball,,Marc Gasol,,,
Marc Gasol,Mike Conley,O.J. Mayo,Rudy Gay,Zach Randolph,Baron Davis,Chris Kaman,Eric Gordon,Marcus Camby,Rasual Butler,1,9:24,MEM,shot,,,,,,,,,,Rudy Gay,,,,missed,,dunk,25,6
Marc Gasol,Mike Conley,O.J. Mayo,Rudy Gay,Zach Randolph,Baron Davis,Chris Kaman,Eric Gordon,Marcus Camby,Rasual Butler,1,9:21,MEM,rebound,,,,,,,,,,O.J. Mayo,,,,,,off,,
Marc Gasol,Mike Conley,O.J. Mayo,Rudy Gay,Zach Randolph,Baron Davis,Chris Kaman,Eric Gordon,Marcus Camby,Rasual Butler,1,9:20,MEM,shot,O.J. Mayo,,,,,,,,,Rudy Gay,2,,,made,,slam dunk,25,6
Marc Gasol,Mike Conley,O.J. Mayo,Rudy Gay,Zach Randolph,Baron Davis,Chris Kaman,Eric Gordon,Marcus Camby,Rasual Butler,1,9:14,LAC,timeout,,,,,,,,,,,,,,,,regular,,
Marc Gasol,Mike Conley,O.J. Mayo,Rudy Gay,Zach Randolph,Baron Davis,Chris Kaman,Eric Gordon,Marcus Camby,Rasual Butler,1,9:06,LAC,shot,,,,,,,,,,Chris Kaman,,,,missed,,jump hook,24,15
Marc Gasol,Mike Conley,O.J. Mayo,Rudy Gay,Zach Randolph,Baron Davis,Chris Kaman,Eric Gordon,Marcus Camby,Rasual Butler,1,9:05,MEM,rebound,,,,,,,,,,Marc Gasol,,,,,,def,,
Marc Gasol,Mike Conley,O.J. Mayo,Rudy Gay,Zach Randolph,Baron Davis,Chris Kaman,Eric Gordon,Marcus Camby,Rasual Butler,1,8:50,MEM,shot,,,,,,,,,,Mike Conley,,,,missed,,jump,33,20
Marc Gasol,Mike Conley,O.J. Mayo,Rudy Gay,Zach Randolph,Baron Davis,Chris Kaman,Eric Gordon,Marcus Camby,Rasual Butler,1,8:49,LAC,rebound,,,,,,,,,,Rasual Butler,,,,,,def,,
Marc Gasol,Mike Conley,O.J. Mayo,Rudy Gay,Zach Randolph,Baron Davis,Chris Kaman,Eric Gordon,Marcus Camby,Rasual Butler,1,8:27,LAC,shot,,,,,,,,,,Rasual Butler,2,,,made,,step back jump,11,24
Marc Gasol,Mike Conley,O.J. Mayo,Rudy Gay,Zach Randolph,Baron Davis,Chris Kaman,Eric Gordon,Marcus Camby,Rasual Butler,1,8:11,MEM,shot,,,,,,,,,,Zach Randolph,,,,missed,,jump,9,7
Marc Gasol,Mike Conley,O.J. Mayo,Rudy Gay,Zach Randolph,Baron Davis,Chris Kaman,Eric Gordon,Marcus Camby,Rasual Butler,1,8:09,LAC,rebound,,,,,,,,,,Rasual Butler,,,,,,def,,
Marc Gasol,Mike Conley,O.J. Mayo,Rudy Gay,Zach Randolph,Baron Davis,Chris Kaman,Eric Gordon,Marcus Camby,Rasual Butler,1,7:55,LAC,shot,,,,,,,,,,Chris Kaman,,,,missed,,turnaround fade away,39,8
Marc Gasol,Mike Conley,O.J. Mayo,Rudy Gay,Zach Randolph,Baron Davis,Chris Kaman,Eric Gordon,Marcus Camby,Rasual Butler,1,7:54,MEM,rebound,,,,,,,,,,O.J. Mayo,,,,,,def,,
Marc Gasol,Mike Conley,O.J. Mayo,Rudy Gay,Zach Randolph,Baron Davis,Chris Kaman,Eric Gordon,Marcus Camby,Rasual Butler,1,7:49,MEM,shot,,,Chris Kaman,,,,,,,O.J. Mayo,,,,missed,,layup,25,6
Marc Gasol,Mike Conley,O.J. Mayo,Rudy Gay,Zach Randolph,Baron Davis,Chris Kaman,Eric Gordon,Marcus Camby,Rasual Butler,1,7:49,MEM,rebound,,,,,,,,,,,,,,,,,,
Marc Gasol,Mike Conley,O.J. Mayo,Rudy Gay,Zach Randolph,Baron Davis,Chris Kaman,Eric Gordon,Marcus Camby,Rasual Butler,1,7:40,MEM,shot,Mike Conley,,,,,,,,,Rudy Gay,2,,,made,,turnaround fade away,12,12
Marc Gasol,Mike Conley,O.J. Mayo,Rudy Gay,Zach Randolph,Baron Davis,Chris Kaman,Eric Gordon,Marcus Camby,Rasual Butler,1,7:23,LAC,shot,,,,,,,,,,Marcus Camby,,,,missed,,pullup bank,31,12
Marc Gasol,Mike Conley,O.J. Mayo,Rudy Gay,Zach Randolph,Baron Davis,Chris Kaman,Eric Gordon,Marcus Camby,Rasual Butler,1,7:23,MEM,rebound,,,,,,,,,,,,,,,,,,
Marc Gasol,Mike Conley,O.J. Mayo,Rudy Gay,Zach Randolph,Baron Davis,Chris Kaman,Eric Gordon,Marcus Camby,Rasual Butler,1,6:57,MEM,shot,,,,,,,,,,Zach Randolph,,,,missed,,3pt,11,31
Marc Gasol,Mike Conley,O.J. Mayo,Rudy Gay,Zach Randolph,Baron Davis,Chris Kaman,Eric Gordon,Marcus Camby,Rasual Butler,1,6:56,LAC,rebound,,,,,,,,,,Rasual Butler,,,,,,def,,
Marc Gasol,Mike Conley,O.J. Mayo,Rudy Gay,Zach Randolph,Baron Davis,Chris Kaman,Eric Gordon,Marcus Camby,Rasual Butler,1,6:47,LAC,shot,Baron Davis,,,,,,,,,Chris Kaman,2,,,made,,hook,22,12
Marc Gasol,Mike Conley,O.J. Mayo,Rudy Gay,Zach Randolph,Baron Davis,Chris Kaman,Eric Gordon,Marcus Camby,Rasual Butler,1,6:31,MEM,shot,O.J. Mayo,,,,,,,,,Mike Conley,3,,,made,,3pt,2,8
Marc Gasol,Mike Conley,O.J. Mayo,Rudy Gay,Zach Randolph,Baron Davis,Chris Kaman,Eric Gordon,Marcus Camby,Rasual Butler,1,6:07,LAC,shot,,,,,,,,,,Marcus Camby,,,,missed,,jump,34,24
Marc Gasol,Mike Conley,O.J. Mayo,Rudy Gay,Zach Randolph,Baron Davis,Chris Kaman,Eric Gordon,Marcus Camby,Rasual Butler,1,6:06,MEM,rebound,,,,,,,,,,Rudy Gay,,,,,,def,,
Marc Gasol,Mike Conley,O.J. Mayo,Rudy Gay,Zach Randolph,Baron Davis,Chris Kaman,Eric Gordon,Marcus Camby,Rasual Butler,1,6:00,LAC,foul,,,,,,,,Zach Randolph,,Marcus Camby,,,,,,shooting,,
Marc Gasol,Mike Conley,O.J. Mayo,Rudy Gay,Zach Randolph,Baron Davis,Chris Kaman,Eric Gordon,Marcus Camby,Rasual Butler,1,6:00,MEM,free throw,,,,,,,1,,2,Zach Randolph,,,foul,made,,,,
Marc Gasol,Mike Conley,O.J. Mayo,Rudy Gay,Zach Randolph,Baron Davis,Chris Kaman,Eric Gordon,Marcus Camby,Rasual Butler,1,6:00,MEM,free throw,,,,,,,2,,2,Zach Randolph,,,foul,made,,,,
Marc Gasol,Mike Conley,O.J. Mayo,Rudy Gay,Zach Randolph,Baron Davis,Chris Kaman,Eric Gordon,Marcus Camby,Rasual Butler,1,5:48,LAC,shot,Marcus Camby,,,,,,,,,Baron Davis,2,,,made,,layup,25,6
Marc Gasol,Mike Conley,O.J. Mayo,Rudy Gay,Zach Randolph,Baron Davis,Chris Kaman,Eric Gordon,Marcus Camby,Rasual Butler,1,5:38,MEM,turnover,,,,,,,,,,Mike Conley,,,bad pass,,Baron Davis,,,
Marc Gasol,Mike Conley,O.J. Mayo,Rudy Gay,Zach Randolph,Baron Davis,Chris Kaman,Eric Gordon,Marcus Camby,Rasual Butler,1,5:35,LAC,turnover,,,,,,,,,,Eric Gordon,,,bad pass,,Rudy Gay,,,
Marc Gasol,Mike Conley,O.J. Mayo,Rudy Gay,Zach Randolph,Baron Davis,Chris Kaman,Eric Gordon,Marcus Camby,Rasual Butler,1,5:25,MEM,shot,,,,,,,,,,Marc Gasol,,,,missed,,jump,34,22
Marc Gasol,Mike Conley,O.J. Mayo,Rudy Gay,Zach Randolph,Baron Davis,Chris Kaman,Eric Gordon,Marcus Camby,Rasual Butler,1,5:24,LAC,rebound,,,,,,,,,,Rasual Butler,,,,,,def,,
Marc Gasol,Mike Conley,O.J. Mayo,Rudy Gay,Zach Randolph,Baron Davis,Chris Kaman,Eric Gordon,Marcus Camby,Rasual Butler,1,5:18,LAC,shot,,,,,,,,,,Baron Davis,,,,missed,,layup,25,6
Marc Gasol,Mike Conley,O.J. Mayo,Rudy Gay,Zach Randolph,Baron Davis,Chris Kaman,Eric Gordon,Marcus Camby,Rasual Butler,1,5:15,LAC,rebound,,,,,,,,,,Chris Kaman,,,,,,off,,
Marc Gasol,Mike Conley,O.J. Mayo,Rudy Gay,Zach Randolph,Baron Davis,Chris Kaman,Eric Gordon,Marcus Camby,Rasual Butler,1,5:14,LAC,shot,,,,,,,,,,Chris Kaman,2,,,made,,hook,21,10
Marc Gasol,Mike Conley,O.J. Mayo,Rudy Gay,Zach Randolph,Baron Davis,Chris Kaman,Eric Gordon,Marcus Camby,Rasual Butler,1,5:00,MEM,shot,,,,,,,,,,Mike Conley,,,,missed,,3pt,8,25
Marc Gasol,Mike Conley,O.J. Mayo,Rudy Gay,Zach Randolph,Baron Davis,Chris Kaman,Eric Gordon,Marcus Camby,Rasual Butler,1,4:57,LAC,rebound,,,,,,,,,,Chris Kaman,,,,,,def,,
Marc Gasol,Mike Conley,O.J. Mayo,Rudy Gay,Zach Randolph,Baron Davis,Chris Kaman,Eric Gordon,Marcus Camby,Rasual Butler,1,4:45,LAC,shot,Baron Davis,,,,,,,,,Eric Gordon,3,,,made,,3pt,9,27
Marc Gasol,Mike Conley,O.J. Mayo,Rudy Gay,Zach Randolph,Baron Davis,Chris Kaman,Eric Gordon,Marcus Camby,Rasual Butler,1,4:28,MEM,turnover,,,,,,,,,,Mike Conley,,,step out of bounds turnover,,,,,
Marc Gasol,Mike Conley,O.J. Mayo,Rudy Gay,Zach Randolph,Baron Davis,Chris Kaman,Eric Gordon,Marcus Camby,Rasual Butler,1,4:12,LAC,shot,Marcus Camby,,,,,,,,,Rasual Butler,2,,,made,,pullup jump,39,7
Marc Gasol,Mike Conley,O.J. Mayo,Rudy Gay,Zach Randolph,Baron Davis,Chris Kaman,Eric Gordon,Marcus Camby,Rasual Butler,1,4:00,MEM,shot,,,,,,,,,,Rudy Gay,2,,,made,,driving layup,25,6
Marc Gasol,Mike Conley,O.J. Mayo,Rudy Gay,Zach Randolph,Baron Davis,Chris Kaman,Eric Gordon,Marcus Camby,Rasual Butler,1,3:44,LAC,shot,,,,,,,,,,Chris Kaman,,,,missed,,reverse layup,25,6
Marc Gasol,Mike Conley,O.J. Mayo,Rudy Gay,Zach Randolph,Baron Davis,Chris Kaman,Eric Gordon,Marcus Camby,Rasual Butler,1,3:43,MEM,rebound,,,,,,,,,,Marc Gasol,,,,,,def,,
Marc Gasol,Mike Conley,O.J. Mayo,Rudy Gay,Zach Randolph,Baron Davis,Chris Kaman,Eric Gordon,Marcus Camby,Rasual Butler,1,3:39,LAC,foul,,,,,,,,Rudy Gay,,Baron Davis,,,,,,shooting,,
Marc Gasol,Mike Conley,O.J. Mayo,Rudy Gay,Zach Randolph,Baron Davis,Chris Kaman,Eric Gordon,Marcus Camby,Rasual Butler,1,3:39,MEM,free throw,,,,,,,1,,2,Rudy Gay,,,foul,made,,,,
Marc Gasol,Marcus Williams,O.J. Mayo,Rudy Gay,Zach Randolph,Baron Davis,Chris Kaman,Eric Gordon,Marcus Camby,Rasual Butler,1,3:39,MEM,sub,,,,Marcus Williams,,Mike Conley,,,,,,,,,,,,
Marc Gasol,Marcus Williams,O.J. Mayo,Rudy Gay,Zach Randolph,Baron Davis,Chris Kaman,Eric Gordon,Marcus Camby,Rasual Butler,1,3:39,MEM,free throw,,,,,,,2,,2,Rudy Gay,,,foul,made,,,,
Marc Gasol,Marcus Williams,O.J. Mayo,Rudy Gay,Zach Randolph,Baron Davis,Chris Kaman,Eric Gordon,Marcus Camby,Rasual Butler,1,3:29,MEM,foul,,,,,,,,Marcus Camby,,Zach Randolph,,,,,,shooting,,
Marc Gasol,Marcus Williams,O.J. Mayo,Rudy Gay,Zach Randolph,Baron Davis,Chris Kaman,Eric Gordon,Marcus Camby,Rasual Butler,1,3:29,LAC,free throw,,,,,,,1,,2,Marcus Camby,,,foul,made,,,,
Marc Gasol,Marcus Williams,O.J. Mayo,Rudy Gay,Zach Randolph,Baron Davis,Chris Kaman,Eric Gordon,Marcus Camby,Rasual Butler,1,3:29,LAC,free throw,,,,,,,2,,2,Marcus Camby,,,foul,missed,,,,
Marc Gasol,Marcus Williams,O.J. Mayo,Rudy Gay,Zach Randolph,Baron Davis,Chris Kaman,Eric Gordon,Marcus Camby,Rasual Butler,1,3:27,MEM,rebound,,,,,,,,,,Marc Gasol,,,,,,def,,
Marc Gasol,Marcus Williams,O.J. Mayo,Rudy Gay,Zach Randolph,Baron Davis,Chris Kaman,Eric Gordon,Marcus Camby,Rasual Butler,1,3:14,LAC,foul,,,,,,,,Rudy Gay,,Rasual Butler,,,,,,personal,,
Marc Gasol,Marcus Williams,O.J. Mayo,Rudy Gay,Zach Randolph,Baron Davis,Chris Kaman,Eric Gordon,Marcus Camby,Rasual Butler,1,3:05,MEM,shot,,,,,,,,,,Zach Randolph,,,,missed,,jump,14,25
Marc Gasol,Marcus Williams,O.J. Mayo,Rudy Gay,Zach Randolph,Baron Davis,Chris Kaman,Eric Gordon,Marcus Camby,Rasual Butler,1,3:04,LAC,rebound,,,,,,,,,,Baron Davis,,,,,,def,,
Marc Gasol,Marcus Williams,O.J. Mayo,Rudy Gay,Zach Randolph,Baron Davis,Chris Kaman,Eric Gordon,Marcus Camby,Rasual Butler,1,2:57,LAC,shot,,,,,,,,,,Rasual Butler,,,,missed,,3pt,15,32
Marc Gasol,Marcus Williams,O.J. Mayo,Rudy Gay,Zach Randolph,Baron Davis,Chris Kaman,Eric Gordon,Marcus Camby,Rasual Butler,1,2:56,MEM,rebound,,,,,,,,,,Marc Gasol,,,,,,def,,
Marc Gasol,Marcus Williams,O.J. Mayo,Rudy Gay,Zach Randolph,Baron Davis,Chris Kaman,Eric Gordon,Marcus Camby,Rasual Butler,1,2:42,MEM,shot,,,,,,,,,,Marcus Williams,,,,missed,,3pt,11,28
Marc Gasol,Marcus Williams,O.J. Mayo,Rudy Gay,Zach Randolph,Baron Davis,Chris Kaman,Eric Gordon,Marcus Camby,Rasual Butler,1,2:41,LAC,rebound,,,,,,,,,,Chris Kaman,,,,,,def,,
Marc Gasol,Marcus Williams,O.J. Mayo,Rudy Gay,Zach Randolph,Baron Davis,Chris Kaman,Eric Gordon,Marcus Camby,Rasual Butler,1,2:29,LAC,shot,,,,,,,,,,Marcus Camby,,,,missed,,jump,11,25
Marc Gasol,Marcus Williams,O.J. Mayo,Rudy Gay,Zach Randolph,Baron Davis,Chris Kaman,Eric Gordon,Marcus Camby,Rasual Butler,1,2:27,MEM,rebound,,,,,,,,,,O.J. Mayo,,,,,,def,,
Marc Gasol,Marcus Williams,O.J. Mayo,Rudy Gay,Zach Randolph,Baron Davis,Chris Kaman,Eric Gordon,Marcus Camby,Rasual Butler,1,2:24,MEM,shot,Marcus Williams,,,,,,,,,Rudy Gay,2,,,made,,layup,25,6
Marc Gasol,Marcus Williams,O.J. Mayo,Rudy Gay,Zach Randolph,Baron Davis,Chris Kaman,Eric Gordon,Marcus Camby,Rasual Butler,1,2:03,LAC,shot,,,,,,,,,,Chris Kaman,,,,missed,,hook,21,11
Marc Gasol,Marcus Williams,O.J. Mayo,Rudy Gay,Zach Randolph,Baron Davis,Chris Kaman,Eric Gordon,Marcus Camby,Rasual Butler,1,2:01,MEM,rebound,,,,,,,,,,Zach Randolph,,,,,,def,,
Marc Gasol,Marcus Williams,O.J. Mayo,Rudy Gay,Zach Randolph,Baron Davis,Chris Kaman,Eric Gordon,Marcus Camby,Rasual Butler,1,1:57,MEM,shot,,,,,,,,,,Marcus Williams,,,,missed,,layup,25,6
Marc Gasol,Marcus Williams,O.J. Mayo,Rudy Gay,Zach Randolph,Baron Davis,Chris Kaman,Eric Gordon,Marcus Camby,Rasual Butler,1,1:55,MEM,rebound,,,,,,,,,,Marc Gasol,,,,,,off,,
Marc Gasol,Marcus Williams,O.J. Mayo,Rudy Gay,Zach Randolph,Baron Davis,Chris Kaman,Eric Gordon,Marcus Camby,Rasual Butler,1,1:55,MEM,shot,,,,,,,,,,Marc Gasol,2,,,made,,putback dunk,25,6
Marc Gasol,Marcus Williams,O.J. Mayo,Rudy Gay,Zach Randolph,Baron Davis,Chris Kaman,Eric Gordon,Marcus Camby,Rasual Butler,1,1:55,MEM,violation,,,,,,,,,,,,,,,,delay of game,,
Marc Gasol,Marcus Williams,O.J. Mayo,Rudy Gay,Zach Randolph,Baron Davis,Chris Kaman,Eric Gordon,Marcus Camby,Rasual Butler,1,1:38,MEM,foul,,,,,,,,Chris Kaman,,Marc Gasol,,,,,,shooting,,
Marc Gasol,Marcus Williams,O.J. Mayo,Rudy Gay,Zach Randolph,Baron Davis,Chris Kaman,Eric Gordon,Marcus Camby,Rasual Butler,1,1:38,MEM,timeout,,,,,,,,,,,,,,,,regular,,
Marc Gasol,Marcus Williams,O.J. Mayo,Rudy Gay,Zach Randolph,Baron Davis,Chris Kaman,Eric Gordon,Rasual Butler,Sebastian Telfair,1,1:38,LAC,sub,,,,Sebastian Telfair,,Marcus Camby,,,,,,,,,,,,
Marc Gasol,Marcus Williams,O.J. Mayo,Rudy Gay,Zach Randolph,Chris Kaman,DeAndre Jordan,Eric Gordon,Rasual Butler,Sebastian Telfair,1,1:38,LAC,sub,,,,DeAndre Jordan,,Baron Davis,,,,,,,,,,,,
Marcus Williams,O.J. Mayo,Rudy Gay,Sam Young,Zach Randolph,Chris Kaman,DeAndre Jordan,Eric Gordon,Rasual Butler,Sebastian Telfair,1,1:38,MEM,sub,,,,Sam Young,,Marc Gasol,,,,,,,,,,,,
Hasheem Thabeet,Marcus Williams,Rudy Gay,Sam Young,Zach Randolph,Chris Kaman,DeAndre Jordan,Eric Gordon,Rasual Butler,Sebastian Telfair,1,1:38,MEM,sub,,,,Hasheem Thabeet,,O.J. Mayo,,,,,,,,,,,,
Hasheem Thabeet,Marcus Williams,Rudy Gay,Sam Young,Zach Randolph,Chris Kaman,DeAndre Jordan,Eric Gordon,Rasual Butler,Sebastian Telfair,1,1:38,LAC,free throw,,,,,,,1,,2,Chris Kaman,,,foul,made,,,,
Hasheem Thabeet,Marcus Williams,Rudy Gay,Sam Young,Zach Randolph,Chris Kaman,DeAndre Jordan,Eric Gordon,Rasual Butler,Sebastian Telfair,1,1:38,LAC,free throw,,,,,,,2,,2,Chris Kaman,,,foul,made,,,,
Hasheem Thabeet,Marcus Williams,Rudy Gay,Sam Young,Zach Randolph,Chris Kaman,DeAndre Jordan,Eric Gordon,Rasual Butler,Sebastian Telfair,1,1:23,MEM,shot,,,,,,,,,,Rudy Gay,2,,,made,,jump,18,25
Hasheem Thabeet,Marcus Williams,Rudy Gay,Sam Young,Zach Randolph,Chris Kaman,DeAndre Jordan,Eric Gordon,Rasual Butler,Sebastian Telfair,1,1:10,MEM,foul,,,,,,,,Chris Kaman,,Hasheem Thabeet,,,,,,personal,,
Hasheem Thabeet,Marcus Williams,Rudy Gay,Sam Young,Zach Randolph,Chris Kaman,DeAndre Jordan,Eric Gordon,Rasual Butler,Sebastian Telfair,1,1:10,LAC,free throw,,,,,,,1,,2,Chris Kaman,,,foul,missed,,,,
Hasheem Thabeet,Marcus Williams,Rudy Gay,Sam Young,Zach Randolph,Chris Kaman,DeAndre Jordan,Eric Gordon,Rasual Butler,Sebastian Telfair,1,1:10,LAC,rebound,,,,,,,,,,,,,,,,,,
Hasheem Thabeet,Marcus Williams,Rudy Gay,Sam Young,Zach Randolph,Chris Kaman,DeAndre Jordan,Eric Gordon,Rasual Butler,Sebastian Telfair,1,1:10,LAC,free throw,,,,,,,2,,2,Chris Kaman,,,foul,made,,,,
Hasheem Thabeet,Marcus Williams,Rudy Gay,Sam Young,Zach Randolph,Chris Kaman,DeAndre Jordan,Eric Gordon,Rasual Butler,Sebastian Telfair,1,0:59,MEM,turnover,,,,,,,,,,Marcus Williams,,,bad pass,,Eric Gordon,,,
Hasheem Thabeet,Marcus Williams,Rudy Gay,Sam Young,Zach Randolph,Chris Kaman,DeAndre Jordan,Eric Gordon,Rasual Butler,Sebastian Telfair,1,0:55,LAC,shot,Eric Gordon,,,,,,,,,Rasual Butler,2,,,made,,layup,25,6
Hasheem Thabeet,Marcus Williams,Rudy Gay,Sam Young,Zach Randolph,Chris Kaman,DeAndre Jordan,Eric Gordon,Rasual Butler,Sebastian Telfair,1,0:44,MEM,turnover,,,,,,,,,,Marcus Williams,,,bad pass,,Sebastian Telfair,,,
Hasheem Thabeet,Marcus Williams,Rudy Gay,Sam Young,Zach Randolph,Chris Kaman,DeAndre Jordan,Eric Gordon,Rasual Butler,Sebastian Telfair,1,0:41,LAC,turnover,,,,,,,,,,Sebastian Telfair,,,bad pass,,Sam Young,,,
Hasheem Thabeet,Marcus Williams,Rudy Gay,Sam Young,Zach Randolph,Chris Kaman,DeAndre Jordan,Eric Gordon,Rasual Butler,Sebastian Telfair,1,0:35,MEM,shot,,,,,,,,,,Zach Randolph,,,,missed,,layup,25,6
Hasheem Thabeet,Marcus Williams,Rudy Gay,Sam Young,Zach Randolph,Chris Kaman,DeAndre Jordan,Eric Gordon,Rasual Butler,Sebastian Telfair,1,0:34,MEM,rebound,,,,,,,,,,Rudy Gay,,,,,,off,,
Hasheem Thabeet,Marcus Williams,Rudy Gay,Sam Young,Zach Randolph,Chris Kaman,DeAndre Jordan,Eric Gordon,Rasual Butler,Sebastian Telfair,1,0:34,MEM,shot,,,,,,,,,,Rudy Gay,,,,missed,,tip,25,6
Hasheem Thabeet,Marcus Williams,Rudy Gay,Sam Young,Zach Randolph,Chris Kaman,DeAndre Jordan,Eric Gordon,Rasual Butler,Sebastian Telfair,1,0:31,LAC,rebound,,,,,,,,,,Chris Kaman,,,,,,def,,
Hasheem Thabeet,Marcus Williams,Rudy Gay,Sam Young,Zach Randolph,Chris Kaman,DeAndre Jordan,Eric Gordon,Rasual Butler,Sebastian Telfair,1,0:28,LAC,shot,Chris Kaman,,,,,,,,,Sebastian Telfair,2,,,made,,driving layup,25,6
Hasheem Thabeet,Marcus Williams,Rudy Gay,Sam Young,Zach Randolph,Chris Kaman,DeAndre Jordan,Eric Gordon,Rasual Butler,Sebastian Telfair,1,0:05,LAC,foul,,,,,,,,Hasheem Thabeet,,Chris Kaman,,,,,,personal,,
DeMarre Carroll,Hasheem Thabeet,Marcus Williams,Sam Young,Zach Randolph,Chris Kaman,DeAndre Jordan,Eric Gordon,Rasual Butler,Sebastian Telfair,1,0:05,MEM,sub,,,,DeMarre Carroll,,Rudy Gay,,,,,,,,,,,,
DeMarre Carroll,Hasheem Thabeet,Marcus Williams,Sam Young,Zach Randolph,Al Thornton,DeAndre Jordan,Eric Gordon,Rasual Butler,Sebastian Telfair,1,0:05,LAC,sub,,,,Al Thornton,,Chris Kaman,,,,,,,,,,,,
DeMarre Carroll,Hasheem Thabeet,Marcus Williams,Sam Young,Zach Randolph,Al Thornton,DeAndre Jordan,Eric Gordon,Rasual Butler,Sebastian Telfair,1,0:03,MEM,shot,DeMarre Carroll,,,,,,,,,Marcus Williams,2,,,made,,jump,41,6
DeMarre Carroll,Hasheem Thabeet,Marcus Williams,Sam Young,Zach Randolph,Al Thornton,DeAndre Jordan,Eric Gordon,Rasual Butler,Sebastian Telfair,1,0:00,LAC,shot,,,,,,,,,,Sebastian Telfair,,,,missed,,3pt,25,40
DeMarre Carroll,Hasheem Thabeet,Marcus Williams,Sam Young,Zach Randolph,Al Thornton,DeAndre Jordan,Eric Gordon,Rasual Butler,Sebastian Telfair,1,0:00,LAC,rebound,,,,,,,,,,,,,,,,,,
DeMarre Carroll,Hasheem Thabeet,Marcus Williams,Sam Young,Zach Randolph,Al Thornton,Craig Smith,DeAndre Jordan,Eric Gordon,Sebastian Telfair,2,11:48,LAC,foul,,,,,,,,Zach Randolph,,Al Thornton,,,,,,shooting,,
DeMarre Carroll,Hasheem Thabeet,Marcus Williams,Sam Young,Zach Randolph,Al Thornton,Craig Smith,DeAndre Jordan,Eric Gordon,Sebastian Telfair,2,11:48,MEM,free throw,,,,,,,1,,2,Zach Randolph,,,foul,missed,,,,
DeMarre Carroll,Hasheem Thabeet,Marcus Williams,Sam Young,Zach Randolph,Al Thornton,Craig Smith,DeAndre Jordan,Eric Gordon,Sebastian Telfair,2,11:48,MEM,rebound,,,,,,,,,,,,,,,,,,
DeMarre Carroll,Hasheem Thabeet,Marcus Williams,Sam Young,Zach Randolph,Al Thornton,Craig Smith,DeAndre Jordan,Eric Gordon,Sebastian Telfair,2,11:48,MEM,free throw,,,,,,,2,,2,Zach Randolph,,,foul,made,,,,
DeMarre Carroll,Hasheem Thabeet,Marcus Williams,Sam Young,Zach Randolph,Al Thornton,Craig Smith,DeAndre Jordan,Eric Gordon,Sebastian Telfair,2,11:31,LAC,shot,,,,,,,,,,Al Thornton,2,,,made,,turnaround jump,29,18
DeMarre Carroll,Hasheem Thabeet,Marcus Williams,Sam Young,Zach Randolph,Al Thornton,Craig Smith,DeAndre Jordan,Eric Gordon,Sebastian Telfair,2,11:17,MEM,shot,Zach Randolph,,,,,,,,,DeMarre Carroll,2,,,made,,jump,42,8
DeMarre Carroll,Hasheem Thabeet,Marcus Williams,Sam Young,Zach Randolph,Al Thornton,Craig Smith,DeAndre Jordan,Eric Gordon,Sebastian Telfair,2,11:04,LAC,turnover,,,,,,,,,,Craig Smith,,,traveling,,,,,
DeMarre Carroll,Hasheem Thabeet,Marcus Williams,Sam Young,Zach Randolph,Al Thornton,Craig Smith,DeAndre Jordan,Eric Gordon,Sebastian Telfair,2,10:51,LAC,foul,,,,,,,,,,Craig Smith,,,,,,defense 3 second,,
DeMarre Carroll,Hasheem Thabeet,Marcus Williams,Sam Young,Zach Randolph,Al Thornton,Craig Smith,DeAndre Jordan,Eric Gordon,Sebastian Telfair,2,10:51,MEM,free throw,,,,,,,1,,1,Zach Randolph,,,technical,made,,,,
DeMarre Carroll,Hasheem Thabeet,Marcus Williams,Sam Young,Zach Randolph,Al Thornton,Craig Smith,DeAndre Jordan,Eric Gordon,Sebastian Telfair,2,10:38,MEM,shot,Zach Randolph,,,,,,,,,Sam Young,3,,,made,,3pt,11,29
DeMarre Carroll,Hasheem Thabeet,Marcus Williams,Sam Young,Zach Randolph,Al Thornton,Craig Smith,DeAndre Jordan,Eric Gordon,Sebastian Telfair,2,10:22,MEM,foul,,,,,,,,Al Thornton,,DeMarre Carroll,,,,,,personal,,
DeMarre Carroll,Hasheem Thabeet,Marcus Williams,Sam Young,Zach Randolph,Al Thornton,Craig Smith,DeAndre Jordan,Eric Gordon,Sebastian Telfair,2,10:11,LAC,shot,Sebastian Telfair,,,,,,,,,Eric Gordon,3,,,made,,3pt,7,24
DeMarre Carroll,Hasheem Thabeet,Marcus Williams,Sam Young,Zach Randolph,Al Thornton,Craig Smith,DeAndre Jordan,Eric Gordon,Sebastian Telfair,2,9:57,LAC,foul,,,,,,,,Hasheem Thabeet,,Craig Smith,,,,,,personal,,
DeMarre Carroll,Hasheem Thabeet,Marcus Williams,Sam Young,Zach Randolph,Al Thornton,Craig Smith,DeAndre Jordan,Eric Gordon,Sebastian Telfair,2,9:52,MEM,shot,,,,,,,,,,Sam Young,,,,missed,,3pt,9,26