a1,a2,a3,a4,a5,h1,h2,h3,h4,h5,period,time,team,etype,assist,away,block,entered,home,left,num,opponent,outof,player,points,possession,reason,result,steal,type,x,y
Andrew Bynum,Derek Fisher,Kobe Bryant,Lamar Odom,Ron Artest,Aaron Brooks,Chuck Hayes,Luis Scola,Shane Battier,Trevor Ariza,1,12:00,OFF,jump ball,,Andrew Bynum,,,Luis Scola,,,,,,,Lamar Odom,,,,,,
Andrew Bynum,Derek Fisher,Kobe Bryant,Lamar Odom,Ron Artest,Aaron Brooks,Chuck Hayes,Luis Scola,Shane Battier,Trevor Ariza,1,11:45,LAL,shot,,,,,,,,,,Kobe Bryant,2,,,made,,turnaround fade away,35,14
Andrew Bynum,Derek Fisher,Kobe Bryant,Lamar Odom,Ron Artest,Aaron Brooks,Chuck Hayes,Luis Scola,Shane Battier,Trevor Ariza,1,11:31,HOU,shot,,,,,,,,,,Trevor Ariza,2,,,made,,pullup jump,14,21
Andrew Bynum,Derek Fisher,Kobe Bryant,Lamar Odom,Ron Artest,Aaron Brooks,Chuck Hayes,Luis Scola,Shane Battier,Trevor Ariza,1,11:18,LAL,shot,,,,,,,,,,Kobe Bryant,,,,missed,,jump,13,22
Andrew Bynum,Derek Fisher,Kobe Bryant,Lamar Odom,Ron Artest,Aaron Brooks,Chuck Hayes,Luis Scola,Shane Battier,Trevor Ariza,1,11:17,HOU,rebound,,,,,,,,,,Luis Scola,,,,,,def,,
Andrew Bynum,Derek Fisher,Kobe Bryant,Lamar Odom,Ron Artest,Aaron Brooks,Chuck Hayes,Luis Scola,Shane Battier,Trevor Ariza,1,11:07,HOU,shot,Chuck Hayes,,,,,,,,,Luis Scola,2,,,made,,jump,14,13
Andrew Bynum,Derek Fisher,Kobe Bryant,Lamar Odom,Ron Artest,Aaron Brooks,Chuck Hayes,Luis Scola,Shane Battier,Trevor Ariza,1,10:42,LAL,shot,,,,,,,,,,Derek Fisher,,,,missed,,jump,4,6
Andrew Bynum,Derek Fisher,Kobe Bryant,Lamar Odom,Ron Artest,Aaron Brooks,Chuck Hayes,Luis Scola,Shane Battier,Trevor Ariza,1,10:41,LAL,rebound,,,,,,,,,,Andrew Bynum,,,,,,off,,
Andrew Bynum,Derek Fisher,Kobe Bryant,Lamar Odom,Ron Artest,Aaron Brooks,Chuck Hayes,Luis Scola,Shane Battier,Trevor Ariza,1,10:39,LAL,shot,,,,,,,,,,Andrew Bynum,2,,,made,,dunk,25,6
Andrew Bynum,Derek Fisher,Kobe Bryant,Lamar Odom,Ron Artest,Aaron Brooks,Chuck Hayes,Luis Scola,Shane Battier,Trevor Ariza,1,10:25,HOU,shot,Aaron Brooks,,,,,,,,,Shane Battier,3,,,made,,3pt,2,8
Andrew Bynum,Derek Fisher,Kobe Bryant,Lamar Odom,Ron Artest,Aaron Brooks,Chuck Hayes,Luis Scola,Shane Battier,Trevor Ariza,1,10:08,LAL,shot,Ron Artest,,,,,,,,,Kobe Bryant,2,,,made,,turnaround fade away,18,16
Andrew Bynum,Derek Fisher,Kobe Bryant,Lamar Odom,Ron Artest,Aaron Brooks,Chuck Hayes,Luis Scola,Shane Battier,Trevor Ariza,1,9:54,HOU,shot,,,,,,,,,,Luis Scola,,,,missed,,hook,15,9
Andrew Bynum,Derek Fisher,Kobe Bryant,Lamar Odom,Ron Artest,Aaron Brooks,Chuck Hayes,Luis Scola,Shane Battier,Trevor Ariza,1,9:52,LAL,rebound,,,,,,,,,,Kobe Bryant,,,,,,def,,
Andrew Bynum,Derek Fisher,Kobe Bryant,Lamar Odom,Ron Artest,Aaron Brooks,Chuck Hayes,Luis Scola,Shane Battier,Trevor Ariza,1,9:40,LAL,shot,,,,,,,,,,Ron Artest,,,,missed,,running jump,31,9
Andrew Bynum,Derek Fisher,Kobe Bryant,Lamar Odom,Ron Artest,Aaron Brooks,Chuck Hayes,Luis Scola,Shane Battier,Trevor Ariza,1,9:39,LAL,rebound,,,,,,,,,,Ron Artest,,,,,,off,,
Andrew Bynum,Derek Fisher,Kobe Bryant,Lamar Odom,Ron Artest,Aaron Brooks,Chuck Hayes,Luis Scola,Shane Battier,Trevor Ariza,1,9:38,HOU,foul,,,,,,,,Ron Artest,,Luis Scola,,,,,,personal,,
Andrew Bynum,Derek Fisher,Kobe Bryant,Lamar Odom,Ron Artest,Aaron Brooks,Chuck Hayes,Luis Scola,Shane Battier,Trevor Ariza,1,9:29,LAL,shot,,,,,,,,,,Andrew Bynum,,,,missed,,jump,32,9
Andrew Bynum,Derek Fisher,Kobe Bryant,Lamar Odom,Ron Artest,Aaron Brooks,Chuck Hayes,Luis Scola,Shane Battier,Trevor Ariza,1,9:28,HOU,rebound,,,,,,,,,,Chuck Hayes,,,,,,def,,
Andrew Bynum,Derek Fisher,Kobe Bryant,Lamar Odom,Ron Artest,Aaron Brooks,Chuck Hayes,Luis Scola,Shane Battier,Trevor Ariza,1,9:14,HOU,shot,,,Lamar Odom,,,,,,,Trevor Ariza,,,,missed,,layup,25,6
Andrew Bynum,Derek Fisher,Kobe Bryant,Lamar Odom,Ron Artest,Aaron Brooks,Chuck Hayes,Luis Scola,Shane Battier,Trevor Ariza,1,9:12,HOU,rebound,,,,,,,,,,Luis Scola,,,,,,off,,
Andrew Bynum,Derek Fisher,Kobe Bryant,Lamar Odom,Ron Artest,Aaron Brooks,Chuck Hayes,Luis Scola,Shane Battier,Trevor Ariza,1,9:11,HOU,shot,,,,,,,,,,Luis Scola,2,,,made,,layup,25,6
Andrew Bynum,Derek Fisher,Kobe Bryant,Lamar Odom,Ron Artest,Aaron Brooks,Chuck Hayes,Luis Scola,Shane Battier,Trevor Ariza,1,9:11,LAL,foul,,,,,,,,Luis Scola,,Andrew Bynum,,,,,,shooting,,
Andrew Bynum,Derek Fisher,Kobe Bryant,Lamar Odom,Ron Artest,Aaron Brooks,Chuck Hayes,Luis Scola,Shane Battier,Trevor Ariza,1,9:11,HOU,foul,,,,,,,,,,Double,,,,,,technical,,
Andrew Bynum,Derek Fisher,Kobe Bryant,Lamar Odom,Ron Artest,Aaron Brooks,Chuck Hayes,Luis Scola,Shane Battier,Trevor Ariza,1,9:11,HOU,free throw,,,,,,,1,,1,Luis Scola,,,foul,missed,,,,
Andrew Bynum,Derek Fisher,Kobe Bryant,Lamar Odom,Ron Artest,Aaron Brooks,Chuck Hayes,Luis Scola,Shane Battier,Trevor Ariza,1,9:11,LAL,rebound,,,,,,,,,,Lamar Odom,,,,,,def,,
Andrew Bynum,Derek Fisher,Kobe Bryant,Lamar Odom,Ron Artest,Aaron Brooks,Chuck Hayes,Luis Scola,Shane Battier,Trevor Ariza,1,8:56,LAL,shot,,,,,,,,,,Derek Fisher,,,,missed,,pullup jump,39,16
Andrew Bynum,Derek Fisher,Kobe Bryant,Lamar Odom,Ron Artest,Aaron Brooks,Chuck Hayes,Luis Scola,Shane Battier,Trevor Ariza,1,8:54,HOU,rebound,,,,,,,,,,Trevor Ariza,,,,,,def,,
Andrew Bynum,Derek Fisher,Kobe Bryant,Lamar Odom,Ron Artest,Aaron Brooks,Chuck Hayes,Luis Scola,Shane Battier,Trevor Ariza,1,8:45,HOU,shot,,,,,,,,,,Aaron Brooks,,,,missed,,jump bank,14,13
Andrew Bynum,Derek Fisher,Kobe Bryant,Lamar Odom,Ron Artest,Aaron Brooks,Chuck Hayes,Luis Scola,Shane Battier,Trevor Ariza,1,8:43,LAL,rebound,,,,,,,,,,Kobe Bryant,,,,,,def,,
Andrew Bynum,Derek Fisher,Kobe Bryant,Lamar Odom,Ron Artest,Aaron Brooks,Chuck Hayes,Luis Scola,Shane Battier,Trevor Ariza,1,8:35,LAL,shot,,,,,,,,,,Kobe Bryant,2,,,made,,running jump,18,8
Andrew Bynum,Derek Fisher,Kobe Bryant,Lamar Odom,Ron Artest,Aaron Brooks,Chuck Hayes,Luis Scola,Shane Battier,Trevor Ariza,1,8:29,HOU,turnover,,,,,,,,,,Aaron Brooks,,,bad pass,,Lamar Odom,,,
Andrew Bynum,Derek Fisher,Kobe Bryant,Lamar Odom,Ron Artest,Aaron Brooks,Chuck Hayes,Luis Scola,Shane Battier,Trevor Ariza,1,8:23,LAL,shot,,,,,,,,,,Derek Fisher,,,,missed,,jump,18,25
Andrew Bynum,Derek Fisher,Kobe Bryant,Lamar Odom,Ron Artest,Aaron Brooks,Chuck Hayes,Luis Scola,Shane Battier,Trevor Ariza,1,8:21,HOU,rebound,,,,,,,,,,Trevor Ariza,,,,,,def,,
Andrew Bynum,Derek Fisher,Kobe Bryant,Lamar Odom,Ron Artest,Aaron Brooks,Chuck Hayes,Luis Scola,Shane Battier,Trevor Ariza,1,8:16,HOU,shot,,,,,,,,,,Trevor Ariza,,,,missed,,3pt,13,29
Andrew Bynum,Derek Fisher,Kobe Bryant,Lamar Odom,Ron Artest,Aaron Brooks,Chuck Hayes,Luis Scola,Shane Battier,Trevor Ariza,1,8:15,LAL,rebound,,,,,,,,,,Lamar Odom,,,,,,def,,
Andrew Bynum,Derek Fisher,Kobe Bryant,Lamar Odom,Ron Artest,Aaron Brooks,Chuck Hayes,Luis Scola,Shane Battier,Trevor Ariza,1,7:58,LAL,shot,,,,,,,,,,Lamar Odom,,,,missed,,layup,25,6
Andrew Bynum,Derek Fisher,Kobe Bryant,Lamar Odom,Ron Artest,Aaron Brooks,Chuck Hayes,Luis Scola,Shane Battier,Trevor Ariza,1,7:57,HOU,rebound,,,,,,,,,,Chuck Hayes,,,,,,def,,
Andrew Bynum,Derek Fisher,Kobe Bryant,Lamar Odom,Ron Artest,Aaron Brooks,Chuck Hayes,Luis Scola,Shane Battier,Trevor Ariza,1,7:50,HOU,shot,,,,,,,,,,Shane Battier,,,,missed,,3pt,46,19
Andrew Bynum,Derek Fisher,Kobe Bryant,Lamar Odom,Ron Artest,Aaron Brooks,Chuck Hayes,Luis Scola,Shane Battier,Trevor Ariza,1,7:49,LAL,rebound,,,,,,,,,,Andrew Bynum,,,,,,def,,
Andrew Bynum,Derek Fisher,Kobe Bryant,Lamar Odom,Ron Artest,Aaron Brooks,Chuck Hayes,Luis Scola,Shane Battier,Trevor Ariza,1,7:35,LAL,shot,,,,,,,,,,Andrew Bynum,,,,missed,,hook,24,13
Andrew Bynum,Derek Fisher,Kobe Bryant,Lamar Odom,Ron Artest,Aaron Brooks,Chuck Hayes,Luis Scola,Shane Battier,Trevor Ariza,1,7:33,HOU,rebound,,,,,,,,,,Luis Scola,,,,,,def,,
Andrew Bynum,Derek Fisher,Kobe Bryant,Lamar Odom,Ron Artest,Aaron Brooks,Chuck Hayes,Luis Scola,Shane Battier,Trevor Ariza,1,7:22,HOU,shot,,,,,,,,,,Luis Scola,2,,,made,,turnaround hook,30,15
Andrew Bynum,Derek Fisher,Kobe Bryant,Lamar Odom,Ron Artest,Aaron Brooks,Chuck Hayes,Luis Scola,Shane Battier,Trevor Ariza,1,7:04,LAL,turnover,,,,,,,,,,Kobe Bryant,,,bad pass,,Chuck Hayes,,,
Andrew Bynum,Derek Fisher,Kobe Bryant,Lamar Odom,Ron Artest,Aaron Brooks,Chuck Hayes,Luis Scola,Shane Battier,Trevor Ariza,1,6:54,HOU,shot,Trevor Ariza,,,,,,,,,Chuck Hayes,2,,,made,,layup,25,6
Andrew Bynum,Derek Fisher,Kobe Bryant,Lamar Odom,Ron Artest,Aaron Brooks,Chuck Hayes,Luis Scola,Shane Battier,Trevor Ariza,1,6:37,LAL,shot,Lamar Odom,,,,,,,,,Kobe Bryant,2,,,made,,jump,8,14
Andrew Bynum,Derek Fisher,Kobe Bryant,Lamar Odom,Ron Artest,Aaron Brooks,Chuck Hayes,Luis Scola,Shane Battier,Trevor Ariza,1,6:17,HOU,turnover,,,,,,,,,,Aaron Brooks,,,backcourt turnover,,,,,
Andrew Bynum,Derek Fisher,Kobe Bryant,Lamar Odom,Ron Artest,Aaron Brooks,Chuck Hayes,Luis Scola,Shane Battier,Trevor Ariza,1,6:08,LAL,shot,,,,,,,,,,Kobe Bryant,,,,missed,,jump,14,12
Andrew Bynum,Derek Fisher,Kobe Bryant,Lamar Odom,Ron Artest,Aaron Brooks,Chuck Hayes,Luis Scola,Shane Battier,Trevor Ariza,1,6:07,HOU,rebound,,,,,,,,,,Luis Scola,,,,,,def,,
Andrew Bynum,Derek Fisher,Kobe Bryant,Lamar Odom,Ron Artest,Aaron Brooks,Chuck Hayes,Luis Scola,Shane Battier,Trevor Ariza,1,5:43,HOU,shot,,,,,,,,,,Aaron Brooks,,,,missed,,driving layup,25,6
Andrew Bynum,Derek Fisher,Kobe Bryant,Lamar Odom,Ron Artest,Aaron Brooks,Chuck Hayes,Luis Scola,Shane Battier,Trevor Ariza,1,5:41,LAL,rebound,,,,,,,,,,Kobe Bryant,,,,,,def,,
Andrew Bynum,Derek Fisher,Kobe Bryant,Lamar Odom,Ron Artest,Aaron Brooks,Chuck Hayes,Luis Scola,Shane Battier,Trevor Ariza,1,5:35,LAL,shot,,,,,,,,,,Andrew Bynum,,,,missed,,layup,25,6
Andrew Bynum,Derek Fisher,Kobe Bryant,Lamar Odom,Ron Artest,Aaron Brooks,Chuck Hayes,Luis Scola,Shane Battier,Trevor Ariza,1,5:34,HOU,rebound,,,,,,,,,,Shane Battier,,,,,,def,,
Andrew Bynum,Derek Fisher,Kobe Bryant,Lamar Odom,Ron Artest,Aaron Brooks,Chuck Hayes,Luis Scola,Shane Battier,Trevor Ariza,1,5:27,HOU,shot,Aaron Brooks,,,,,,,,,Shane Battier,3,,,made,,3pt,38,27
Andrew Bynum,Derek Fisher,Kobe Bryant,Lamar Odom,Ron Artest,Aaron Brooks,Chuck Hayes,Luis Scola,Shane Battier,Trevor Ariza,1,5:18,LAL,timeout,,,,,,,,,,,,,,,,regular,,
Andrew Bynum,Derek Fisher,Kobe Bryant,Lamar Odom,Ron Artest,Aaron Brooks,Chuck Hayes,Luis Scola,Shane Battier,Trevor Ariza,1,5:11,LAL,foul,,,,,,,,Shane Battier,,Kobe Bryant,,,,,,offensive,,
Andrew Bynum,Derek Fisher,Kobe Bryant,Lamar Odom,Ron Artest,Aaron Brooks,Chuck Hayes,Luis Scola,Shane Battier,Trevor Ariza,1,5:11,LAL,turnover,,,,,,,,,,Kobe Bryant,,,foul,,,,,
Andrew Bynum,Derek Fisher,Kobe Bryant,Lamar Odom,Ron Artest,Aaron Brooks,Chuck Hayes,Luis Scola,Shane Battier,Trevor Ariza,1,4:46,HOU,turnover,,,,,,,,,,,,,shot clock turnover,,,,,
Andrew Bynum,Derek Fisher,Kobe Bryant,Lamar Odom,Ron Artest,Aaron Brooks,Chuck Hayes,Luis Scola,Shane Battier,Trevor Ariza,1,4:29,LAL,shot,,,Chuck Hayes,,,,,,,Lamar Odom,,,,missed,,layup,25,6
Andrew Bynum,Derek Fisher,Kobe Bryant,Lamar Odom,Ron Artest,Aaron Brooks,Chuck Hayes,Luis Scola,Shane Battier,Trevor Ariza,1,4:27,LAL,rebound,,,,,,,,,,Lamar Odom,,,,,,off,,
Andrew Bynum,Derek Fisher,Kobe Bryant,Lamar Odom,Ron Artest,Aaron Brooks,Chuck Hayes,Luis Scola,Shane Battier,Trevor Ariza,1,4:27,LAL,shot,,,,,,,,,,Lamar Odom,,,,missed,,tip,25,6
Andrew Bynum,Derek Fisher,Kobe Bryant,Lamar Odom,Ron Artest,Aaron Brooks,Chuck Hayes,Luis Scola,Shane Battier,Trevor Ariza,1,4:26,LAL,rebound,,,,,,,,,,,,,,,,,,
Andrew Bynum,Derek Fisher,Kobe Bryant,Lamar Odom,Ron Artest,Aaron Brooks,Chuck Hayes,Luis Scola,Shane Battier,Trevor Ariza,1,4:16,LAL,shot,,,,,,,,,,Kobe Bryant,,,,missed,,turnaround fade away,31,16
Andrew Bynum,Derek Fisher,Kobe Bryant,Lamar Odom,Ron Artest,Aaron Brooks,Chuck Hayes,Luis Scola,Shane Battier,Trevor Ariza,1,4:14,HOU,rebound,,,,,,,,,,Luis Scola,,,,,,def,,
Andrew Bynum,Derek Fisher,Kobe Bryant,Lamar Odom,Ron Artest,Aaron Brooks,Chuck Hayes,Luis Scola,Shane Battier,Trevor Ariza,1,4:09,HOU,shot,Luis Scola,,,,,,,,,Chuck Hayes,2,,,made,,reverse layup,25,6
Andrew Bynum,Derek Fisher,Kobe Bryant,Lamar Odom,Ron Artest,Aaron Brooks,Chuck Hayes,Luis Scola,Shane Battier,Trevor Ariza,1,3:54,LAL,shot,,,,,,,,,,Ron Artest,3,,,made,,3pt,41,26
Andrew Bynum,Derek Fisher,Kobe Bryant,Lamar Odom,Ron Artest,Aaron Brooks,Chuck Hayes,Luis Scola,Shane Battier,Trevor Ariza,1,3:42,HOU,shot,Chuck Hayes,,,,,,,,,Aaron Brooks,2,,,made,,layup,25,6
Andrew Bynum,Derek Fisher,Kobe Bryant,Lamar Odom,Ron Artest,Aaron Brooks,Chuck Hayes,Luis Scola,Shane Battier,Trevor Ariza,1,3:29,LAL,shot,Kobe Bryant,,,,,,,,,Andrew Bynum,2,,,made,,layup,25,6
Andrew Bynum,Derek Fisher,Kobe Bryant,Lamar Odom,Ron Artest,Aaron Brooks,Chuck Hayes,Luis Scola,Shane Battier,Trevor Ariza,1,3:20,HOU,shot,,,Andrew Bynum,,,,,,,Trevor Ariza,,,,missed,,layup,25,6
Andrew Bynum,Derek Fisher,Kobe Bryant,Lamar Odom,Ron Artest,Aaron Brooks,Chuck Hayes,Luis Scola,Shane Battier,Trevor Ariza,1,3:19,HOU,rebound,,,,,,,,,,Trevor Ariza,,,,,,off,,
Derek Fisher,Josh Powell,Kobe Bryant,Lamar Odom,Ron Artest,Aaron Brooks,Chuck Hayes,Luis Scola,Shane Battier,Trevor Ariza,1,3:19,LAL,sub,,,,Josh Powell,,Andrew Bynum,,,,,,,,,,,,
Jordan Farmar,Josh Powell,Kobe Bryant,Lamar Odom,Ron Artest,Aaron Brooks,Chuck Hayes,Luis Scola,Shane Battier,Trevor Ariza,1,3:19,LAL,sub,,,,Jordan Farmar,,Derek Fisher,,,,,,,,,,,,
Jordan Farmar,Josh Powell,Kobe Bryant,Lamar Odom,Ron Artest,Aaron Brooks,Chuck Hayes,Luis Scola,Shane Battier,Trevor Ariza,1,3:14,HOU,shot,,,,,,,,,,Trevor Ariza,,,,missed,,3pt,47,8
Jordan Farmar,Josh Powell,Kobe Bryant,Lamar Odom,Ron Artest,Aaron Brooks,Chuck Hayes,Luis Scola,Shane Battier,Trevor Ariza,1,3:13,HOU,rebound,,,,,,,,,,Shane Battier,,,,,,off,,
Jordan Farmar,Josh Powell,Kobe Bryant,Lamar Odom,Ron Artest,Aaron Brooks,Chuck Hayes,Luis Scola,Shane Battier,Trevor Ariza,1,3:11,HOU,turnover,,,,,,,,,,Shane Battier,,,lost ball,,Kobe Bryant,,,
Jordan Farmar,Josh Powell,Kobe Bryant,Lamar Odom,Ron Artest,Aaron Brooks,Chuck Hayes,Luis Scola,Shane Battier,Trevor Ariza,1,3:11,HOU,foul,,,,,,,,Kobe Bryant,,Chuck Hayes,,,,,,loose ball,,
Jordan Farmar,Josh Powell,Kobe Bryant,Lamar Odom,Ron Artest,Aaron Brooks,Carl Landry,Luis Scola,Shane Battier,Trevor Ariza,1,3:11,HOU,sub,,,,Carl Landry,,Chuck Hayes,,,,,,,,,,,,
Jordan Farmar,Josh Powell,Kobe Bryant,Lamar Odom,Ron Artest,Aaron Brooks,Carl Landry,Luis Scola,Shane Battier,Trevor Ariza,1,2:51,LAL,shot,,,,,,,,,,Kobe Bryant,,,,missed,,3pt,41,27
Jordan Farmar,Josh Powell,Kobe Bryant,Lamar Odom,Ron Artest,Aaron Brooks,Carl Landry,Luis Scola,Shane Battier,Trevor Ariza,1,2:49,HOU,rebound,,,,,,,,,,Luis Scola,,,,,,def,,
Jordan Farmar,Josh Powell,Kobe Bryant,Lamar Odom,Ron Artest,Aaron Brooks,Carl Landry,Luis Scola,Shane Battier,Trevor Ariza,1,2:45,LAL,foul,,,,,,,,Luis Scola,,Lamar Odom,,,,,,personal,,
Jordan Farmar,Josh Powell,Kobe Bryant,Lamar Odom,Ron Artest,Aaron Brooks,Carl Landry,Luis Scola,Shane Battier,Trevor Ariza,1,2:45,HOU,timeout,,,,,,,,,,,,,,,,regular,,
Jordan Farmar,Josh Powell,Kobe Bryant,Lamar Odom,Ron Artest,Aaron Brooks,Carl Landry,Kyle Lowry,Luis Scola,Trevor Ariza,1,2:45,HOU,sub,,,,Kyle Lowry,,Shane Battier,,,,,,,,,,,,
Andrew Bynum,Jordan Farmar,Josh Powell,Kobe Bryant,Ron Artest,Aaron Brooks,Carl Landry,Kyle Lowry,Luis Scola,Trevor Ariza,1,2:45,LAL,sub,,,,Andrew Bynum,,Lamar Odom,,,,,,,,,,,,
Andrew Bynum,Jordan Farmar,Josh Powell,Ron Artest,Sasha Vujacic,Aaron Brooks,Carl Landry,Kyle Lowry,Luis Scola,Trevor Ariza,1,2:45,LAL,sub,,,,Sasha Vujacic,,Kobe Bryant,,,,,,,,,,,,
Andrew Bynum,Jordan Farmar,Josh Powell,Ron Artest,Sasha Vujacic,Aaron Brooks,Carl Landry,Kyle Lowry,Luis Scola,Trevor Ariza,1,2:31,HOU,shot,,,,,,,,,,Carl Landry,,,,missed,,turnaround jump,31,10
Andrew Bynum,Jordan Farmar,Josh Powell,Ron Artest,Sasha Vujacic,Aaron Brooks,Carl Landry,Kyle Lowry,Luis Scola,Trevor Ariza,1,2:29,LAL,rebound,,,,,,,,,,Sasha Vujacic,,,,,,def,,
Andrew Bynum,Jordan Farmar,Josh Powell,Ron Artest,Sasha Vujacic,Aaron Brooks,Carl Landry,Kyle Lowry,Luis Scola,Trevor Ariza,1,2:13,LAL,shot,Jordan Farmar,,,,,,,,,Andrew Bynum,2,,,made,,layup,25,6
Andrew Bynum,Jordan Farmar,Josh Powell,Ron Artest,Sasha Vujacic,Aaron Brooks,Carl Landry,Kyle Lowry,Luis Scola,Trevor Ariza,1,2:03,HOU,shot,,,,,,,,,,Carl Landry,,,,missed,,jump,36,19
Andrew Bynum,Jordan Farmar,Josh Powell,Ron Artest,Sasha Vujacic,Aaron Brooks,Carl Landry,Kyle Lowry,Luis Scola,Trevor Ariza,1,2:01,LAL,rebound,,,,,,,,,,Ron Artest,,,,,,def,,
Andrew Bynum,Jordan Farmar,Josh Powell,Ron Artest,Sasha Vujacic,Aaron Brooks,Carl Landry,Kyle Lowry,Luis Scola,Trevor Ariza,1,1:52,LAL,shot,Josh Powell,,,,,,,,,Ron Artest,2,,,made,,layup,25,6
Andrew Bynum,Jordan Farmar,Josh Powell,Ron Artest,Sasha Vujacic,Aaron Brooks,Carl Landry,Kyle Lowry,Luis Scola,Trevor Ariza,1,1:33,HOU,shot,,,,,,,,,,Luis Scola,2,,,made,,driving layup,25,6
Andrew Bynum,Jordan Farmar,Josh Powell,Ron Artest,Sasha Vujacic,Aaron Brooks,Carl Landry,Kyle Lowry,Luis Scola,Trevor Ariza,1,1:12,LAL,shot,Andrew Bynum,,,,,,,,,Josh Powell,3,,,made,,3pt,2,14
Andrew Bynum,Jordan Farmar,Josh Powell,Ron Artest,Sasha Vujacic,Aaron Brooks,Carl Landry,Kyle Lowry,Luis Scola,Trevor Ariza,1,0:49,HOU,shot,,,,,,,,,,Luis Scola,,,,missed,,jump,19,25
Andrew Bynum,Jordan Farmar,Josh Powell,Ron Artest,Sasha Vujacic,Aaron Brooks,Carl Landry,Kyle Lowry,Luis Scola,Trevor Ariza,1,0:46,LAL,rebound,,,,,,,,,,Josh Powell,,,,,,def,,
Andrew Bynum,Jordan Farmar,Josh Powell,Ron Artest,Sasha Vujacic,Aaron Brooks,Carl Landry,David Andersen,Kyle Lowry,Trevor Ariza,1,0:46,HOU,sub,,,,David Andersen,,Luis Scola,,,,,,,,,,,,
Andrew Bynum,Jordan Farmar,Josh Powell,Ron Artest,Sasha Vujacic,Aaron Brooks,Carl Landry,David Andersen,Kyle Lowry,Trevor Ariza,1,0:34,HOU,foul,,,,,,,,Ron Artest,,Trevor Ariza,,,,,,personal,,
Andrew Bynum,Jordan Farmar,Josh Powell,Ron Artest,Sasha Vujacic,Aaron Brooks,Carl Landry,David Andersen,Kyle Lowry,Trevor Ariza,1,0:22,LAL,shot,,,,,,,,,,Ron Artest,,,,missed,,3pt,4,21
Andrew Bynum,Jordan Farmar,Josh Powell,Ron Artest,Sasha Vujacic,Aaron Brooks,Carl Landry,David Andersen,Kyle Lowry,Trevor Ariza,1,0:21,LAL,rebound,,,,,,,,,,Jordan Farmar,,,,,,off,,
Andrew Bynum,Jordan Farmar,Josh Powell,Ron Artest,Sasha Vujacic,Aaron Brooks,Carl Landry,David Andersen,Kyle Lowry,Trevor Ariza,1,0:00,LAL,shot,,,,,,,,,,Ron Artest,,,,missed,,pullup jump,37,21
Andrew Bynum,Jordan Farmar,Josh Powell,Ron Artest,Sasha Vujacic,Aaron Brooks,Carl Landry,David Andersen,Kyle Lowry,Trevor Ariza,1,0:00,LAL,rebound,,,,,,,,,,Andrew Bynum,,,,,,off,,
Andrew Bynum,Jordan Farmar,Josh Powell,Ron Artest,Sasha Vujacic,Aaron Brooks,Carl Landry,David Andersen,Kyle Lowry,Trevor Ariza,1,0:00,LAL,shot,,,,,,,,,,Andrew Bynum,,,,missed,,tip,25,6
Andrew Bynum,Jordan Farmar,Josh Powell,Ron Artest,Sasha Vujacic,Aaron Brooks,Carl Landry,David Andersen,Kyle Lowry,Trevor Ariza,1,0:00,LAL,rebound,,,,,,,,,,,,,,,,,,
Andrew Bynum,Jordan Farmar,Josh Powell,Kobe Bryant,Shannon Brown,Aaron Brooks,Carl Landry,David Andersen,Kyle Lowry,Trevor Ariza,2,11:37,HOU,shot,,,,,,,,,,Kyle Lowry,,,,missed,,3pt,9,26
Andrew Bynum,Jordan Farmar,Josh Powell,Kobe Bryant,Shannon Brown,Aaron Brooks,Carl Landry,David Andersen,Kyle Lowry,Trevor Ariza,2,11:35,LAL,rebound,,,,,,,,,,Andrew Bynum,,,,,,def,,
Andrew Bynum,Jordan Farmar,Josh Powell,Kobe Bryant,Shannon Brown,Aaron Brooks,Carl Landry,David Andersen,Kyle Lowry,Trevor Ariza,2,11:21,HOU,foul,,,,,,,,Andrew Bynum,,David Andersen,,,,,,personal,,
Andrew Bynum,Jordan Farmar,Josh Powell,Kobe Bryant,Shannon Brown,Aaron Brooks,Carl Landry,David Andersen,Kyle Lowry,Trevor Ariza,2,11:05,LAL,shot,Andrew Bynum,,,,,,,,,Josh Powell,2,,,made,,jump,35,20
Andrew Bynum,Jordan Farmar,Josh Powell,Kobe Bryant,Shannon Brown,Aaron Brooks,Carl Landry,David Andersen,Kyle Lowry,Trevor Ariza,2,10:52,HOU,shot,,,,,,,,,,Trevor Ariza,2,,,made,,pullup jump,11,12
Andrew Bynum,Jordan Farmar,Josh Powell,Kobe Bryant,Shannon Brown,Aaron Brooks,Carl Landry,David Andersen,Kyle Lowry,Trevor Ariza,2,10:35,HOU,foul,,,,,,,,,,Kyle Lowry,,,,,,defense 3 second,,
Andrew Bynum,Jordan Farmar,Josh Powell,Kobe Bryant,Shannon Brown,Aaron Brooks,Carl Landry,David Andersen,Kyle Lowry,Trevor Ariza,2,10:35,LAL,free throw,,,,,,,1,,1,Kobe Bryant,,,technical,made,,,,
Andrew Bynum,Jordan Farmar,Josh Powell,Kobe Bryant,Shannon Brown,Aaron Brooks,Carl Landry,David Andersen,Kyle Lowry,Trevor Ariza,2,10:28,LAL,shot,,,,,,,,,,Kobe Bryant,,,,missed,,jump,8,16
Andrew Bynum,Jordan Farmar,Josh Powell,Kobe Bryant,Shannon Brown,Aaron Brooks,Carl Landry,David Andersen,Kyle Lowry,Trevor Ariza,2,10:27,HOU,rebound,,,,,,,,,,Kyle Lowry,,,,,,def,,
Andrew Bynum,Jordan Farmar,Josh Powell,Kobe Bryant,Shannon Brown,Aaron Brooks,Carl Landry,David Andersen,Kyle Lowry,Trevor Ariza,2,10:23,LAL,foul,,,,,,,,Kyle Lowry,,Jordan Farmar,,,,,,shooting,,
Andrew Bynum,Jordan Farmar,Josh Powell,Kobe Bryant,Shannon Brown,Aaron Brooks,Carl Landry,David Andersen,Kyle Lowry,Trevor Ariza,2,10:23,HOU,free throw,,,,,,,1,,2,Kyle Lowry,,,foul,made,,,,
Andrew Bynum,Jordan Farmar,Josh Powell,Kobe Bryant,Shannon Brown,Aaron Brooks,Carl Landry,David Andersen,Kyle Lowry,Shane Battier,2,10:23,HOU,sub,,,,Shane Battier,,Trevor Ariza,,,,,,,,,,,,
Andrew Bynum,Jordan Farmar,Josh Powell,Kobe Bryant,Shannon Brown,Aaron Brooks,Carl Landry,David Andersen,Kyle Lowry,Shane Battier,2,10:23,HOU,free throw,,,,,,,2,,2,Kyle Lowry,,,foul,missed,,,,
Andrew Bynum,Jordan Farmar,Josh Powell,Kobe Bryant,Shannon Brown,Aaron Brooks,Carl Landry,David Andersen,Kyle Lowry,Shane Battier,2,10:23,LAL,rebound,,,,,,,,,,Andrew Bynum,,,,,,def,,
Andrew Bynum,Jordan Farmar,Josh Powell,Kobe Bryant,Shannon Brown,Aaron Brooks,Carl Landry,David Andersen,Kyle Lowry,Shane Battier,2,10:01,LAL,shot,,,,,,,,,,Kobe Bryant,2,,,made,,turnaround bank,15,11
Andrew Bynum,Jordan Farmar,Josh Powell,Kobe Bryant,Shannon Brown,Aaron Brooks,Carl Landry,David Andersen,Kyle Lowry,Shane Battier,2,9:42,HOU,turnover,,,,,,,,,,Kyle Lowry,,,lost ball,,Jordan Farmar,,,
Andrew Bynum,Jordan Farmar,Josh Powell,Kobe Bryant,Shannon Brown,Aaron Brooks,Carl Landry,David Andersen,Kyle Lowry,Shane Battier,2,9:32,LAL,shot,,,,,,,,,,Josh Powell,,,,missed,,layup,25,6
Andrew Bynum,Jordan Farmar,Josh Powell,Kobe Bryant,Shannon Brown,Aaron Brooks,Carl Landry,David Andersen,Kyle Lowry,Shane Battier,2,9:31,LAL,rebound,,,,,,,,,,Andrew Bynum,,,,,,off,,
Andrew Bynum,Jordan Farmar,Josh Powell,Kobe Bryant,Shannon Brown,Aaron Brooks,Carl Landry,David Andersen,Kyle Lowry,Shane Battier,2,9:31,HOU,foul,,,,,,,,Andrew Bynum,,David Andersen,,,,,,shooting,,
Andrew Bynum,Jordan Farmar,Josh Powell,Kobe Bryant,Shannon Brown,Aaron Brooks,Carl Landry,David Andersen,Kyle Lowry,Shane Battier,2,9:31,LAL,free throw,,,,,,,1,,2,Andrew Bynum,,,foul,made,,,,
Andrew Bynum,Jordan Farmar,Josh Powell,Kobe Bryant,Shannon Brown,Aaron Brooks,Carl Landry,David Andersen,Kyle Lowry,Shane Battier,2,9:31,LAL,free throw,,,,,,,2,,2,Andrew Bynum,,,foul,made,,,,
Andrew Bynum,Jordan Farmar,Josh Powell,Kobe Bryant,Shannon Brown,Aaron Brooks,Carl Landry,David Andersen,Kyle Lowry,Shane Battier,2,9:23,HOU,turnover,,,,,,,,,,Aaron Brooks,,,bad pass,,Kobe Bryant,,,
Andrew Bynum,Jordan Farmar,Josh Powell,Kobe Bryant,Shannon Brown,Aaron Brooks,Carl Landry,David Andersen,Kyle Lowry,Shane Battier,2,9:15,LAL,shot,,,,,,,,,,Shannon Brown,,,,missed,,jump,12,20
Andrew Bynum,Jordan Farmar,Josh Powell,Kobe Bryant,Shannon Brown,Aaron Brooks,Carl Landry,David Andersen,Kyle Lowry,Shane Battier,2,9:13,HOU,rebound,,,,,,,,,,David Andersen,,,,,,def,,
Andrew Bynum,Jordan Farmar,Josh Powell,Kobe Bryant,Shannon Brown,Aaron Brooks,Carl Landry,David Andersen,Kyle Lowry,Shane Battier,2,9:01,HOU,shot,,,,,,,,,,David Andersen,,,,missed,,jump,14,24
Andrew Bynum,Jordan Farmar,Josh Powell,Kobe Bryant,Shannon Brown,Aaron Brooks,Carl Landry,David Andersen,Kyle Lowry,Shane Battier,2,9:00,LAL,rebound,,,,,,,,,,Shannon Brown,,,,,,def,,
Andrew Bynum,Jordan Farmar,Josh Powell,Kobe Bryant,Shannon Brown,Aaron Brooks,Carl Landry,David Andersen,Kyle Lowry,Shane Battier,2,8:42,LAL,shot,Andrew Bynum,,,,,,,,,Shannon Brown,2,,,made,,driving reverse layup,25,6